{"text_format":"1","workbook":"xlsx","n_sheets":21,"sheets":["MOD1","MOD2","MOD3","MOD4_1","MOD4_2","MOD4_3","MOD4_4","MOD4_5","MOD4_6","MOD6","MOD7","MOD8","MOD4_6_1","MOD4_6_2","MOD4_6_3","MOD4_6_4","MOD4_6_5","MOD4_6_6","MOD4_6_7","MOD4_6_8","LISTAS"],"not_rendered":{"charts":0,"images":8,"macros":1,"external_links":0,"defined_names":4,"comments":0,"pivot_tables":0},"unopened":[],"bounds":{"document_bytes":16777216,"sheet_cells":100000,"rows_first":2000,"rows_last":500,"rows_between":2000,"halvings":0,"cell_chars":16384,"cell_head_chars":4096},"cells_cut":0,"cells_raw":0,"read":"whole","date_system":"1900"}

{"sheet":"MOD1","index":0,"n_rows":49,"n_cols":51,"rows_kept":49,"cut":false,"hidden":false,"merged":[[45,12,46,13],[9,2,11,49],[33,18,34,48],[33,3,34,15],[38,3,39,48],[42,41,43,48],[45,2,46,3],[45,4,46,5],[45,6,46,7],[45,8,46,9],[45,10,46,11],[45,30,46,31],[45,32,46,33],[45,34,46,35],[45,14,46,15],[45,16,46,17],[45,18,46,19],[45,20,46,21],[45,22,46,23],[45,24,46,25],[45,48,46,49],[45,38,46,39],[45,40,46,41],[45,42,46,43],[45,44,46,45],[45,46,46,47],[45,36,46,37],[45,26,46,27],[45,28,46,29],[29,48,30,49],[14,48,15,49],[18,3,19,23],[18,26,19,38],[18,41,19,48],[23,41,24,48],[23,3,24,23],[23,26,24,38]]}
[]
[null,"Sistema de Monitoreo y Evaluación de la Educación Ambiental en la Gestión Escolar",null,null,null,null,null,null,null,null,null,null,null,null,null,null,null,null,null,null,null,null,null,null,null,null,null,null,null,null,null,null,null,null,null,null,null,null,null,null,null,null,null,null,null,null,null,null,null,null,"Versión de la Herramienta: 1.5"]
[null,null,null,null,null,null,null,null,null,null,{"$f":"IF(SUMIFS(#REF!,#REF!,$D$34,#REF!,$S$34,#REF!,$D$39)=0,\"\",LOOKUP(SUMIFS(#REF!,#REF!,$D$34,#REF!,$S$34,#REF!,$D$39),#REF!,#REF!))","v":{"$error":"#REF!"}}]
[null,null,null,null,null,null,null,null,null,null,"https://docs.google.com/spreadsheets/d/1CpoNSM5GNUHEw8OJeChbSiqABewzph87VF5k5CY4nUY/pubhtml"]
[null,null,null,null,null,null,null,null,null,null,"waffle"]
[]
[]
[]
[]
[null,null,"BIENVENIDO"]
[]
[]
[]
[]
[null,null,"Datos del director de la Institución Educativa:",null,null,null,null,null,null,null,null,null,null,null,null,null,null,null,null,null,null,null,null,null,null,null,null,null,null,null,null,null,null,null,null,null,null,null,null,null,null,null,null,null,null,null,null,null,{"$f":"IF(AND($D$19<>\"\",$AA$19<>\"\",$D$24<>\"\",$AA$24<>\"\"),CHAR(97),\"\")","v":""}]
[]
[]
[null,null,null,"Apellidos:",null,null,null,null,null,null,null,null,null,null,null,null,null,null,null,null,null,null,null,null,null,null,"Nombres:",null,null,null,null,null,null,null,null,null,null,null,null,null,null,"Teléfono personal:"]
[]
[]
[]
[]
[null,null,null,"Correo electrónico:",null,null,null,null,null,null,null,null,null,null,null,null,null,null,null,null,null,null,null,null,null,null,"Cargo que desempeña:",null,null,null,null,null,null,null,null,null,null,null,null,null,null,"Teléfono de la II.EE.:"]
[]
[]
[]
[]
[]
[]
[null,null,"Mi Institución Educativa está ubicada en...",null,null,null,null,null,null,null,null,null,null,null,null,null,null,null,null,null,null,null,null,null,null,null,null,null,null,null,null,null,null,null,null,null,null,null,null,null,null,null,null,null,null,null,null,null,{"$f":"IF(OR($D$34=\"\",$D$34=\"Seleccionar\",$S$34=\"\",$S$34=\"Seleccionar\",$D$39=\"\",$D$39=\"Seleccionar\"),\"\",CHAR(97))","v":""}]
[]
[]
[null,null,null,"El departamento de:",null,null,null,null,null,null,null,null,null,null,null,null,null,null,"La provincia de:"]
[null,null,null,"Seleccionar",null,null,null,null,null,null,null,null,null,null,null,null,null,null,"Seleccionar"]
[]
[]
[]
[null,null,null,"El distrito de:",null,null,null,null,{"$f":"LISTAS!D13","v":""}]
[null,null,null,"Seleccionar"]
[]
[]
[]
[null,null,null,{"$f":"IF(OR($D$34=\"\",$D$34=\"Seleccionar\",$S$34=\"Seleccionar\",$D$39=\"Seleccionar\"),\"Debe de llenar los campos solicitados para pasar a la siguiente fase.\",\"Todos los datos deben ser llenados y selecionados correctamente. No podrá volver a esta sección.\")","v":"Debe de llenar los campos solicitados para pasar a la siguiente fase."},null,null,null,null,null,null,null,null,null,null,null,null,null,null,null,null,null,null,null,null,null,null,null,null,null,null,null,null,null,null,null,null,null,null,null,null,null,{"$f":"IF(LISTAS!D15=TRUE,\"Siguiente\",\"\")","v":""}]
[]
[]
[null,null,"%",null,"&",null,"N",null,"O",null,"Y",null,"b",null,"h",null,"Š",null,"\u008f",null,"§",null,"¨",null,"þ",null,"H",null,"J",null,"M",null,"P",null,"Q",null,"z",null,"~",null,"á",null,"%",null,"&",null,"N",null,"O"]
[]
[]
[null,{"$f":"IF(VALUE(INFO(\"VERSION\"))<14,\"Probablemente la herramienta no pueda operar correctamente por ser una versión muy antigua de MS-Excel, comuníquese con Gestión de la Información!\",IF(ISERROR(CONCATENATE(\"Versión del Sistema Operativo: \",INFO(\"VERSIONSO\"),\",     Versión de MS-Excel: \",INFO(\"VERSION\"))),\"Probablemente la herramienta no pueda operar correctamente, comuníquese con Gestión de la Información!\",CONCATENATE(\"Versión del Sistema Operativo: \",INFO(\"VERSIONSO\"),\",     Versión de MS-Excel: \",INFO(\"VERSION\"))))","v":{"$error":"#VALUE!"}},null,null,null,null,null,null,null,null,null,null,null,null,null,null,null,null,null,null,null,null,null,null,null,null,null,null,null,null,null,null,null,null,null,null,null,null,null,null,null,null,null,null,null,null,null,null,null,null,{"$f":"IF($B$49=\"\",\"\",\"*Equipo de Gestión de la Información - EBR - Ministerio de Educación\")","v":{"$error":"#VALUE!"}}]

{"sheet":"MOD2","index":1,"n_rows":51,"n_cols":51,"rows_kept":51,"cut":false,"hidden":true,"merged":[[39,16,40,32],[39,33,40,37],[39,38,40,40],[39,41,40,42],[39,43,40,44],[39,45,40,46],[39,47,40,48],[37,33,38,37],[37,38,38,40],[37,41,38,42],[37,43,38,44],[37,45,38,46],[37,47,38,48],[35,16,36,32],[29,12,30,15],[17,26,18,48],[29,47,30,48],[23,33,24,37],[27,38,28,40],[27,41,28,42],[27,43,28,44],[27,45,28,46],[35,33,36,37],[35,38,36,40],[35,41,35,44],[35,45,35,48],[36,41,36,42],[36,43,36,44],[36,45,36,46],[36,47,36,48],[8,19,8,48],[12,35,13,48],[12,19,13,33],[17,19,18,24],[29,16,30,32],[29,38,30,40],[29,41,30,42],[29,43,30,44],[29,45,30,46],[12,3,13,17],[25,33,26,37],[27,33,28,37],[29,33,30,37],[27,16,28,32],[25,12,26,15],[27,12,28,15],[17,11,18,17],[17,3,18,9],[15,3,16,9],[15,11,16,17],[23,12,24,15],[23,3,24,11],[25,3,26,11],[27,3,28,11],[47,10,48,11],[47,20,48,21],[44,41,45,48],[27,47,28,48],[23,38,24,40],[23,41,23,44],[23,16,24,32],[23,45,23,48],[25,16,26,32],[25,38,26,40],[25,41,26,42],[25,43,26,44],[25,45,26,46],[25,47,26,48],[24,47,24,48],[24,45,24,46],[24,43,24,44],[24,41,24,42],[37,3,38,11],[37,12,38,15],[37,16,38,32],[29,3,30,11],[35,3,36,11],[35,12,36,15],[39,3,40,11],[39,12,40,15],[47,26,48,27],[47,28,48,29],[47,30,48,31],[47,32,48,33],[47,48,48,49],[47,36,48,37],[47,38,48,39],[47,40,48,41],[47,42,48,43],[47,44,48,45],[47,46,48,47],[47,34,48,35],[47,22,48,23],[47,24,48,25],[47,12,48,13],[47,14,48,15],[47,16,48,17],[47,18,48,19],[47,2,48,3],[47,4,48,5],[47,6,48,7],[47,8,48,9]]}
[]
[null,"Sistema de Monitoreo y Evaluación de la Educación Ambiental en la Gestión Escolar",null,null,null,null,null,null,null,null,null,null,null,null,null,null,null,null,null,null,null,null,null,null,null,null,null,null,null,null,null,null,null,null,null,null,null,null,null,null,null,null,null,null,null,null,null,null,null,null,{"$f":"IF('MOD1'!$AY$2=\"\",\"\",'MOD1'!$AY$2)","v":"Versión de la Herramienta: 1.5"}]
[]
[]
[]
[]
[]
[]
[null,null,"Datos adicionales de la Institución Educativa:",null,null,null,null,null,null,null,null,null,null,null,null,null,null,null,null,{"$f":"CLEAN(TRIM(CONCATENATE(UPPER('MOD1'!$AA$24),\": \",PROPER('MOD1'!$D$19),\" \",PROPER('MOD1'!$AA$19))))","v":":"}]
[]
[]
[null,null,null,"Nombre de DRE o UGEL que supervisa la IE:",null,null,null,null,null,null,null,null,null,null,null,null,null,null,null,"Apellidos y nombres del coodinador del comité ambiental de la IE:"]
[]
[]
[]
[null,null,null,"Cuenta con Plan de Salud Escolar:",null,null,null,null,null,null,null,"Usuario de Qali Warma:"]
[null,null,null,null,null,null,null,null,null,null,null,null,null,null,null,null,null,null,null,"Público/Privado:",null,null,null,null,null,null,"Dirección de la Institución Educativa:"]
[]
[]
[]
[]
[null,null,"Ingrese datos según corresponda:"]
[]
[null,null,null,"Nivel educativo",null,null,null,null,null,null,null,null,"Código Modular",null,null,null,"Nombre de Institución Educativa - ESCALE",null,null,null,null,null,null,null,null,null,null,null,null,null,null,null,null,"Modalidad educativa",null,null,null,null,"Zona",null,null,"Estudiantes",null,null,null,"Docentes"]
[null,null,null,null,null,null,null,null,null,null,null,null,null,null,null,null,null,null,null,null,null,null,null,null,null,null,null,null,null,null,null,null,null,null,null,null,null,null,null,null,null,"H",null,"M",null,"H",null,"M"]
[null,{"$f":"IF(Q26=\"\",\"\",1)","v":""},{"$f":"LISTAS!$D$26","v":""},null,null,null,null,null,null,null,null,null,null,null,null,null,{"$f":"IF(M26=\"\",\"\",IFERROR(VLOOKUP(VALUE(M26),LISTAS!BA:BB,2,FALSE),\"CODIGO MODULAR NO ENCONTRADO EN LA REGION\"))","v":""}]
[]
[null,{"$f":"IF(Q28=\"\",\"\",1)","v":""},{"$f":"LISTAS!$D$26","v":""},null,null,null,null,null,null,null,null,null,null,null,null,null,{"$f":"IF(M28=\"\",\"\",IFERROR(VLOOKUP(VALUE(M28),LISTAS!BA:BB,2,FALSE),\"CODIGO MODULAR NO ENCONTRADO EN LA REGION\"))","v":""}]
[]
[null,{"$f":"IF(Q30=\"\",\"\",1)","v":""},{"$f":"LISTAS!$D$26","v":""},null,null,null,null,null,null,null,null,null,null,null,null,null,{"$f":"IF(M30=\"\",\"\",IFERROR(VLOOKUP(VALUE(M30),LISTAS!BA:BB,2,FALSE),\"CODIGO MODULAR NO ENCONTRADO EN LA REGION\"))","v":""}]
[]
[]
[]
[null,null,"Si la IE no aparece registrada en el ESCALE, ingrese los datos en los siguientes recuadros:"]
[]
[null,null,null,"Nivel educativo",null,null,null,null,null,null,null,null,"Código Modular",null,null,null,"Nombre de Institución Educativa - ESCALE",null,null,null,null,null,null,null,null,null,null,null,null,null,null,null,null,"Modalidad educativa",null,null,null,null,"Zona",null,null,"Estudiantes",null,null,null,"Docentes"]
[null,null,null,null,null,null,null,null,null,null,null,null,null,null,null,null,null,null,null,null,null,null,null,null,null,null,null,null,null,null,null,null,null,null,null,null,null,null,null,null,null,"H",null,"M",null,"H",null,"M"]
[null,{"$f":"IF(Q38=\"\",\"\",1)","v":""},{"$f":"LISTAS!$D$26","v":""}]
[]
[null,{"$f":"IF(Q40=\"\",\"\",1)","v":""},{"$f":"LISTAS!$D$26","v":""}]
[]
[]
[]
[]
[null,null,null,{"$f":"IF(OR($D$13=\"\",$T$18=\"\",$AA$18=\"\",COUNTIF($M$26:$P$41,\"\")=5),\"Debe de llenar los campos solicitados para pasar a la siguiente fase.\",\"Todos los datos deben ser llenados y selecionados correctamente. No podrá volver a esta sección.\")","v":"Debe de llenar los campos solicitados para pasar a la siguiente fase."},null,null,null,null,null,null,null,null,null,null,null,null,null,null,null,null,null,null,null,null,null,null,null,null,null,null,null,null,null,null,null,null,null,null,null,null,null,{"$f":"IF(LISTAS!D28=TRUE,\"Siguiente\",\"\")","v":""}]
[]
[]
[null,null,"%",null,"&",null,"N",null,"O",null,"Y",null,"b",null,"h",null,"Š",null,"\u008f",null,"§",null,"¨",null,"þ",null,"H",null,"J",null,"M",null,"P",null,"Q",null,"z",null,"~",null,"á",null,"%",null,"&",null,"N",null,"O"]
[]
[]
[null,{"$f":"IF(VALUE(INFO(\"VERSION\"))<14,\"Probablemente la herramienta no pueda operar correctamente por ser una versión muy antigua de MS-Excel, comuníquese con Gestión de la Información!\",IF(ISERROR(CONCATENATE(\"Versión del Sistema Operativo: \",INFO(\"VERSIONSO\"),\",     Versión de MS-Excel: \",INFO(\"VERSION\"))),\"Probablemente la herramienta no pueda operar correctamente, comuníquese con Gestión de la Información!\",CONCATENATE(\"Versión del Sistema Operativo: \",INFO(\"VERSIONSO\"),\",     Versión de MS-Excel: \",INFO(\"VERSION\"))))","v":{"$error":"#VALUE!"}},null,null,null,null,null,null,null,null,null,null,null,null,null,null,null,null,null,null,null,null,null,null,null,null,null,null,null,null,null,null,null,null,null,null,null,null,null,null,null,null,null,null,null,null,null,null,null,null,{"$f":"IF('MOD1'!$AY$49=\"\",\"\",'MOD1'!$AY$49)","v":{"$error":"#VALUE!"}}]

{"sheet":"MOD3","index":2,"n_rows":52,"n_cols":51,"rows_kept":52,"cut":false,"hidden":true,"merged":[[45,41,46,48],[48,46,49,47],[48,48,49,49],[48,40,49,41],[48,42,49,43],[48,44,49,45],[48,2,49,3],[48,4,49,5],[48,6,49,7],[48,8,49,9],[48,24,49,25],[48,12,49,13],[48,14,49,15],[48,10,49,11],[48,38,49,39],[48,16,49,17],[48,18,49,19],[48,20,49,21],[48,22,49,23],[48,26,49,27],[48,28,49,29],[48,30,49,31],[48,32,49,33],[48,34,49,35],[48,36,49,37],[14,3,25,16],[26,19,27,30],[26,35,27,46],[26,47,27,48],[8,2,9,49],[10,3,12,48],[14,35,25,48],[14,19,25,32],[26,31,27,32],[42,35,43,46],[42,47,43,48],[26,15,27,16],[42,19,43,30],[42,31,43,32],[30,19,41,32],[30,3,41,16],[26,3,27,14],[30,35,41,48],[42,3,43,14],[42,15,43,16]]}
[0]
[{"$f":"LISTAS!D110","v":false},"Sistema de Monitoreo y Evaluación de la Educación Ambiental en la Gestión Escolar",null,null,null,null,null,null,null,null,null,null,null,null,null,null,null,null,null,null,null,null,null,null,null,null,null,null,null,null,null,null,null,null,null,null,null,null,null,null,null,null,null,null,null,null,null,null,null,null,{"$f":"IF('MOD1'!$AY$2=\"\",\"\",'MOD1'!$AY$2)","v":"Versión de la Herramienta: 1.5"}]
[]
[]
[]
[]
[]
[]
[null,null,"MATRIZ DE LOGROS AMBIENTALES"]
[]
[null,null,null,"La Matriz de Logros Ambientales es la herramienta de monitoreo, evaluación y reconocimiento de la aplicación del enfoque ambiental que a nivel de las II.EE. permite estimar el nivel de logro alcanzado en la aplicación transversal del enfoque ambiental en la gestión escolar."]
[]
[]
[]
[null,null,1,"Gestión escolar",null,null,null,null,null,null,null,null,null,null,null,null,null,null,2,"Educación para el \ncambio climático",null,null,null,null,null,null,null,null,null,null,null,null,null,null,3,"Educación en ecoeficiencia"]
[]
[]
[]
[]
[]
[]
[]
[]
[]
[]
[]
[null,null,null,{"$f":"REPT(CHAR(73),ROUNDDOWN(72*(COUNTIF(LISTAS!A:A,1)-COUNTIFS(LISTAS!A:A,1,LISTAS!D:D,\"\"))/COUNTIF(LISTAS!A:A,1),0))","v":""},null,null,null,null,null,null,null,null,null,null,null,{"$f":"IF(LISTAS!D45=TRUE,\"a\",\"\")","v":""},null,null,null,{"$f":"REPT(CHAR(73),ROUNDDOWN(72*(COUNTIF(LISTAS!A:A,2)-COUNTIFS(LISTAS!A:A,2,LISTAS!D:D,\"\"))/COUNTIF(LISTAS!A:A,2),0))","v":""},null,null,null,null,null,null,null,null,null,null,null,{"$f":"IF(LISTAS!D51=TRUE,\"a\",\"\")","v":""},null,null,null,{"$f":"REPT(CHAR(73),ROUNDDOWN(72*72*(COUNTIF(LISTAS!A:A,3)-COUNTIFS(LISTAS!A:A,3,LISTAS!D:D,\"\"))/COUNTIF(LISTAS!A:A,3),0))","v":""},null,null,null,null,null,null,null,null,null,null,null,{"$f":"IF(LISTAS!D72=TRUE,\"a\",\"\")","v":""}]
[]
[]
[]
[null,null,4,"Educación en salud",null,null,null,null,null,null,null,null,null,null,null,null,null,null,5,"Gestión del riesgo",null,null,null,null,null,null,null,null,null,null,null,null,null,null,6,"Proyectos educativos \nambientales integrales"]
[]
[]
[]
[]
[]
[]
[]
[]
[]
[]
[]
[null,null,null,{"$f":"REPT(CHAR(73),ROUNDDOWN(72*72*(COUNTIF(LISTAS!A:A,4)-COUNTIFS(LISTAS!A:A,4,LISTAS!D:D,\"\"))/COUNTIF(LISTAS!A:A,4),0))","v":""},null,null,null,null,null,null,null,null,null,null,null,{"$f":"IF(LISTAS!D103=TRUE,\"a\",\"\")","v":""},null,null,null,{"$f":"REPT(CHAR(73),ROUNDDOWN(72*72*(COUNTIF(LISTAS!A:A,5)-COUNTIFS(LISTAS!A:A,5,LISTAS!D:D,\"\"))/COUNTIF(LISTAS!A:A,5),0))","v":""},null,null,null,null,null,null,null,null,null,null,null,{"$f":"IF(LISTAS!D109=TRUE,\"a\",\"\")","v":""},null,null,null,{"$f":"REPT(CHAR(73),ROUNDDOWN(72*(COUNTIF(LISTAS!A:A,6)-COUNTIFS(LISTAS!A:A,6,LISTAS!D:D,\"\")+COUNTIFS(LISTAS!A:A,\"PEAI\",LISTAS!D:D,\"\")*4)/COUNTIF(LISTAS!A:A,6),0))","v":""},null,null,null,null,null,null,null,null,null,null,null,{"$f":"IF(LISTAS!D164=TRUE,IF(LISTAS!D165=FALSE,\"a\",\"\"),\"\")","v":""}]
[]
[]
[null,null,null,null,null,null,null,null,null,null,null,null,null,null,null,null,null,null,null,null,null,null,null,null,null,null,null,null,null,null,null,null,null,null,null,null,null,null,null,null,null,{"$f":"IF(LISTAS!D110=TRUE,\"Enviar Data\",\"\")","v":""}]
[null,null,null,"Debe de llenar los campos solicitados para realizar el envio de los datos."]
[]
[null,null,"%",null,"&",null,"N",null,"O",null,"Y",null,"b",null,"h",null,"Š",null,"\u008f",null,"§",null,"¨",null,"þ",null,"H",null,"J",null,"M",null,"P",null,"Q",null,"z",null,"~",null,"á",null,"%",null,"&",null,"N",null,"O"]
[]
[]
[null,{"$f":"IF(VALUE(INFO(\"VERSION\"))<14,\"Probablemente la herramienta no pueda operar correctamente por ser una versión muy antigua de MS-Excel, comuníquese con Gestión de la Información!\",IF(ISERROR(CONCATENATE(\"Versión del Sistema Operativo: \",INFO(\"VERSIONSO\"),\",     Versión de MS-Excel: \",INFO(\"VERSION\"))),\"Probablemente la herramienta no pueda operar correctamente, comuníquese con Gestión de la Información!\",CONCATENATE(\"Versión del Sistema Operativo: \",INFO(\"VERSIONSO\"),\",     Versión de MS-Excel: \",INFO(\"VERSION\"))))","v":{"$error":"#VALUE!"}},null,null,null,null,null,null,null,null,null,null,null,null,null,null,null,null,null,null,null,null,null,null,null,null,null,null,null,null,null,null,null,null,null,null,null,null,null,null,null,null,null,null,null,null,null,null,null,null,{"$f":"IF('MOD1'!$AY$49=\"\",\"\",'MOD1'!$AY$49)","v":{"$error":"#VALUE!"}}]

{"sheet":"MOD4_1","index":3,"n_rows":64,"n_cols":51,"rows_kept":64,"cut":false,"hidden":true,"merged":[[8,2,9,49],[60,6,61,7],[60,8,61,9],[60,10,61,11],[60,12,61,13],[60,14,61,15],[12,2,21,6],[60,48,61,49],[60,26,61,27],[60,28,61,29],[60,40,61,41],[60,42,61,43],[60,16,61,17],[60,2,61,3],[60,4,61,5],[10,41,11,49],[10,2,11,6],[11,7,11,13],[11,14,11,20],[11,21,11,27],[10,7,10,34],[11,28,11,34],[10,35,11,40],[35,7,36,13],[20,14,21,20],[22,7,25,13],[22,14,25,20],[27,7,34,13],[27,14,34,20],[35,21,36,27],[12,14,19,20],[22,21,25,27],[42,35,55,40],[42,41,51,49],[52,41,55,49],[57,29,58,30],[57,32,58,36],[57,44,58,48],[42,28,49,34],[60,24,61,25],[12,21,19,27],[20,21,21,27],[27,21,34,27],[37,21,40,27],[57,3,58,28],[22,2,25,6],[27,2,36,6],[42,2,51,6],[42,7,49,13],[42,14,49,20],[12,7,19,13],[20,7,21,13],[12,28,19,34],[20,28,21,34],[37,2,40,6],[60,44,61,45],[57,38,58,42],[60,46,61,47],[52,2,55,6],[52,7,55,13],[52,14,55,20],[52,21,55,27],[52,28,55,34],[60,36,61,37],[60,38,61,39],[60,30,61,31],[60,20,61,21],[60,32,61,33],[60,34,61,35],[60,22,61,23],[60,18,61,19],[37,7,40,13],[37,28,40,34],[37,41,40,49],[22,41,25,49],[12,35,25,40],[27,35,40,40],[27,41,36,49],[22,28,25,34],[12,41,21,49],[27,28,34,34],[35,28,36,34],[37,14,40,20],[35,14,36,20],[50,7,51,13],[50,14,51,20],[50,21,51,27],[50,28,51,34],[42,21,49,27]]}
[0]
[null,"Sistema de Monitoreo y Evaluación de la Educación Ambiental en la Gestión Escolar",null,null,null,null,null,null,null,null,null,null,null,null,null,null,null,null,null,null,null,null,null,null,null,null,null,null,null,null,null,null,null,null,null,null,null,null,null,null,null,null,null,null,null,null,null,null,null,null,{"$f":"IF('MOD1'!$AY$2=\"\",\"\",'MOD1'!$AY$2)","v":"Versión de la Herramienta: 1.5"}]
[]
[]
[]
[]
[]
[]
[null,null,"Gestión Escolar: Gestión Institucional y Gestión Pedagógica"]
[]
[null,null,"Actividades ambientales",null,null,null,null,"Hitos de aplicación del enfoque ambiental",null,null,null,null,null,null,null,null,null,null,null,null,null,null,null,null,null,null,null,null,null,null,null,null,null,null,null,"Indicador",null,null,null,null,null,"Aspectos que la IIEE llegara a este logro, así como dificultades"]
[null,null,null,null,null,null,null,"A",null,null,null,null,null,null,"B",null,null,null,null,null,null,"C",null,null,null,null,null,null,"D"]
[null,null,{"$f":"LISTAS!AJ2","v":"1. La I.E. cuenta con un Comité Ambiental reconocido e institucionalizado."},null,null,null,null,{"$f":"LISTAS!AK2","v":"El Comité Ambiental y sus comisiones, fueron reconocidos mediante Resolución directoral. "},null,null,null,null,null,null,{"$f":"LISTAS!AL2","v":"Las actividades del Comité Ambiental y sus comisiones están incluidas en el PAT."},null,null,null,null,null,null,{"$f":"LISTAS!AM2","v":"El Comité Ambiental cumplió con la cuota de género y/o interculturalidad (mínimo 30%) en su conformación, según corresponda. "},null,null,null,null,null,null,{"$f":"LISTAS!AN2","v":"El Comité Ambiental está conformado al menos por un (01) representante de la comunidad local (de instituciones privadas, públicas, organizaciones sociales, líderes y otros)."},null,null,null,null,null,null,{"$f":"LISTAS!AO2","v":"N° de hitos de aplicación del enfoque ambiental puestos en práctica en la institucionalización del Comité Ambiental. "}]
[]
[]
[]
[]
[]
[]
[]
[]
[]
[null,null,"Medios de verificación",null,null,null,null,{"$f":"LISTAS!AP2","v":"Resolución Directoral de conformación del Comité Ambiental."},null,null,null,null,null,null,{"$f":"LISTAS!AQ2","v":"Plan de Trabajo del Comité. PAT."},null,null,null,null,null,null,{"$f":"LISTAS!AR2","v":"Resolución Directoral de conformación del Comité Ambiental."},null,null,null,null,null,null,{"$f":"LISTAS!AS2","v":"Resolución Directoral de conformación del Comité Ambiental."}]
[]
[]
[]
[]
[null,null,{"$f":"LISTAS!AJ3","v":"2. La I.E. actualizó y/o elaboró sus herramientas de gestión escolar con enfoque ambiental."},null,null,null,null,{"$f":"LISTAS!AK3","v":"La I.E. incluyó en el PEI, en el análisis situacional, su situación ambiental y vincula el diagnóstico al enfoque ambiental en la gestión escolar."},null,null,null,null,null,null,{"$f":"LISTAS!AL3","v":"El PEI de la I.E incorporó el enfoque ambiental en su visión y en los objetivos y/o metas de gestión escolar centrada en los aprendizajes. "},null,null,null,null,null,null,{"$f":"LISTAS!AM3","v":"La I.E. incorporó en el PAT las actividades ambientales estandarizadas consideradas en la presente matriz."},null,null,null,null,null,null,{"$f":"LISTAS!AN3","v":"La I.E. incorporó en su Reglamento Interno al Comité Ambiental."},null,null,null,null,null,null,{"$f":"LISTAS!AO3","v":"N° de hitos de aplicación del enfoque ambiental puestos en práctica en la formulación de herramientas de gestión escolar."}]
[]
[]
[]
[]
[]
[]
[]
[]
[]
[null,null,"Medios de verificación",null,null,null,null,{"$f":"LISTAS!AP3","v":"PEI."},null,null,null,null,null,null,{"$f":"LISTAS!AQ3","v":"PEI."},null,null,null,null,null,null,{"$f":"LISTAS!AR3","v":"PAT."},null,null,null,null,null,null,{"$f":"LISTAS!AS3","v":"RI."},null,null,null,null,null,null,null,null,null,null,null,null,""]
[]
[]
[]
[]
[null,null,{"$f":"LISTAS!AJ4","v":"3. La I.E. incluyó en el PCI el enfoque ambiental y empleó recursos pedagógicos ambientales propios de la localidad."},null,null,null,null,{"$f":"LISTAS!AK4","v":"El PCI incluyó el enfoque ambiental en los perfiles, los principios pedagógicos, los propósitos, y/o los enfoques metodológicos."},null,null,null,null,null,null,{"$f":"LISTAS!AL4","v":"La I.E. incluyó el enfoque ambiental en la programación curricular anual y unidades didácticas (en las situaciones significativas)."},null,null,null,null,null,null,{"$f":"LISTAS!AM4","v":"La I.E. incluyó en las sesiones de aprendizaje las actividades del calendario ambiental nacional, local y/o comunal, así como los saberes y conocimientos ambientales locales."},null,null,null,null,null,null,{"$f":"LISTAS!AN4","v":"La I.E. incluyó en las sesiones de aprendizaje visitas pedagógicas a espacios naturales y culturales (áreas naturales protegidas, rutas de ecoturismo, proyectos de conservación, bosques comunitarios, playas locales, etc.)."},null,null,null,null,null,null,{"$f":"LISTAS!AO4","v":"N° de hitos de aplicación del enfoque ambiental incluidos en los procesos de aprendizaje. "}]
[]
[]
[]
[]
[]
[]
[]
[]
[]
[null,null,"Medios de verificación",null,null,null,null,{"$f":"LISTAS!AP4","v":"PCI."},null,null,null,null,null,null,{"$f":"LISTAS!AQ4","v":"Programa Curricular Anual."},null,null,null,null,null,null,{"$f":"LISTAS!AR4","v":"Programa Curricular Anual."},null,null,null,null,null,null,{"$f":"LISTAS!AS4","v":"Programa Curricular Anual. Documentos de autorización de visitas y excursiones pedagógicas para el aprendizaje vivencial del enfoque ambiental."},null,null,null,null,null,null,null,null,null,null,null,null,""]
[]
[]
[]
[]
[null,null,null,{"$f":"REPT(CHAR(73),15*(COUNTIF(H21:AI22,\"*\")+COUNTIF(H36:AI37,\"*\")+COUNTIF(H51:AI52,\"*\")))","v":""},null,null,null,null,null,null,null,null,null,null,null,null,null,null,null,null,null,null,null,null,null,null,null,null,null,{"$f":"IF(LISTAS!D45=TRUE,\"a\",\"\")","v":""},null,null,{"$f":"IF(LISTAS!D45=TRUE,\"Anterior\",\"\")","v":""},null,null,null,null,null,{"$f":"\"Matriz\"","v":"Matriz"},null,null,null,null,null,{"$f":"IF(LISTAS!D45=TRUE,\"Siguiente\",\"\")","v":""}]
[]
[]
[null,null,"%",null,"&",null,"N",null,"O",null,"Y",null,"b",null,"h",null,"Š",null,"\u008f",null,"§",null,"¨",null,"þ",null,"H",null,"J",null,"M",null,"P",null,"Q",null,"z",null,"~",null,"á",null,"%",null,"&",null,"N",null,"O"]
[]
[]
[null,{"$f":"IF(VALUE(INFO(\"VERSION\"))<14,\"Probablemente la herramienta no pueda operar correctamente por ser una versión muy antigua de MS-Excel, comuníquese con Gestión de la Información!\",IF(ISERROR(CONCATENATE(\"Versión del Sistema Operativo: \",INFO(\"VERSIONSO\"),\",     Versión de MS-Excel: \",INFO(\"VERSION\"))),\"Probablemente la herramienta no pueda operar correctamente, comuníquese con Gestión de la Información!\",CONCATENATE(\"Versión del Sistema Operativo: \",INFO(\"VERSIONSO\"),\",     Versión de MS-Excel: \",INFO(\"VERSION\"))))","v":{"$error":"#VALUE!"}},null,null,null,null,null,null,null,null,null,null,null,null,null,null,null,null,null,null,null,null,null,null,null,null,null,null,null,null,null,null,null,null,null,null,null,null,null,null,null,null,null,null,null,null,null,null,null,null,{"$f":"IF('MOD1'!$AY$49=\"\",\"\",'MOD1'!$AY$49)","v":{"$error":"#VALUE!"}}]

{"sheet":"MOD4_2","index":4,"n_rows":49,"n_cols":51,"rows_kept":49,"cut":false,"hidden":true,"merged":[[8,2,9,49],[10,2,11,6],[10,7,10,34],[10,35,11,40],[10,41,11,49],[11,7,11,13],[11,14,11,20],[11,21,11,27],[11,28,11,34],[12,2,21,6],[12,7,19,13],[12,14,19,20],[12,21,19,27],[12,28,19,34],[22,2,25,6],[22,7,25,13],[22,14,25,20],[22,21,25,27],[22,28,25,34],[22,41,25,49],[12,41,21,49],[20,7,21,13],[20,14,21,20],[20,21,21,27],[20,28,21,34],[12,35,25,40],[42,29,43,30],[42,3,43,28],[42,32,43,36],[42,38,43,42],[42,44,43,48],[45,24,46,25],[45,2,46,3],[45,4,46,5],[45,6,46,7],[45,8,46,9],[45,10,46,11],[45,12,46,13],[45,14,46,15],[45,16,46,17],[45,18,46,19],[45,20,46,21],[45,22,46,23],[45,48,46,49],[45,26,46,27],[45,28,46,29],[45,30,46,31],[45,32,46,33],[45,34,46,35],[45,36,46,37],[45,38,46,39],[45,40,46,41],[45,42,46,43],[45,44,46,45],[45,46,46,47]]}
[0]
[null,"Sistema de Monitoreo y Evaluación de la Educación Ambiental en la Gestión Escolar",null,null,null,null,null,null,null,null,null,null,null,null,null,null,null,null,null,null,null,null,null,null,null,null,null,null,null,null,null,null,null,null,null,null,null,null,null,null,null,null,null,null,null,null,null,null,null,null,{"$f":"IF('MOD1'!$AY$2=\"\",\"\",'MOD1'!$AY$2)","v":"Versión de la Herramienta: 1.5"}]
[]
[]
[]
[]
[]
[]
[null,null,"Cambio climático"]
[]
[null,null,"Actividades ambientales",null,null,null,null,"Hitos de aplicación del enfoque ambiental",null,null,null,null,null,null,null,null,null,null,null,null,null,null,null,null,null,null,null,null,null,null,null,null,null,null,null,"Indicador",null,null,null,null,null,"Aspectos que la IIEE llegara a este logro, así como dificultades"]
[null,null,null,null,null,null,null,"A",null,null,null,null,null,null,"B",null,null,null,null,null,null,"C",null,null,null,null,null,null,"D"]
[null,null,{"$f":"LISTAS!AJ5","v":"4. La I.E. realizó actividades de mitigación y adaptación frente al Cambio climático."},null,null,null,null,{"$f":"LISTAS!AK5","v":"La I.E. implementó actividades de recuperación de espacios en desuso, incremento y/o mantenimiento de áreas verdes dentro de la I.E., en el marco de la condición de cambio climático. "},null,null,null,null,null,null,{"$f":"LISTAS!AL5","v":"La I.E. implementó actividades pedagógicas de valoración y conservación de la diversidad biológica (flora y fauna, terrestre y acuática) y de los servicios ecosistémicos (lo servicios que el ambiente nos brinda), en el marco de la condición de cambio climático. "},null,null,null,null,null,null,{"$f":"LISTAS!AM5","v":" La I.E. implementó actividades pedagógicas de promoción de la producción y consumo responsables (valoración de prácticas compatibles con el cuidado del ambiente y los recursos naturales), en el marco de la condición de cambio climático. "},null,null,null,null,null,null,{"$f":"LISTAS!AN5","v":"La I.E. implementó actividades a favor de la recuperación y/o mantenimiento de espacios públicos y áreas verdes aledañas a la I.E. y en la comunidad local (jornadas de limpieza, el abono y/o sembrado de árboles, otras actividades), en el marco de la condición de cambio climático. "},null,null,null,null,null,null,{"$f":"LISTAS!AO5","v":"N° de hitos de aplicación del enfoque ambiental puestos en práctica para la mitigación y adaptación frente al Cambio climático."}]
[]
[]
[]
[]
[]
[]
[]
[]
[]
[null,null,"Medios de verificación",null,null,null,null,{"$f":"LISTAS!AP5","v":"PCI. PAT."},null,null,null,null,null,null,{"$f":"LISTAS!AQ5","v":"PCI."},null,null,null,null,null,null,{"$f":"LISTAS!AR5","v":"PCI."},null,null,null,null,null,null,{"$f":"LISTAS!AS5","v":"PCI. PAT."},null,null,null,null,null,null,null,null,null,null,null,null,""]
[]
[]
[]
[]
[]
[]
[]
[]
[]
[]
[]
[]
[]
[]
[]
[]
[]
[]
[]
[null,null,null,{"$f":"REPT(CHAR(73),42*(COUNTIF(H21:AI22,\"*\")))","v":""},null,null,null,null,null,null,null,null,null,null,null,null,null,null,null,null,null,null,null,null,null,null,null,null,null,{"$f":"IF(COUNTIF(H21:AI22,\"*\")=4,\"a\",\"\")","v":""},null,null,{"$f":"IF(LISTAS!D51=TRUE,\"Anterior\",\"\")","v":""},null,null,null,null,null,{"$f":"\"Matriz\"","v":"Matriz"},null,null,null,null,null,{"$f":"IF(LISTAS!D51=TRUE,\"Siguiente\",\"\")","v":""}]
[]
[]
[null,null,"%",null,"&",null,"N",null,"O",null,"Y",null,"b",null,"h",null,"Š",null,"\u008f",null,"§",null,"¨",null,"þ",null,"H",null,"J",null,"M",null,"P",null,"Q",null,"z",null,"~",null,"á",null,"%",null,"&",null,"N",null,"O"]
[]
[]
[null,{"$f":"IF(VALUE(INFO(\"VERSION\"))<14,\"Probablemente la herramienta no pueda operar correctamente por ser una versión muy antigua de MS-Excel, comuníquese con Gestión de la Información!\",IF(ISERROR(CONCATENATE(\"Versión del Sistema Operativo: \",INFO(\"VERSIONSO\"),\",     Versión de MS-Excel: \",INFO(\"VERSION\"))),\"Probablemente la herramienta no pueda operar correctamente, comuníquese con Gestión de la Información!\",CONCATENATE(\"Versión del Sistema Operativo: \",INFO(\"VERSIONSO\"),\",     Versión de MS-Excel: \",INFO(\"VERSION\"))))","v":{"$error":"#VALUE!"}},null,null,null,null,null,null,null,null,null,null,null,null,null,null,null,null,null,null,null,null,null,null,null,null,null,null,null,null,null,null,null,null,null,null,null,null,null,null,null,null,null,null,null,null,null,null,null,null,{"$f":"IF('MOD1'!$AY$49=\"\",\"\",'MOD1'!$AY$49)","v":{"$error":"#VALUE!"}}]

{"sheet":"MOD4_3","index":5,"n_rows":79,"n_cols":51,"rows_kept":79,"cut":false,"hidden":true,"merged":[[8,2,9,49],[10,2,11,6],[10,7,10,34],[10,35,11,40],[10,41,11,49],[11,7,11,13],[11,14,11,20],[11,21,11,27],[11,28,11,34],[12,41,21,49],[20,7,21,13],[20,14,21,20],[20,21,21,27],[20,28,21,34],[22,2,25,6],[22,7,25,13],[22,14,25,20],[22,21,25,27],[22,28,25,34],[12,2,21,6],[12,7,19,13],[12,14,19,20],[12,21,19,27],[12,28,19,34],[12,35,25,40],[35,21,36,27],[35,28,36,34],[37,2,40,6],[37,7,40,13],[37,14,40,20],[37,21,40,27],[37,28,40,34],[22,41,25,49],[27,2,36,6],[27,7,34,13],[27,14,34,20],[27,21,34,27],[27,28,34,34],[27,35,40,40],[27,41,36,49],[35,7,36,13],[35,14,36,20],[37,41,40,49],[72,29,73,30],[72,3,73,28],[72,32,73,36],[72,38,73,42],[72,44,73,48],[42,2,51,6],[42,7,49,13],[42,14,49,20],[42,21,49,27],[52,2,55,6],[52,7,55,13],[52,14,55,20],[52,21,55,27],[52,28,55,34],[52,41,55,49],[42,28,49,34],[42,35,55,40],[42,41,51,49],[50,7,51,13],[50,14,51,20],[50,21,51,27],[50,28,51,34],[67,41,70,49],[57,41,66,49],[75,14,76,15],[75,16,76,17],[75,18,76,19],[75,20,76,21],[75,22,76,23],[75,24,76,25],[75,2,76,3],[75,4,76,5],[75,6,76,7],[75,8,76,9],[75,10,76,11],[75,12,76,13],[75,38,76,39],[75,40,76,41],[75,42,76,43],[75,44,76,45],[75,46,76,47],[75,48,76,49],[75,26,76,27],[75,28,76,29],[75,30,76,31],[75,32,76,33],[75,34,76,35],[75,36,76,37],[57,35,70,40],[65,7,66,13],[65,14,66,20],[65,21,66,27],[65,28,66,34],[67,2,70,6],[67,7,70,13],[67,14,70,20],[67,21,70,27],[67,28,70,34],[57,2,66,6],[57,7,64,13],[57,14,64,20],[57,21,64,27],[57,28,64,34]]}
[0]
[null,"Sistema de Monitoreo y Evaluación de la Educación Ambiental en la Gestión Escolar",null,null,null,null,null,null,null,null,null,null,null,null,null,null,null,null,null,null,null,null,null,null,null,null,null,null,null,null,null,null,null,null,null,null,null,null,null,null,null,null,null,null,null,null,null,null,null,null,{"$f":"IF('MOD1'!$AY$2=\"\",\"\",'MOD1'!$AY$2)","v":"Versión de la Herramienta: 1.5"}]
[]
[]
[]
[]
[]
[]
[null,null,"Ecoeficiencia"]
[]
[null,null,"Actividades ambientales",null,null,null,null,"Hitos de aplicación del enfoque ambiental",null,null,null,null,null,null,null,null,null,null,null,null,null,null,null,null,null,null,null,null,null,null,null,null,null,null,null,"Indicador",null,null,null,null,null,"Aspectos que la IIEE llegara a este logro, así como dificultades"]
[null,null,null,null,null,null,null,"A",null,null,null,null,null,null,"B",null,null,null,null,null,null,"C",null,null,null,null,null,null,"D"]
[null,null,{"$f":"LISTAS!AJ6","v":"5. La I.E. realizó actividades de manejo de residuos sólidos. "},null,null,null,null,{"$f":"LISTAS!AK6","v":"La I.E. cuenta con un Plan de manejo de residuos sólidos, y actividades de las \"3R\" (Reducir, Reusar y Reciclar) incluidos en el PAT."},null,null,null,null,null,null,{"$f":"LISTAS!AL6","v":"La I.E. implementó actividades pedagógicas  sobre el manejo de residuos sólidos y la aplicación de las “3R”: Reducir, Reusar y Reciclar."},null,null,null,null,null,null,{"$f":"LISTAS!AM6","v":"La I.E. coordinó con el gobierno local u otras instituciones aliadas la recolección y transporte de los residuos para la disposición final de los residuos sólidos de la I.E., y/o el reaprovechamiento y comercialización.  "},null,null,null,null,null,null,{"$f":"LISTAS!AN6","v":"La I.E. sensibilizó  a las familias de la comunidad educativa y/o comunidad local  sobre el manejo de residuos sólidos y en actividades de las 3R: Reducir, Reusar y Reciclar."},null,null,null,null,null,null,{"$f":"LISTAS!AO6","v":"N° de hitos de aplicación del enfoque ambiental puestos en práctica en el manejo de residuos sólidos."}]
[]
[]
[]
[]
[]
[]
[]
[]
[]
[null,null,{"$f":"IF($C$13=\"\",\"\",\"Medios de verificación\")","v":"Medios de verificación"},null,null,null,null,{"$f":"LISTAS!AP6","v":"Plan de Manejo de Residuos Sólidos. PAT."},null,null,null,null,null,null,{"$f":"LISTAS!AQ6","v":"PCI."},null,null,null,null,null,null,{"$f":"LISTAS!AR6","v":"Cartas u oficios de coordinación del Gobierno regional u otros aliados. PAT."},null,null,null,null,null,null,{"$f":"LISTAS!AS6","v":"PAT. Documentos administrativos: Cartas, Oficios, Memo. Lista de Asistencia."}]
[]
[]
[]
[]
[null,null,{"$f":"LISTAS!AJ7","v":"6. La I.E. practicó el uso ecoeficiente de la energía."},null,null,null,null,{"$f":"LISTAS!AK7","v":"La I.E. ha adoptado medidas de uso ecoeficiente de la energía incluidos en el PAT. "},null,null,null,null,null,null,{"$f":"LISTAS!AL7","v":"La I.E. implementó actividades pedagógicas  sobre el consumo responsable de la energía, así como prácticas ecoeficientes asociadas (uso de focos ahorradores, entre otros)."},null,null,null,null,null,null,{"$f":"LISTAS!AM7","v":"La I.E.  implementó actividades pedagógicas sobre la importancia del uso de medios de transporte menos nocivos para el ambiente (por ejemplo, transporte público compartido, bicicletas, caminatas, etc.)."},null,null,null,null,null,null,{"$f":"LISTAS!AN7","v":"La I.E. sensibilizó a las familias de la comunidad educativa y/o comunidad local para el uso ecoeficiente de la energía."},null,null,null,null,null,null,{"$f":"LISTAS!AO7","v":"N° de hitos de aplicación del enfoque ambiental puestos en práctica en el uso ecoeficiente de la energía."}]
[]
[]
[]
[]
[]
[]
[]
[]
[]
[null,null,{"$f":"IF($C$28=\"\",\"\",\"Medios de verificación\")","v":"Medios de verificación"},null,null,null,null,{"$f":"LISTAS!AP7","v":"PAT."},null,null,null,null,null,null,{"$f":"LISTAS!AQ7","v":"PCI."},null,null,null,null,null,null,{"$f":"LISTAS!AR7","v":"PCI."},null,null,null,null,null,null,{"$f":"LISTAS!AS7","v":"PAT. Documentos administrativos: Cartas, Oficios, Memo. Lista de Asistencia."}]
[]
[]
[]
[]
[null,null,{"$f":"LISTAS!AJ8","v":"7. La I.E. practicó el empleo de energía renovable."},null,null,null,null,{"$f":"LISTAS!AK8","v":"La I.E. ha incluido medidas sobre el empleo de energía renovable en el PAT. "},null,null,null,null,null,null,{"$f":"LISTAS!AL8","v":"La I.E. implementó actividades pedagógicas  sobre el uso de energía renovable, de acuerdo a su contexto. "},null,null,null,null,null,null,{"$f":"LISTAS!AM8","v":"La I.E. implementó actividades institucionales sobre el uso de la energía renovable (por ejemplo paneles solares), de acuerdo a su contexto.  "},null,null,null,null,null,null,{"$f":"LISTAS!AN8","v":"La I.E. sensibilizó a las familias de la comunidad educativa y/o comunidad local para el empleo de energía renovable."},null,null,null,null,null,null,{"$f":"LISTAS!AO8","v":"N° de hitos de aplicación del enfoque ambiental puestos en práctica en el empleo de energía renovable."}]
[]
[]
[]
[]
[]
[]
[]
[]
[]
[null,null,{"$f":"IF($C$28=\"\",\"\",\"Medios de verificación\")","v":"Medios de verificación"},null,null,null,null,{"$f":"LISTAS!AP8","v":"PCI. PAT."},null,null,null,null,null,null,{"$f":"LISTAS!AQ8","v":"PCI. PAT."},null,null,null,null,null,null,{"$f":"LISTAS!AR8","v":"PCI. PAT."},null,null,null,null,null,null,{"$f":"LISTAS!AS8","v":"PAT. Documentos administrativos: Cartas, Oficios, Memo. Lista de Asistencia. Fotografías."}]
[]
[]
[]
[]
[null,null,{"$f":"LISTAS!AJ9","v":"8. La I.E. practicó la gestión integral y uso eficiente de los recursos hídricos."},null,null,null,null,{"$f":"LISTAS!AK9","v":"La I.E. ha incluido medidas para el ahorro y buen uso del agua en la I.E., fomentando una nueva cultura del agua, en el PAT."},null,null,null,null,null,null,{"$f":"LISTAS!AL9","v":"La I.E. ha incluido medidas para el acceso a agua segura en la I.E., fomentando una nueva cultura del agua, en el PAT."},null,null,null,null,null,null,{"$f":"LISTAS!AM9","v":"La I.E. implementó  actividades pedagógicas sobre la gestión integral de los recursos hídricos y una nueva cultura del agua (por ejemplo sobre la protección y conservación de la calidad del agua y de las cuencas hidrográficas; el ahorro y buen uso del agua; el acceso a agua segura; entre otros). "},null,null,null,null,null,null,{"$f":"LISTAS!AN9","v":"La I.E.  sensibilizó a las familias de la comunidad educativa y/o comunidad local para promover la gestión integral de recursos hídricos y una nueva cultura del agua en la I.E. y/o en la comunidad local."},null,null,null,null,null,null,{"$f":"LISTAS!AO9","v":"N° de hitos de aplicación del enfoque ambiental puestos en práctica en el cuidado y el uso ecoeficiente de los recursos hídricos, fomentando una nueva cultura del agua."}]
[]
[]
[]
[]
[]
[]
[]
[]
[]
[null,null,{"$f":"IF($C$28=\"\",\"\",\"Medios de verificación\")","v":"Medios de verificación"},null,null,null,null,{"$f":"LISTAS!AP9","v":"PCI. PAT."},null,null,null,null,null,null,{"$f":"LISTAS!AQ9","v":"PCI. PAT."},null,null,null,null,null,null,{"$f":"LISTAS!AR9","v":"PCI. PAT."},null,null,null,null,null,null,{"$f":"LISTAS!AS9","v":"Documentos administrativos: Cartas, Oficios, Memo. Actas, Convenios, Acuerdos."}]
[]
[]
[]
[]
[null,null,null,{"$f":"REPT(CHAR(73),10*(COUNTIF(H21:AI22,\"*\")+COUNTIF(H36:AI37,\"*\")+COUNTIF(H51:AI52,\"*\")+COUNTIF(H66:AI67,\"*\")))","v":""},null,null,null,null,null,null,null,null,null,null,null,null,null,null,null,null,null,null,null,null,null,null,null,null,null,{"$f":"IF(LISTAS!D72=TRUE,\"a\",\"\")","v":""},null,null,{"$f":"IF(LISTAS!D72=TRUE,\"Anterior\",\"\")","v":""},null,null,null,null,null,{"$f":"\"Matriz\"","v":"Matriz"},null,null,null,null,null,{"$f":"IF(LISTAS!D72=TRUE,\"Siguiente\",\"\")","v":""}]
[]
[]
[null,null,"%",null,"&",null,"N",null,"O",null,"Y",null,"b",null,"h",null,"Š",null,"\u008f",null,"§",null,"¨",null,"þ",null,"H",null,"J",null,"M",null,"P",null,"Q",null,"z",null,"~",null,"á",null,"%",null,"&",null,"N",null,"O"]
[]
[]
[null,{"$f":"IF(VALUE(INFO(\"VERSION\"))<14,\"Probablemente la herramienta no pueda operar correctamente por ser una versión muy antigua de MS-Excel, comuníquese con Gestión de la Información!\",IF(ISERROR(CONCATENATE(\"Versión del Sistema Operativo: \",INFO(\"VERSIONSO\"),\",     Versión de MS-Excel: \",INFO(\"VERSION\"))),\"Probablemente la herramienta no pueda operar correctamente, comuníquese con Gestión de la Información!\",CONCATENATE(\"Versión del Sistema Operativo: \",INFO(\"VERSIONSO\"),\",     Versión de MS-Excel: \",INFO(\"VERSION\"))))","v":{"$error":"#VALUE!"}},null,null,null,null,null,null,null,null,null,null,null,null,null,null,null,null,null,null,null,null,null,null,null,null,null,null,null,null,null,null,null,null,null,null,null,null,null,null,null,null,null,null,null,null,null,null,null,null,{"$f":"IF('MOD1'!$AY$49=\"\",\"\",'MOD1'!$AY$49)","v":{"$error":"#VALUE!"}}]

{"sheet":"MOD4_4","index":6,"n_rows":109,"n_cols":51,"rows_kept":109,"cut":false,"hidden":true,"merged":[[8,2,9,49],[10,2,11,6],[10,7,10,34],[10,35,11,40],[10,41,11,49],[11,7,11,13],[11,14,11,20],[11,21,11,27],[11,28,11,34],[12,41,21,49],[20,7,21,13],[20,14,21,20],[20,21,21,27],[20,28,21,34],[22,2,25,6],[22,7,25,13],[22,14,25,20],[22,21,25,27],[22,28,25,34],[12,2,21,6],[12,7,19,13],[12,14,19,20],[12,21,19,27],[12,28,19,34],[12,35,25,40],[35,21,36,27],[35,28,36,34],[37,2,40,6],[37,7,40,13],[37,14,40,20],[37,21,40,27],[37,28,40,34],[22,41,25,49],[27,2,36,6],[27,7,34,13],[27,14,34,20],[27,21,34,27],[27,28,34,34],[27,35,40,40],[27,41,36,49],[35,7,36,13],[35,14,36,20],[37,41,40,49],[52,41,55,49],[42,28,49,34],[42,35,55,40],[42,41,51,49],[50,7,51,13],[50,14,51,20],[50,21,51,27],[50,28,51,34],[57,41,66,49],[65,7,66,13],[57,35,70,40],[65,14,66,20],[65,21,66,27],[65,28,66,34],[42,2,51,6],[42,7,49,13],[42,14,49,20],[42,21,49,27],[52,2,55,6],[52,7,55,13],[52,14,55,20],[52,21,55,27],[52,28,55,34],[105,44,106,45],[105,46,106,47],[105,48,106,49],[105,26,106,27],[105,28,106,29],[105,30,106,31],[105,32,106,33],[105,34,106,35],[105,36,106,37],[57,2,66,6],[57,7,64,13],[57,14,64,20],[57,21,64,27],[57,28,64,34],[105,38,106,39],[105,40,106,41],[105,14,106,15],[105,16,106,17],[105,18,106,19],[105,20,106,21],[105,22,106,23],[105,24,106,25],[105,2,106,3],[105,4,106,5],[105,6,106,7],[105,8,106,9],[105,10,106,11],[105,12,106,13],[102,3,103,28],[102,32,103,36],[102,38,103,42],[105,42,106,43],[80,21,81,27],[80,28,81,34],[82,2,85,6],[82,7,85,13],[82,14,85,20],[82,21,85,27],[82,28,85,34],[67,41,70,49],[72,2,81,6],[72,7,79,13],[72,14,79,20],[72,21,79,27],[72,28,79,34],[72,35,85,40],[72,41,81,49],[80,7,81,13],[80,14,81,20],[67,2,70,6],[67,7,70,13],[67,14,70,20],[82,41,85,49],[67,21,70,27],[67,28,70,34],[102,29,103,30],[97,41,100,49],[95,21,96,27],[95,28,96,34],[97,2,100,6],[97,7,100,13],[97,14,100,20],[97,21,100,27],[97,28,100,34],[102,44,103,48],[87,2,96,6],[87,7,94,13],[87,14,94,20],[87,21,94,27],[87,28,94,34],[87,35,100,40],[87,41,96,49],[95,7,96,13],[95,14,96,20]]}
[0]
[null,"Sistema de Monitoreo y Evaluación de la Educación Ambiental en la Gestión Escolar",null,null,null,null,null,null,null,null,null,null,null,null,null,null,null,null,null,null,null,null,null,null,null,null,null,null,null,null,null,null,null,null,null,null,null,null,null,null,null,null,null,null,null,null,null,null,null,null,{"$f":"IF('MOD1'!$AY$2=\"\",\"\",'MOD1'!$AY$2)","v":"Versión de la Herramienta: 1.5"}]
[]
[]
[]
[]
[]
[]
[null,null,"Salud"]
[]
[null,null,"Actividades ambientales",null,null,null,null,"Hitos de aplicación del enfoque ambiental",null,null,null,null,null,null,null,null,null,null,null,null,null,null,null,null,null,null,null,null,null,null,null,null,null,null,null,"Indicador",null,null,null,null,null,"Aspectos que la IIEE llegara a este logro, así como dificultades"]
[null,null,null,null,null,null,null,"A",null,null,null,null,null,null,"B",null,null,null,null,null,null,"C",null,null,null,null,null,null,"D"]
[null,null,{"$f":"LISTAS!AJ10","v":"9. La I.E. Implementó el Plan de Salud Escolar en la I.E."},null,null,null,null,{"$f":"LISTAS!AK10","v":"La I.E. ha incluido las actividades del Plan de Salud Escolar en el PAT."},null,null,null,null,null,null,{"$f":"LISTAS!AL10","v":"La I.E. entregó al establecimiento de Salud los Consentimientos Informados firmados del Plan de Salud Escolar que fueron entregados a los padres de familia."},null,null,null,null,null,null,{"$f":"LISTAS!AM10","v":"La I.E. preparó los espacios para las actividades del Plan de Salud Escolar."},null,null,null,null,null,null,{"$f":"LISTAS!AN10","v":"La I.E. estableció con el Establecimiento de Salud de su ámbito el cronograma de las actividades del Plan de Salud Escolar."},null,null,null,null,null,null,{"$f":"LISTAS!AO10","v":"N° de hitos de aplicación del enfoque ambiental puestos en práctica en la implementación del Plan de salud escolar o del Plan de Salud de la  I.E."}]
[]
[]
[]
[]
[]
[]
[]
[]
[]
[null,null,{"$f":"IF($C$13=\"\",\"\",\"Medios de verificación\")","v":"Medios de verificación"},null,null,null,null,{"$f":"LISTAS!AP10","v":"Plan de Salud Escolar. PAT."},null,null,null,null,null,null,{"$f":"LISTAS!AQ10","v":"Cargo de entrega. Consentimientos informados firmados."},null,null,null,null,null,null,{"$f":"LISTAS!AR10","v":"PAT."},null,null,null,null,null,null,{"$f":"LISTAS!AS10","v":"Documentos administrativos: Cartas, Oficios, Memo. Actas, Convenios, Acuerdos."}]
[]
[]
[]
[]
[null,null,{"$f":"LISTAS!AJ11","v":"10. La I.E. implementa el servicio de alimentación provisto por Qali Warma."},null,null,null,null,{"$f":"LISTAS!AK11","v":"La I.E. ha incluido las actividades de Qali Warma en el PAT."},null,null,null,null,null,null,{"$f":"LISTAS!AL11","v":"El Comité de Alimentación Escolar (CAE) está conformado y todos sus miembros han sido capacitados."},null,null,null,null,null,null,{"$f":"LISTAS!AM11","v":"El CAE coordinó con el proveedor del servicio alimentario las fechas y horarios de entrega de alimentos a la IE."},null,null,null,null,null,null,{"$f":"LISTAS!AN11","v":"El CAE organizó los turnos y roles en la IE para la recepción, preparación y servido de los alimentos."},null,null,null,null,null,null,{"$f":"LISTAS!AO11","v":"N° de hitos de aplicación del enfoque ambiental puestos en práctica para la provisión del servicio de alimentación de Qali Warma."}]
[]
[]
[]
[]
[]
[]
[]
[]
[]
[null,null,{"$f":"IF($C$28=\"\",\"\",\"Medios de verificación\")","v":"Medios de verificación"},null,null,null,null,{"$f":"LISTAS!AP11","v":"PAT."},null,null,null,null,null,null,{"$f":"LISTAS!AQ11","v":"Acta de conformación. PAT."},null,null,null,null,null,null,{"$f":"LISTAS!AR11","v":"PAT."},null,null,null,null,null,null,{"$f":"LISTAS!AS11","v":"PAT."}]
[]
[]
[]
[]
[null,null,{"$f":"LISTAS!AJ12","v":"11. La I.E. implementó acciones sobre alimentación saludable y sostenible."},null,null,null,null,{"$f":"LISTAS!AK12","v":"La I.E. cuenta con una planificación de actividades, así como espacios educativos adecuados, para garantizar la alimentación saludable y sostenible, incluidos en el PAT. "},null,null,null,null,null,null,{"$f":"LISTAS!AL12","v":"La I.E. implementó y promovió actividades pedagógicas para el consumo de alimentos saludables y sostenibles, así como la revalorización y consumo de productos locales."},null,null,null,null,null,null,{"$f":"LISTAS!AM12","v":"La I.E. implementó y supervisó los quioscos, cafetines, cafeterías y/o comedores escolares así como las loncheras escolares, garantizando el acceso, la disponibilidad y el consumo de una alimentación saludable y sostenible, según la normativa vigente."},null,null,null,null,null,null,{"$f":"LISTAS!AN12","v":"La I.E. sensibilizó a las familias de la comunidad educativa para la adopción de una cultura de alimentación saludable y sostenible, así como la revalorización y consumo de productos locales. "},null,null,null,null,null,null,{"$f":"LISTAS!AO12","v":"N° de hitos de aplicación del enfoque ambiental puestos en práctica en la implementación de acciones de alimentación saludable y sostenible."}]
[]
[]
[]
[]
[]
[]
[]
[]
[]
[null,null,{"$f":"IF($C$28=\"\",\"\",\"Medios de verificación\")","v":"Medios de verificación"},null,null,null,null,{"$f":"LISTAS!AP12","v":"PAT."},null,null,null,null,null,null,{"$f":"LISTAS!AQ12","v":"PCI."},null,null,null,null,null,null,{"$f":"LISTAS!AR12","v":"PAT. Cartas, Oficios, Memo."},null,null,null,null,null,null,{"$f":"LISTAS!AS12","v":"PAT. Documentos administrativos: Cartas, Oficios, Memo. Lista de Asistencia. Fotografías."}]
[]
[]
[]
[]
[null,null,{"$f":"LISTAS!AJ13","v":"12. La I.E. implementó  acciones para la práctica de la higiene integral (lavado de manos, higiene bucal, aseo y cuidado personal). "},null,null,null,null,{"$f":"LISTAS!AK13","v":"La I.E. cuenta con una planificación de actividades, así como espacios educativos adecuados, para garantizar la puesta en práctica de hábitos de higiene integral, incluidos en el PAT."},null,null,null,null,null,null,{"$f":"LISTAS!AL13","v":"La I.E.  Implementó actividades pedagógicas sobre la importancia y la práctica diaria del lavado de manos (antes y después de las comidas y después del uso de los baños) e higiene bucal."},null,null,null,null,null,null,{"$f":"LISTAS!AM13","v":"La I.E. implementó actividades pedagógicas sobre la importancia y la práctica diaria de aseo y del cuidado personal (baño cotidiano, control de la pediculosis, ropa limpia, etc.). "},null,null,null,null,null,null,{"$f":"LISTAS!AN13","v":"La I.E. sensibilizó a las familias de la comunidad educativa y/o comunidad local en la adopción de hábitos de higiene integral."},null,null,null,null,null,null,{"$f":"LISTAS!AO13","v":"N° de hitos de aplicación del enfoque ambiental puestos en práctica en la implementación de hábitos de higiene integral."}]
[]
[]
[]
[]
[]
[]
[]
[]
[]
[null,null,{"$f":"IF($C$28=\"\",\"\",\"Medios de verificación\")","v":"Medios de verificación"},null,null,null,null,{"$f":"LISTAS!AP13","v":"PAT."},null,null,null,null,null,null,{"$f":"LISTAS!AQ13","v":"PCI."},null,null,null,null,null,null,{"$f":"LISTAS!AR13","v":"PCI."},null,null,null,null,null,null,{"$f":"LISTAS!AS13","v":"PAT. Documentos administrativos: Cartas, Oficios, Memo. Lista de Asistencia. Fotografías."}]
[]
[]
[]
[]
[null,null,{"$f":"LISTAS!AJ14","v":"13. La I.E. implementó actividades de mantenimiento, orden y limpieza de todos los ambientes como práctica cotidiana y para la prevención de enfermedades prevalentes."},null,null,null,null,{"$f":"LISTAS!AK14","v":"La I.E. cuenta con una planificación de actividades para promover entornos saludables a través del mantenimiento, orden y limpieza al interior y en los espacios exteriores de la I.E., incluidos en el PAT."},null,null,null,null,null,null,{"$f":"LISTAS!AL14","v":"La I.E. implementó actividades pedagógicas sobre la importancia y la práctica de la limpieza periódica, el orden, la ventilación e iluminación de espacios, como medidas de prevención de enfermedades prevalentes (EDAs, IRAs, Influenza, Dengue y otras de prevalencia local, TBC, entre otros)."},null,null,null,null,null,null,{"$f":"LISTAS!AM14","v":"La I.E. implementó actividades institucionales orientadas a mantener la limpieza periódica, el orden, la ventilación e iluminación de espacios, así como la desinfección y fumigación de las aulas, los servicios higiénicos, y otros espacios físicos dentro de la I.E. como en los exteriores de la I.E. (el perímetro, jardines y otros).  "},null,null,null,null,null,null,{"$f":"LISTAS!AN14","v":"La I.E. sensibilizó a las familias de la comunidad educativa y/o comunidad local, y logra su participación en las actividades de conservación y limpieza de los espacios interiores y exteriores a la I.E como medidas preventivas de enfermedades prevalentes."},null,null,null,null,null,null,{"$f":"LISTAS!AO14","v":"N° de hitos de aplicación del enfoque ambiental puestos en práctica para el mantenimiento, orden y limpieza de todos los ambientes como medidas de prevención de enfermedades prevalentes."}]
[]
[]
[]
[]
[]
[]
[]
[]
[]
[null,null,{"$f":"IF($C$28=\"\",\"\",\"Medios de verificación\")","v":"Medios de verificación"},null,null,null,null,{"$f":"LISTAS!AP14","v":"PAT."},null,null,null,null,null,null,{"$f":"LISTAS!AQ14","v":"PCI. PAT."},null,null,null,null,null,null,{"$f":"LISTAS!AR14","v":"PCI. PAT."},null,null,null,null,null,null,{"$f":"LISTAS!AS14","v":"PAT. Documentos administrativos: Cartas, Oficios, Memo. Lista de Asistencia. Fotografías."}]
[]
[]
[]
[]
[null,null,{"$f":"LISTAS!AJ15","v":"14. La I.E. adoptó medidas de protección frente a los efectos nocivos por la exposición a la radiación ultravioleta."},null,null,null,null,{"$f":"LISTAS!AK15","v":"La I.E. cuenta con una planificación de actividades para la implementación de acciones de protección y prevención de los efectos nocivos de la radiación solar (el uso del gorro/sombrero, gafas, uso permanente de bloqueadores solares, mallas raschel, tiempos para la formación de acuerdo a la normativa vigente, etc.) incluidos en el PAT."},null,null,null,null,null,null,{"$f":"LISTAS!AL15","v":"La I.E. implementó actividades pedagógicas para promover la prevención de los efectos nocivos de la radiación solar. "},null,null,null,null,null,null,{"$f":"LISTAS!AM15","v":"La I.E. implementó medidas y actividades institucionales para la prevención y protección de los efectos nocivos de la radiación solar (por ejemplo la instalación de techos y/o toldos con mallas de tipo raschel en patios, jardines u otros espacios; la dimsinución de los tiempos de las dinámicas de formación escolar al aire libre; entre otros)."},null,null,null,null,null,null,{"$f":"LISTAS!AN15","v":"La I.E. sensibilizó a las familias de la comunidad educativa y/o comunidad local sobre las medidas de protección a implementar durante todos el año frente a los efectos nocivos por la exposición a la radiación ultravioleta."},null,null,null,null,null,null,{"$f":"LISTAS!AO15","v":"N° de hitos de aplicación del enfoque ambiental puestos en práctica en la promoción de protección de la radiación solar."}]
[]
[]
[]
[]
[]
[]
[]
[]
[]
[null,null,{"$f":"IF($C$28=\"\",\"\",\"Medios de verificación\")","v":"Medios de verificación"},null,null,null,null,{"$f":"LISTAS!AP15","v":"PAT."},null,null,null,null,null,null,{"$f":"LISTAS!AQ15","v":"PCI."},null,null,null,null,null,null,{"$f":"LISTAS!AR15","v":"PAT."},null,null,null,null,null,null,{"$f":"LISTAS!AS15","v":"PAT. Documentos administrativos: Cartas, Oficios, Memo. Lista de Asistencia. Fotografías."}]
[]
[]
[]
[]
[null,null,null,{"$f":"REPT(CHAR(73),7*(COUNTIF(H21:AI22,\"*\")+COUNTIF(H36:AI37,\"*\")+COUNTIF(H51:AI52,\"*\")+COUNTIF(H66:AI67,\"*\")+COUNTIF(H81:AI82,\"*\")+COUNTIF(H96:AI97,\"*\")))","v":""},null,null,null,null,null,null,null,null,null,null,null,null,null,null,null,null,null,null,null,null,null,null,null,null,null,{"$f":"IF(LISTAS!D103=TRUE,\"a\",\"\")","v":""},null,null,{"$f":"IF(LISTAS!D103=TRUE,\"Anterior\",\"\")","v":""},null,null,null,null,null,{"$f":"\"Matriz\"","v":"Matriz"},null,null,null,null,null,{"$f":"IF(LISTAS!D103=TRUE,\"Siguiente\",\"\")","v":""}]
[]
[]
[null,null,"%",null,"&",null,"N",null,"O",null,"Y",null,"b",null,"h",null,"Š",null,"\u008f",null,"§",null,"¨",null,"þ",null,"H",null,"J",null,"M",null,"P",null,"Q",null,"z",null,"~",null,"á",null,"%",null,"&",null,"N",null,"O"]
[]
[]
[null,{"$f":"IF(VALUE(INFO(\"VERSION\"))<14,\"Probablemente la herramienta no pueda operar correctamente por ser una versión muy antigua de MS-Excel, comuníquese con Gestión de la Información!\",IF(ISERROR(CONCATENATE(\"Versión del Sistema Operativo: \",INFO(\"VERSIONSO\"),\",     Versión de MS-Excel: \",INFO(\"VERSION\"))),\"Probablemente la herramienta no pueda operar correctamente, comuníquese con Gestión de la Información!\",CONCATENATE(\"Versión del Sistema Operativo: \",INFO(\"VERSIONSO\"),\",     Versión de MS-Excel: \",INFO(\"VERSION\"))))","v":{"$error":"#VALUE!"}},null,null,null,null,null,null,null,null,null,null,null,null,null,null,null,null,null,null,null,null,null,null,null,null,null,null,null,null,null,null,null,null,null,null,null,null,null,null,null,null,null,null,null,null,null,null,null,null,{"$f":"IF('MOD1'!$AY$49=\"\",\"\",'MOD1'!$AY$49)","v":{"$error":"#VALUE!"}}]

{"sheet":"MOD4_5","index":7,"n_rows":49,"n_cols":51,"rows_kept":49,"cut":false,"hidden":true,"merged":[[8,2,9,49],[10,2,11,6],[10,7,10,34],[10,35,11,40],[10,41,11,49],[11,7,11,13],[11,14,11,20],[11,21,11,27],[11,28,11,34],[12,2,21,6],[12,7,19,13],[12,14,19,20],[12,21,19,27],[12,28,19,34],[22,2,25,6],[22,7,25,13],[22,14,25,20],[22,21,25,27],[22,28,25,34],[22,41,25,49],[12,41,21,49],[20,7,21,13],[20,14,21,20],[20,21,21,27],[20,28,21,34],[12,35,25,40],[42,3,43,28],[42,32,43,36],[42,38,43,42],[42,44,43,48],[42,29,43,30],[45,24,46,25],[45,2,46,3],[45,4,46,5],[45,6,46,7],[45,8,46,9],[45,10,46,11],[45,12,46,13],[45,14,46,15],[45,16,46,17],[45,18,46,19],[45,20,46,21],[45,22,46,23],[45,48,46,49],[45,26,46,27],[45,28,46,29],[45,30,46,31],[45,32,46,33],[45,34,46,35],[45,36,46,37],[45,38,46,39],[45,40,46,41],[45,42,46,43],[45,44,46,45],[45,46,46,47]]}
[0]
[null,"Sistema de Monitoreo y Evaluación de la Educación Ambiental en la Gestión Escolar",null,null,null,null,null,null,null,null,null,null,null,null,null,null,null,null,null,null,null,null,null,null,null,null,null,null,null,null,null,null,null,null,null,null,null,null,null,null,null,null,null,null,null,null,null,null,null,null,{"$f":"IF('MOD1'!$AY$2=\"\",\"\",'MOD1'!$AY$2)","v":"Versión de la Herramienta: 1.5"}]
[]
[]
[]
[]
[]
[]
[null,null,"Gestión del Riesgo de Desastres"]
[]
[null,null,"Actividades ambientales",null,null,null,null,"Hitos de aplicación del enfoque ambiental",null,null,null,null,null,null,null,null,null,null,null,null,null,null,null,null,null,null,null,null,null,null,null,null,null,null,null,"Indicador",null,null,null,null,null,"Aspectos que la IIEE llegara a este logro, así como dificultades"]
[null,null,null,null,null,null,null,"A",null,null,null,null,null,null,"B",null,null,null,null,null,null,"C",null,null,null,null,null,null,"D"]
[null,null,{"$f":"LISTAS!AJ16","v":"15. La IE adoptó medidas para la Gestión del Riesgo de Desastres."},null,null,null,null,{"$f":"LISTAS!AK16","v":"La I.E. cuenta con una planificación de la gestión del Riesgo de Desastres  incluidos en el PAT."},null,null,null,null,null,null,{"$f":"LISTAS!AL16","v":"La I.E. implementó actividades pedagógicas sobre la gestión del riesgo de desastres, en el marco del enfoque ambiental. "},null,null,null,null,null,null,{"$f":"LISTAS!AM16","v":"La I.E. implementó actividades institucionales, incluyendo simulacros, para hacer frente a los desastres, en el marco del enfoque ambiental. "},null,null,null,null,null,null,{"$f":"LISTAS!AN16","v":"La I.E. sensibilizó  a las familias de la comunidad educativa y/o comunidad local en la gestión del riesgo frente a los desastres (sismos, friajes, inundaciones, y otros producto del cambio climático, según el contexto). "},null,null,null,null,null,null,{"$f":"LISTAS!AO16","v":"N° de hitos de aplicación del enfoque ambiental puestos en práctica en la gestión de riesgos de desastres."}]
[]
[]
[]
[]
[]
[]
[]
[]
[]
[null,null,{"$f":"IF($C$13=\"\",\"\",\"Medios de verificación\")","v":"Medios de verificación"},null,null,null,null,{"$f":"LISTAS!AP16","v":"PAT."},null,null,null,null,null,null,{"$f":"LISTAS!AQ16","v":"PCI."},null,null,null,null,null,null,{"$f":"LISTAS!AR16","v":"PAT."},null,null,null,null,null,null,{"$f":"LISTAS!AS16","v":"PAT. Documentos administrativos: Cartas, Oficios, Memo. Lista de Asistencia. Fotografías."}]
[]
[]
[]
[]
[]
[]
[]
[]
[]
[]
[]
[]
[]
[]
[]
[]
[]
[]
[]
[null,null,null,{"$f":"REPT(CHAR(73),42*(COUNTIF(H21:AI22,\"*\")))","v":""},null,null,null,null,null,null,null,null,null,null,null,null,null,null,null,null,null,null,null,null,null,null,null,null,null,{"$f":"IF(COUNTIF(H21:AI22,\"*\")=4,\"a\",\"\")","v":""},null,null,{"$f":"IF(LISTAS!D109=TRUE,\"Anterior\",\"\")","v":""},null,null,null,null,null,{"$f":"\"Matriz\"","v":"Matriz"},null,null,null,null,null,{"$f":"IF(LISTAS!D109=TRUE,\"Siguiente\",\"\")","v":""}]
[]
[]
[null,null,"%",null,"&",null,"N",null,"O",null,"Y",null,"b",null,"h",null,"Š",null,"\u008f",null,"§",null,"¨",null,"þ",null,"H",null,"J",null,"M",null,"P",null,"Q",null,"z",null,"~",null,"á",null,"%",null,"&",null,"N",null,"O"]
[]
[]
[null,{"$f":"IF(VALUE(INFO(\"VERSION\"))<14,\"Probablemente la herramienta no pueda operar correctamente por ser una versión muy antigua de MS-Excel, comuníquese con Gestión de la Información!\",IF(ISERROR(CONCATENATE(\"Versión del Sistema Operativo: \",INFO(\"VERSIONSO\"),\",     Versión de MS-Excel: \",INFO(\"VERSION\"))),\"Probablemente la herramienta no pueda operar correctamente, comuníquese con Gestión de la Información!\",CONCATENATE(\"Versión del Sistema Operativo: \",INFO(\"VERSIONSO\"),\",     Versión de MS-Excel: \",INFO(\"VERSION\"))))","v":{"$error":"#VALUE!"}},null,null,null,null,null,null,null,null,null,null,null,null,null,null,null,null,null,null,null,null,null,null,null,null,null,null,null,null,null,null,null,null,null,null,null,null,null,null,null,null,null,null,null,null,null,null,null,null,{"$f":"IF('MOD1'!$AY$49=\"\",\"\",'MOD1'!$AY$49)","v":{"$error":"#VALUE!"}}]

{"sheet":"MOD4_6","index":8,"n_rows":51,"n_cols":51,"rows_kept":51,"cut":false,"hidden":true,"merged":[[19,50,21,50],[22,50,24,50],[25,50,27,50],[28,50,30,50],[31,50,33,50],[34,50,36,50],[37,50,39,50],[40,50,42,50],[40,4,42,9],[37,4,39,9],[34,4,36,9],[40,10,42,21],[37,10,39,21],[19,4,21,21],[22,4,24,21],[25,4,27,21],[28,4,30,21],[31,4,33,21],[37,34,39,37],[37,38,39,41],[37,42,39,47],[40,22,42,25],[34,10,36,21],[34,26,36,29],[8,2,9,49],[10,3,12,48],[47,24,48,25],[47,2,48,3],[47,4,48,5],[47,6,48,7],[47,8,48,9],[47,10,48,11],[47,12,48,13],[47,14,48,15],[47,16,48,17],[47,18,48,19],[47,20,48,21],[47,22,48,23],[47,48,48,49],[47,26,48,27],[47,38,48,39],[47,40,48,41],[47,42,48,43],[47,44,48,45],[47,46,48,47],[47,28,48,29],[47,30,48,31],[47,32,48,33],[47,34,48,35],[47,36,48,37],[31,26,33,29],[31,30,33,33],[31,34,33,37],[31,38,33,41],[22,42,24,47],[19,26,21,29],[19,42,21,47],[19,30,21,33],[19,34,21,37],[19,38,21,41],[44,43,45,47],[34,30,36,33],[34,34,36,37],[34,38,36,41],[34,42,36,47],[40,26,42,29],[40,30,42,33],[40,34,42,37],[40,38,42,41],[40,42,42,47],[37,26,39,29],[37,30,39,33],[37,22,39,25],[28,38,30,41],[28,34,30,37],[19,22,21,25],[15,22,18,25],[15,4,18,21],[25,26,27,29],[22,26,24,29],[28,26,30,29],[16,26,18,29],[22,22,24,25],[25,22,27,25],[28,22,30,25],[16,30,18,33],[28,42,30,47],[31,22,33,25],[37,48,39,49],[40,48,42,49],[31,48,33,49],[34,48,36,49],[31,42,33,47],[16,34,18,37],[16,38,18,41],[15,42,18,47],[15,26,15,41],[19,48,21,49],[22,48,24,49],[25,48,27,49],[28,48,30,49],[25,30,27,33],[25,34,27,37],[25,38,27,41],[25,42,27,47],[22,30,24,33],[22,34,24,37],[22,38,24,41],[28,30,30,33],[34,22,36,25]]}
[0]
[null,"Sistema de Monitoreo y Evaluación de la Educación Ambiental en la Gestión Escolar",null,null,null,null,null,null,null,null,null,null,null,null,null,null,null,null,null,null,null,null,null,null,null,null,null,null,null,null,null,null,null,null,null,null,null,null,null,null,null,null,null,null,null,null,null,null,null,null,{"$f":"IF('MOD1'!$AY$2=\"\",\"\",'MOD1'!$AY$2)","v":"Versión de la Herramienta: 1.5"}]
[]
[]
[]
[]
[]
[]
[null,null,"PROYECTOS EDUCATIVOS AMBIENTALES INTEGRADOS"]
[]
[null,null,null,"El Proyecto Educativo Ambiental Integrado (PEAI) es una herramienta institucional y pedagógica que permite la mejor implementación de las actividades estandarizadas de cada uno de los componentes del enfoque ambiental."]
[]
[]
[]
[null,null,null,null,1,1,1,1,1,1,1,1,1,1,1,1,1,1,1,1,1,1,1,1,1,1,1,1,1,1,1,1,1,1,1,1,1,1,1,1,1,1,1,1,1,1,1,1]
[null,null,null,null,"NOMBRE DEL PROYECTO EDUCATIVO\nAMBIENTAL INTEGRAL",null,null,null,null,null,null,null,null,null,null,null,null,null,null,null,null,null,"PROYECTO EJECUTADO EN EL 2016",null,null,null,"MARCAR EL/LOS COMPONENTES CON LOS QUE HA TRABAJADO",null,null,null,null,null,null,null,null,null,null,null,null,null,null,null,"REGISTRO"]
[null,null,null,null,null,null,null,null,null,null,null,null,null,null,null,null,null,null,null,null,null,null,null,null,null,null,"Cambio climático",null,null,null,"Ecoeficiencia",null,null,null,"Salud",null,null,null,"Gestión de riesgo"]
[]
[]
[null,null,{"$f":"AND(W20=\"SI\",OR(COUNTIFS(LISTAS!$C$120:$C$161,E20,LISTAS!$D$120:$D$161,\"\")>0,COUNTIFS(LISTAS!$B$166:$B$205,E20,LISTAS!$D$166:$D$205,\"\")>0))","v":false},null,{"$f":"LISTAS!AI17","v":"Espacio de Vida – EsVi"},null,null,null,null,null,null,null,null,null,null,null,null,null,null,null,null,null,null,null,null,null,null,null,null,null,null,null,null,null,null,null,null,null,null,null,null,null,{"$f":"IF(W20=\"SI\",\"Siguiente\",\"\")","v":""},null,null,null,null,null,{"$f":"IF(AQ20=\"\",\"\",IF(COUNTIF(MOD4_6_1!$H$21:$AI$22,\"\")=0,\"a\",\"\"))","v":""}]
[]
[]
[null,null,{"$f":"AND(W23=\"SI\",OR(COUNTIFS(LISTAS!$C$120:$C$161,E23,LISTAS!$D$120:$D$161,\"\")>0,COUNTIFS(LISTAS!$B$166:$B$205,E23,LISTAS!$D$166:$D$205,\"\")>0))","v":false},null,{"$f":"LISTAS!AI18","v":"Manejo de Residuos Sólidos – MARES"},null,null,null,null,null,null,null,null,null,null,null,null,null,null,null,null,null,null,null,null,null,null,null,null,null,null,null,null,null,null,null,null,null,null,null,null,null,{"$f":"IF(W23=\"SI\",\"Siguiente\",\"\")","v":""},null,null,null,null,null,{"$f":"IF(AQ23=\"\",\"\",IF(COUNTIF(MOD4_6_2!$H$21:$AI$22,\"\")=0,\"a\",\"\"))","v":""}]
[]
[]
[null,null,{"$f":"AND(W26=\"SI\",OR(COUNTIFS(LISTAS!$C$120:$C$161,E26,LISTAS!$D$120:$D$161,\"\")>0,COUNTIFS(LISTAS!$B$166:$B$205,E26,LISTAS!$D$166:$D$205,\"\")>0))","v":false},null,{"$f":"LISTAS!AI19","v":"Vida y Verde – VIVE"},null,null,null,null,null,null,null,null,null,null,null,null,null,null,null,null,null,null,null,null,null,null,null,null,null,null,null,null,null,null,null,null,null,null,null,null,null,{"$f":"IF(W26=\"SI\",\"Siguiente\",\"\")","v":""},null,null,null,null,null,{"$f":"IF(AQ26=\"\",\"\",IF(COUNTIF(MOD4_6_3!$H$21:$AI$22,\"\")=0,\"a\",\"\"))","v":""}]
[]
[]
[null,null,{"$f":"AND(W29=\"SI\",OR(COUNTIFS(LISTAS!$C$120:$C$161,E29,LISTAS!$D$120:$D$161,\"\")>0,COUNTIFS(LISTAS!$B$166:$B$205,E29,LISTAS!$D$166:$D$205,\"\")>0))","v":false},null,{"$f":"LISTAS!AI20","v":"GLOBE Perú"},null,null,null,null,null,null,null,null,null,null,null,null,null,null,null,null,null,null,null,null,null,null,null,null,null,null,null,null,null,null,null,null,null,null,null,null,null,{"$f":"IF(W29=\"SI\",\"Siguiente\",\"\")","v":""},null,null,null,null,null,{"$f":"IF(AQ29=\"\",\"\",IF(COUNTIF(MOD4_6_4!$H$21:$AI$22,\"\")=0,\"a\",\"\"))","v":""}]
[]
[]
[null,null,{"$f":"AND(W32=\"SI\",OR(COUNTIFS(LISTAS!$C$120:$C$161,E32,LISTAS!$D$120:$D$161,\"\")>0,COUNTIFS(LISTAS!$B$166:$B$205,E32,LISTAS!$D$166:$D$205,\"\")>0))","v":false},null,{"$f":"LISTAS!AI21","v":"Mi Huella – Mido y reduzco mi huella de carbono"},null,null,null,null,null,null,null,null,null,null,null,null,null,null,null,null,null,null,null,null,null,null,null,null,null,null,null,null,null,null,null,null,null,null,null,null,null,{"$f":"IF(W32=\"SI\",\"Siguiente\",\"\")","v":""},null,null,null,null,null,{"$f":"IF(AQ32=\"\",\"\",IF(COUNTIF(MOD4_6_5!$H$21:$AI$22,\"\")=0,\"a\",\"\"))","v":""}]
[]
[]
[null,null,{"$f":"AND(W35=\"SI\",OR(COUNTIFS(LISTAS!$C$120:$C$161,\"Otro proyecto 1\",LISTAS!$D$120:$D$161,\"\")>0,COUNTIFS(LISTAS!$B$166:$B$205,\"Otro proyecto 1\",LISTAS!$D$166:$D$205,\"\")>0))","v":false},null,"Otros proyectos:",null,null,null,null,null,null,null,null,null,null,null,null,null,null,null,null,null,null,null,null,null,null,null,null,null,null,null,null,null,null,null,null,null,null,null,null,null,{"$f":"IF(W35=\"SI\",\"Siguiente\",\"\")","v":""},null,null,null,null,null,{"$f":"IF(AQ35=\"\",\"\",IF(COUNTIF(MOD4_6_6!$H$21:$AI$22,\"\")=0,\"a\",\"\"))","v":""}]
[]
[]
[null,null,{"$f":"AND(W38=\"SI\",OR(COUNTIFS(LISTAS!$C$120:$C$161,\"Otro proyecto 2\",LISTAS!$D$120:$D$161,\"\")>0,COUNTIFS(LISTAS!$B$166:$B$205,\"Otro proyecto 2\",LISTAS!$D$166:$D$205,\"\")>0))","v":false},null,null,null,null,null,null,null,null,null,null,null,null,null,null,null,null,null,null,null,null,null,null,null,null,null,null,null,null,null,null,null,null,null,null,null,null,null,null,null,{"$f":"IF(W38=\"SI\",\"Siguiente\",\"\")","v":""},null,null,null,null,null,{"$f":"IF(AQ38=\"\",\"\",IF(COUNTIF(MOD4_6_7!$H$21:$AI$22,\"\")=0,\"a\",\"\"))","v":""}]
[]
[]
[null,null,{"$f":"AND(W41=\"SI\",OR(COUNTIFS(LISTAS!$C$120:$C$161,\"Otro proyecto 3\",LISTAS!$D$120:$D$161,\"\")>0,COUNTIFS(LISTAS!$B$166:$B$205,\"Otro proyecto 3\",LISTAS!$D$166:$D$205,\"\")>0))","v":false},null,null,null,null,null,null,null,null,null,null,null,null,null,null,null,null,null,null,null,null,null,null,null,null,null,null,null,null,null,null,null,null,null,null,null,null,null,null,null,{"$f":"IF(W41=\"SI\",\"Siguiente\",\"\")","v":""},null,null,null,null,null,{"$f":"IF(AQ41=\"\",\"\",IF(COUNTIF(MOD4_6_8!$H$21:$AI$22,\"\")=0,\"a\",\"\"))","v":""}]
[]
[]
[null,null,{"$f":"COUNTIF(C20:C43,TRUE)>0","v":false}]
[null,null,null,null,null,null,null,null,null,null,null,null,null,null,null,null,null,null,null,null,null,null,null,null,null,null,null,null,null,null,null,null,null,null,null,null,null,null,null,null,null,null,null,"Matriz"]
[null,null,null,null,"Todos los datos deben ser llenados y selecionados correctamente."]
[]
[null,null,"%",null,"&",null,"N",null,"O",null,"Y",null,"b",null,"h",null,"Š",null,"\u008f",null,"§",null,"¨",null,"þ",null,"H",null,"J",null,"M",null,"P",null,"Q",null,"z",null,"~",null,"á",null,"%",null,"&",null,"N",null,"O"]
[]
[]
[null,{"$f":"IF(VALUE(INFO(\"VERSION\"))<14,\"Probablemente la herramienta no pueda operar correctamente por ser una versión muy antigua de MS-Excel, comuníquese con Gestión de la Información!\",IF(ISERROR(CONCATENATE(\"Versión del Sistema Operativo: \",INFO(\"VERSIONSO\"),\",     Versión de MS-Excel: \",INFO(\"VERSION\"))),\"Probablemente la herramienta no pueda operar correctamente, comuníquese con Gestión de la Información!\",CONCATENATE(\"Versión del Sistema Operativo: \",INFO(\"VERSIONSO\"),\",     Versión de MS-Excel: \",INFO(\"VERSION\"))))","v":{"$error":"#VALUE!"}},null,null,null,null,null,null,null,null,null,null,null,null,null,null,null,null,null,null,null,null,null,null,null,null,null,null,null,null,null,null,null,null,null,null,null,null,null,null,null,null,null,null,null,null,null,null,null,null,{"$f":"IF('MOD1'!$AY$49=\"\",\"\",'MOD1'!$AY$49)","v":{"$error":"#VALUE!"}}]

{"sheet":"MOD6","index":9,"n_rows":49,"n_cols":51,"rows_kept":49,"cut":false,"hidden":true,"merged":[[8,3,10,48],[42,3,43,4],[42,5,43,9],[42,10,43,13],[42,14,43,22],[42,23,43,30],[42,31,43,34],[38,35,39,48],[40,3,41,4],[40,5,41,9],[40,10,41,13],[40,14,41,22],[40,23,41,30],[40,31,41,34],[40,35,41,48],[38,3,39,4],[38,5,39,9],[38,10,39,13],[38,14,39,22],[38,23,39,30],[38,31,39,34],[36,3,37,4],[36,5,37,9],[36,10,37,13],[36,14,37,22],[36,23,37,30],[36,31,37,34],[36,35,37,48],[34,3,35,4],[34,5,35,9],[34,10,35,13],[34,14,35,22],[34,23,35,30],[34,31,35,34],[32,3,33,4],[32,5,33,9],[32,10,33,13],[32,14,33,22],[32,23,33,30],[32,31,33,34],[32,35,33,48],[30,3,31,4],[30,5,31,9],[30,10,31,13],[30,14,31,22],[30,23,31,30],[30,31,31,34],[28,3,29,4],[28,5,29,9],[28,10,29,13],[28,14,29,22],[28,23,29,30],[28,31,29,34],[28,35,29,48],[26,3,27,4],[26,5,27,9],[26,10,27,13],[26,14,27,22],[26,23,27,30],[26,31,27,34],[24,3,25,4],[24,5,25,9],[24,10,25,13],[24,14,25,22],[24,23,25,30],[24,31,25,34],[24,35,25,48],[22,3,23,4],[22,5,23,9],[22,10,23,13],[22,14,23,22],[22,23,23,30],[22,31,23,34],[14,23,15,30],[14,31,15,34],[18,35,19,48],[20,3,21,4],[20,5,21,9],[20,10,21,13],[20,14,21,22],[20,23,21,30],[20,31,21,34],[20,35,21,48],[18,3,19,4],[18,5,19,9],[18,10,19,13],[18,14,19,22],[18,23,19,30],[18,31,19,34],[12,31,13,34],[12,35,13,48],[45,38,46,39],[45,40,46,41],[45,42,46,43],[45,44,46,45],[45,46,46,47],[45,48,46,49],[45,26,46,27],[45,28,46,29],[45,30,46,31],[45,32,46,33],[45,34,46,35],[45,36,46,37],[14,35,15,48],[16,23,17,30],[16,31,17,34],[16,35,17,48],[22,35,23,48],[26,35,27,48],[30,35,31,48],[34,35,35,48],[42,35,43,48],[45,24,46,25],[12,14,13,22],[12,23,13,30],[45,14,46,15],[45,16,46,17],[45,18,46,19],[45,20,46,21],[45,22,46,23],[16,3,17,4],[16,5,17,9],[16,10,17,13],[16,14,17,22],[14,3,15,4],[14,5,15,9],[14,10,15,13],[45,2,46,3],[45,4,46,5],[45,6,46,7],[45,8,46,9],[45,10,46,11],[45,12,46,13],[12,3,13,4],[12,5,13,9],[12,10,13,13],[14,14,15,22]]}
[0]
[null,"Sistema de Monitoreo y Evaluación de la Educación Ambiental en la Gestión Escolar",null,null,null,null,null,null,null,null,null,null,null,null,null,null,null,null,null,null,null,null,null,null,null,null,null,null,null,null,null,null,null,null,null,null,null,null,null,null,null,null,null,null,null,null,null,null,null,null,{"$f":"IF('MOD1'!$AY$2=\"\",\"\",'MOD1'!$AY$2)","v":"Versión de la Herramienta: 1.5"}]
[]
[]
[]
[]
[]
[]
[null,null,null,"Finalmente, el formato adicional para el diploma de reconocimiento y felicitación es necesario tener presente los datos de directivos, coordinadores, docentes, estudiantes con participación excepcional, siendo como máximo de 15 personas a registrar, detalle aquí:"]
[]
[]
[]
[null,null,null,"ITEM",null,"CARGO DEL PARTICIPANTE",null,null,null,null,"NUMERO DNI",null,null,null,"APELLIDOS",null,null,null,null,null,null,null,null,"NOMBRES",null,null,null,null,null,null,null,"CELULAR",null,null,null,"CORREO ELECTRÓNICO"]
[]
[null,null,null,1,null,"Directivo"]
[]
[null,null,null,{"$f":"D15+1","v":2},null,"Coordinador"]
[]
[null,null,null,{"$f":"D17+1","v":3}]
[]
[null,null,null,{"$f":"D19+1","v":4}]
[]
[null,null,null,{"$f":"D21+1","v":5}]
[]
[null,null,null,{"$f":"D23+1","v":6}]
[]
[null,null,null,{"$f":"D25+1","v":7}]
[]
[null,null,null,{"$f":"D27+1","v":8}]
[]
[null,null,null,{"$f":"D29+1","v":9}]
[]
[null,null,null,{"$f":"D31+1","v":10}]
[]
[null,null,null,{"$f":"D33+1","v":11}]
[]
[null,null,null,{"$f":"D35+1","v":12}]
[]
[null,null,null,{"$f":"D37+1","v":13}]
[]
[null,null,null,{"$f":"D39+1","v":14}]
[]
[null,null,null,{"$f":"D41+1","v":15}]
[]
[]
[null,null,"%",null,"&",null,"N",null,"O",null,"Y",null,"b",null,"h",null,"Š",null,"\u008f",null,"§",null,"¨",null,"þ",null,"H",null,"J",null,"M",null,"P",null,"Q",null,"z",null,"~",null,"á",null,"%",null,"&",null,"N",null,"O"]
[]
[]
[null,{"$f":"IF(VALUE(INFO(\"VERSION\"))<14,\"Probablemente la herramienta no pueda operar correctamente por ser una versión muy antigua de MS-Excel, comuníquese con Gestión de la Información!\",IF(ISERROR(CONCATENATE(\"Versión del Sistema Operativo: \",INFO(\"VERSIONSO\"),\",     Versión de MS-Excel: \",INFO(\"VERSION\"))),\"Probablemente la herramienta no pueda operar correctamente, comuníquese con Gestión de la Información!\",CONCATENATE(\"Versión del Sistema Operativo: \",INFO(\"VERSIONSO\"),\",     Versión de MS-Excel: \",INFO(\"VERSION\"))))","v":{"$error":"#VALUE!"}},null,null,null,null,null,null,null,null,null,null,null,null,null,null,null,null,null,null,null,null,null,null,null,null,null,null,null,null,null,null,null,null,null,null,null,null,null,null,null,null,null,null,null,null,null,null,null,null,{"$f":"IF('MOD1'!$AY$49=\"\",\"\",'MOD1'!$AY$49)","v":{"$error":"#VALUE!"}}]

{"sheet":"MOD7","index":10,"n_rows":63,"n_cols":127,"rows_kept":63,"cut":false,"hidden":true,"merged":[[55,21,55,33],[50,4,50,17],[51,4,51,17],[52,4,52,17],[53,4,53,17],[54,4,54,17],[55,4,55,17],[50,21,50,33],[51,21,51,33],[52,21,52,33],[53,21,53,33],[54,21,54,33],[45,19,45,34],[39,2,39,14],[39,15,39,17],[39,19,39,31],[39,32,39,34],[40,2,40,14],[40,15,40,17],[40,19,40,31],[40,32,40,34],[35,2,35,14],[35,15,35,17],[35,19,35,31],[35,32,35,34],[37,2,38,17],[37,19,38,34],[30,32,30,34],[29,15,29,17],[32,2,33,17],[32,19,33,34],[34,2,34,14],[34,15,34,17],[34,19,34,31],[34,32,34,34],[6,2,7,34],[9,18,9,34],[11,18,11,34],[16,8,16,34],[17,8,17,34],[18,8,18,34],[21,8,21,34],[43,2,44,34],[45,2,45,14],[45,15,45,17],[19,8,19,34],[22,8,22,34],[20,8,20,34],[27,2,28,17],[27,19,28,34],[30,15,30,17],[29,2,29,14],[30,2,30,14],[29,19,29,31],[29,32,29,34],[30,19,30,31],[56,4,56,17],[56,21,56,33],[59,4,59,17],[59,21,59,33],[58,4,58,17],[58,21,58,33],[57,4,57,17],[57,21,57,33]]}
[0]
[{"$f":"LISTAS!D165","v":true},{"$f":"'MOD1'!$B$2","v":"Sistema de Monitoreo y Evaluación de la Educación Ambiental en la Gestión Escolar"},null,null,null,null,null,null,null,null,null,null,null,null,null,null,null,null,null,null,null,null,null,null,null,null,null,null,null,null,null,null,null,null,null,null,null,null,null,null,null,null,null,null,null,null,null,null,null,null,null,null,null,null,null,null,null,null,null,null,null,null,null,null,null,null,null,null,null,null,null,null,null,null,null,null,null,null,null,null,null,null,null,null,null,null,null,null,null,null,null,null,null,null,null,null,null,null,null,null,null,null,null,null,null,null,null,null,null,null,null,null,null,null,null,null,null,null,null,null,null,null,null,null,null,null,{"$f":"'MOD7'!P31","v":0}]
[]
[]
[]
[]
[null,null,"CONFIRMACIÓN DE ENVÍO DE DATOS"]
[]
[]
[null,null,"NÚMERO DE REGISTRO DEL ENVIO DE DATOS:",null,null,null,null,null,null,null,null,null,null,null,null,null,null,null,{"$f":"LISTAS!D26","v":""}]
[]
[null,null,"FECHA/HORA DE CONFIRMACIÓN DE ENVÍO:",null,null,null,null,null,null,null,null,null,null,null,null,null,null,null,{"$f":"NOW()","v":"2016-11-16T15:39:05.650"}]
[]
[]
[null,null,"DATOS DE LA INSTITUCIÓN EDUCATIVA:"]
[]
[null,null,"Nombre de II.EE.:",null,null,null,null,null,{"$f":"IF('MOD2'!Q38=\"\",'MOD2'!Q26,'MOD2'!Q38)","v":""}]
[null,null,"Código modular:",null,null,null,null,null,{"$f":"IF('MOD2'!M26=\"\",\"\",'MOD2'!M26)&IF('MOD2'!M28=\"\",\"\",\" - \"&'MOD2'!M28)&IF('MOD2'!M30=\"\",\"\",\" - \"&'MOD2'!M30&\"  \")&IF('MOD2'!M38=\"\",\"\",'MOD2'!M38)&IF('MOD2'!M40=\"\",\"\",\" - \"&'MOD2'!M40)","v":""}]
[null,null,"Nivel educativo:",null,null,null,null,null,{"$f":"IF('MOD2'!D26=\"\",\"\",'MOD2'!D26)&IF('MOD2'!D28=\"\",\"\",\" - \"&'MOD2'!D28)&IF('MOD2'!D30=\"\",\"\",\" - \"&'MOD2'!D30&\"  \")&IF('MOD2'!D38=\"\",\"\",'MOD2'!D38)&IF('MOD2'!D40=\"\",\"\",\" - \"&'MOD2'!D40)","v":""}]
[null,null,"Modalidad:",null,null,null,null,null,{"$f":"IF('MOD2'!AH26=\"\",\"\",'MOD2'!AH26)&IF('MOD2'!AH28=\"\",\"\",\" - \"&'MOD2'!AH28)&IF('MOD2'!AH30=\"\",\"\",\" - \"&'MOD2'!AH30&\"  \")&IF('MOD2'!AH38=\"\",\"\",'MOD2'!AH38)&IF('MOD2'!AH40=\"\",\"\",\" - \"&'MOD2'!AH40)","v":""}]
[null,null,"Dirección de II.EE.:",null,null,null,null,null,{"$f":"'MOD2'!AA18","v":0}]
[null,null,"Dependencia:",null,null,null,null,null,{"$f":"'MOD2'!T18","v":0}]
[null,null,"DRE/UGEL:",null,null,null,null,null,{"$f":"'MOD2'!D13","v":0}]
[]
[]
[null,null,"DEL RECOJO DE LA INFORMACIÓN (Carga de datos):"]
[]
[null,null,{"$f":"IF('MOD3'!$D$15=\"\",\"\",'MOD3'!$D$15)","v":"Gestión escolar"},null,null,null,null,null,null,null,null,null,null,null,null,null,null,null,null,{"$f":"IF('MOD3'!$T$15=\"\",\"\",'MOD3'!$T$15)","v":"Educación para el \ncambio climático"}]
[]
[null,null,"Respuestas afirmativas:",null,null,null,null,null,null,null,null,null,null,null,null,{"$f":"COUNTIFS(LISTAS!A:A,1,LISTAS!D:D,\"SI\")","v":0},null,null,null,"Respuestas afirmativas:",null,null,null,null,null,null,null,null,null,null,null,null,{"$f":"COUNTIFS(LISTAS!A:A,2,LISTAS!D:D,\"SI\")","v":0}]
[null,null,"Porcentaje:",null,null,null,null,null,null,null,null,null,null,null,null,{"$f":"P30/COUNTIFS(LISTAS!$A:$A,1)","v":0},null,null,null,"Porcentaje:",null,null,null,null,null,null,null,null,null,null,null,null,{"$f":"AG30/COUNTIFS(LISTAS!$A:$A,2)","v":0}]
[]
[null,null,{"$f":"IF('MOD3'!$AJ$15=\"\",\"\",'MOD3'!$AJ$15)","v":"Educación en ecoeficiencia"},null,null,null,null,null,null,null,null,null,null,null,null,null,null,null,null,{"$f":"IF('MOD3'!$D$31=\"\",\"\",'MOD3'!$D$31)","v":"Educación en salud"}]
[]
[null,null,"Respuestas afirmativas:",null,null,null,null,null,null,null,null,null,null,null,null,{"$f":"COUNTIFS(LISTAS!A:A,3,LISTAS!D:D,\"SI\")","v":0},null,null,null,"Respuestas afirmativas:",null,null,null,null,null,null,null,null,null,null,null,null,{"$f":"COUNTIFS(LISTAS!A:A,4,LISTAS!D:D,\"SI\")","v":0}]
[null,null,"Porcentaje:",null,null,null,null,null,null,null,null,null,null,null,null,{"$f":"P35/COUNTIFS(LISTAS!$A:$A,3)","v":0},null,null,null,"Porcentaje:",null,null,null,null,null,null,null,null,null,null,null,null,{"$f":"AG35/(COUNTIFS(LISTAS!$A:$A,4)-COUNTIF(LISTAS!D21:D22,\"NO\")*4)","v":0}]
[]
[null,null,{"$f":"IF('MOD3'!$T$31=\"\",\"\",'MOD3'!$T$31)","v":"Gestión del riesgo"},null,null,null,null,null,null,null,null,null,null,null,null,null,null,null,null,{"$f":"IF('MOD3'!$AJ$31=\"\",\"\",'MOD3'!$AJ$31)","v":"Proyectos educativos \nambientales integrales"}]
[]
[null,null,"Respuestas afirmativas:",null,null,null,null,null,null,null,null,null,null,null,null,{"$f":"COUNTIFS(LISTAS!A:A,5,LISTAS!D:D,\"SI\")","v":0},null,null,null,"Respuestas afirmativas:",null,null,null,null,null,null,null,null,null,null,null,null,{"$f":"COUNTIFS(LISTAS!A:A,6,LISTAS!D:D,\"SI\")","v":0}]
[null,null,"Porcentaje:",null,null,null,null,null,null,null,null,null,null,null,null,{"$f":"P40/COUNTIFS(LISTAS!$A:$A,5)","v":0},null,null,null,"Porcentaje:",null,null,null,null,null,null,null,null,null,null,null,null,{"$f":"IFERROR(AG40/(COUNTIFS(LISTAS!A:A,\"PEIA\",LISTAS!D:D,\"SI\")*4),0)","v":0}]
[]
[]
[null,null,"VALOR FINAL (Carga de Datos)"]
[]
[null,null,"Porcentaje en base a respuestas:",null,null,null,null,null,null,null,null,null,null,null,null,{"$f":"(P30+AG30+P35+AG35+P40+AG40)/(COUNTIF(LISTAS!A:A,\"<\"&6)-COUNTIF(LISTAS!D21:D22,\"NO\")*4+COUNTIF(LISTAS!D111:D118,\"SI\")*4+IF(A2=TRUE,4,0))","v":0},null,null,null,{"$f":"CONCATENATE(\"Nivel de logro: \",IF($P$46>0.75,\"Destacado\",IF($P$46>0.5,\"Previsto\",IF($P$46>0.25,\"En proceso\",IF($P$46>0,\"En inicio\",\"Por iniciar\")))))","v":"Nivel de logro: Por iniciar"}]
[]
[]
[null,null,"DOCUMENTOS A ADJUNTAR EN EL EXPEDIENTE, INDICANDO CÓDIGO MODULAR Y NOMBRE DE LA IIEE."]
[]
[null,null,1,"-",{"$f":"IFERROR(VLOOKUP(C51,LISTAS!$BD$2:$BG$24,4,FALSE),\"\")","v":""},null,null,null,null,null,null,null,null,null,null,null,null,null,null,11,"-",{"$f":"IFERROR(VLOOKUP(T51,LISTAS!$BD$2:$BG$24,4,FALSE),\"\")","v":""}]
[null,null,2,"-",{"$f":"IFERROR(VLOOKUP(C52,LISTAS!$BD$2:$BG$24,4,FALSE),\"\")","v":""},null,null,null,null,null,null,null,null,null,null,null,null,null,null,12,"-",{"$f":"IFERROR(VLOOKUP(T52,LISTAS!$BD$2:$BG$24,4,FALSE),\"\")","v":""}]
[null,null,3,"-",{"$f":"IFERROR(VLOOKUP(C53,LISTAS!$BD$2:$BG$24,4,FALSE),\"\")","v":""},null,null,null,null,null,null,null,null,null,null,null,null,null,null,13,"-",{"$f":"IFERROR(VLOOKUP(T53,LISTAS!$BD$2:$BG$24,4,FALSE),\"\")","v":""}]
[null,null,4,"-",{"$f":"IFERROR(VLOOKUP(C54,LISTAS!$BD$2:$BG$24,4,FALSE),\"\")","v":""},null,null,null,null,null,null,null,null,null,null,null,null,null,null,14,"-",{"$f":"IFERROR(VLOOKUP(T54,LISTAS!$BD$2:$BG$24,4,FALSE),\"\")","v":""}]
[null,null,5,"-",{"$f":"IFERROR(VLOOKUP(C55,LISTAS!$BD$2:$BG$24,4,FALSE),\"\")","v":""},null,null,null,null,null,null,null,null,null,null,null,null,null,null,15,"-",{"$f":"IFERROR(VLOOKUP(T55,LISTAS!$BD$2:$BG$24,4,FALSE),\"\")","v":""}]
[null,null,6,"-",{"$f":"IFERROR(VLOOKUP(C56,LISTAS!$BD$2:$BG$24,4,FALSE),\"\")","v":""},null,null,null,null,null,null,null,null,null,null,null,null,null,null,16,"-",{"$f":"IFERROR(VLOOKUP(T56,LISTAS!$BD$2:$BG$24,4,FALSE),\"\")","v":""}]
[null,null,7,"-",{"$f":"IFERROR(VLOOKUP(C57,LISTAS!$BD$2:$BG$24,4,FALSE),\"\")","v":""},null,null,null,null,null,null,null,null,null,null,null,null,null,null,17,"-",{"$f":"IFERROR(VLOOKUP(T57,LISTAS!$BD$2:$BG$24,4,FALSE),\"\")","v":""}]
[null,null,8,"-",{"$f":"IFERROR(VLOOKUP(C58,LISTAS!$BD$2:$BG$24,4,FALSE),\"\")","v":""},null,null,null,null,null,null,null,null,null,null,null,null,null,null,18,"-",{"$f":"IFERROR(VLOOKUP(T58,LISTAS!$BD$2:$BG$24,4,FALSE),\"\")","v":""}]
[null,null,9,"-",{"$f":"IFERROR(VLOOKUP(C59,LISTAS!$BD$2:$BG$24,4,FALSE),\"\")","v":""},null,null,null,null,null,null,null,null,null,null,null,null,null,null,19,"-",{"$f":"IFERROR(VLOOKUP(T59,LISTAS!$BD$2:$BG$24,4,FALSE),\"\")","v":""}]
[null,null,10,"-",{"$f":"IFERROR(VLOOKUP(C60,LISTAS!$BD$2:$BG$24,4,FALSE),\"\")","v":""},null,null,null,null,null,null,null,null,null,null,null,null,null,null,20,"-",{"$f":"IFERROR(VLOOKUP(T60,LISTAS!$BD$2:$BG$24,4,FALSE),\"\")","v":""}]
[]
[]
[null,".",null,null,null,null,null,null,null,null,null,null,null,null,null,null,null,null,null,null,null,null,null,null,null,null,null,null,null,null,null,null,null,null,null,{"$f":"IF($B$63=\"\",\"\",'MOD1'!$AY$49&\" - \"&'MOD1'!$AY$2)","v":{"$error":"#VALUE!"}}]

{"sheet":"MOD8","index":11,"n_rows":219,"n_cols":42,"rows_kept":219,"cut":false,"hidden":true,"merged":[[212,2,212,37],[213,2,213,37],[207,2,207,37],[208,2,208,37],[209,2,209,37],[210,2,210,37],[211,2,211,37],[201,2,201,37],[202,2,202,37],[203,2,203,37],[204,2,204,37],[206,2,206,37],[195,2,195,37],[197,2,197,37],[198,2,198,37],[199,2,199,37],[200,2,200,37],[190,2,190,37],[191,2,191,37],[192,2,192,37],[193,2,193,37],[194,2,194,37],[184,2,184,37],[185,2,185,37],[186,2,186,37],[188,2,188,37],[189,2,189,37],[179,2,179,37],[180,2,180,37],[181,2,181,37],[182,2,182,37],[183,2,183,37],[173,2,173,37],[174,2,174,37],[175,2,175,37],[176,2,176,37],[177,2,177,37],[167,2,167,37],[168,2,168,37],[170,2,170,37],[171,2,171,37],[172,2,172,37],[169,2,169,37],[162,2,162,37],[163,2,163,37],[164,2,164,37],[165,2,165,37],[166,2,166,37],[156,2,156,37],[157,2,157,37],[158,2,158,37],[159,2,159,37],[161,2,161,37],[160,2,160,37],[150,2,150,37],[152,2,152,37],[153,2,153,37],[154,2,154,37],[155,2,155,37],[145,2,145,37],[146,2,146,37],[147,2,147,37],[148,2,148,37],[149,2,149,37],[151,2,151,37],[139,2,139,37],[140,2,140,37],[142,2,142,37],[143,2,143,37],[144,2,144,37],[134,2,134,37],[135,2,135,37],[136,2,136,37],[137,2,137,37],[138,2,138,37],[141,2,141,37],[128,2,128,37],[129,2,129,37],[130,2,130,37],[131,2,131,37],[133,2,133,37],[122,2,122,37],[123,2,123,37],[125,2,125,37],[126,2,126,37],[127,2,127,37],[124,2,124,37],[132,2,132,37],[117,2,117,37],[118,2,118,37],[119,2,119,37],[120,2,120,37],[121,2,121,37],[111,2,111,37],[112,2,112,37],[113,2,113,37],[114,2,114,37],[115,2,115,37],[116,2,116,37],[105,2,105,37],[106,2,106,37],[107,2,107,37],[109,2,109,37],[110,2,110,37],[99,2,99,37],[101,2,101,37],[102,2,102,37],[103,2,103,37],[104,2,104,37],[100,2,100,37],[108,2,108,37],[94,2,94,37],[95,2,95,37],[96,2,96,37],[97,2,97,37],[98,2,98,37],[88,2,88,37],[89,2,89,37],[90,2,90,37],[91,2,91,37],[93,2,93,37],[92,2,92,37],[82,2,82,37],[84,2,84,37],[85,2,85,37],[86,2,86,37],[87,2,87,37],[77,2,77,37],[78,2,78,37],[79,2,79,37],[80,2,80,37],[81,2,81,37],[83,2,83,37],[73,2,73,37],[74,2,74,37],[76,2,76,37],[65,2,65,37],[66,2,66,37],[68,2,68,37],[69,2,69,37],[70,2,70,37],[67,2,67,37],[75,2,75,37],[64,2,64,37],[54,2,54,37],[55,2,55,37],[56,2,56,37],[57,2,57,37],[58,2,58,37],[59,2,59,37],[71,2,71,37],[72,2,72,37],[211,38,211,39],[212,38,212,39],[148,38,148,39],[201,38,201,39],[37,2,37,37],[38,2,38,37],[39,2,39,37],[40,2,40,37],[42,2,42,37],[41,2,41,37],[48,2,48,37],[49,2,49,37],[51,2,51,37],[52,2,52,37],[53,2,53,37],[43,2,43,37],[44,2,44,37],[45,2,45,37],[46,2,46,37],[47,2,47,37],[50,2,50,37],[60,2,60,37],[61,2,61,37],[62,2,62,37],[70,38,70,39],[71,38,71,39],[72,38,72,39],[73,38,73,39],[78,38,78,39],[18,2,18,37],[19,2,19,37],[20,2,20,37],[21,2,21,37],[22,2,22,37],[23,2,23,37],[24,2,24,37],[26,2,26,37],[27,2,27,37],[28,2,28,37],[29,2,29,37],[30,2,30,37],[31,2,31,37],[32,2,32,37],[34,2,34,37],[35,2,35,37],[36,2,36,37],[33,2,33,37],[63,2,63,37],[89,38,89,39],[90,38,90,39],[95,38,95,39],[96,38,96,39],[97,38,97,39],[79,38,79,39],[80,38,80,39],[81,38,81,39],[87,38,87,39],[88,38,88,39],[202,38,202,39],[203,38,203,39],[209,38,209,39],[210,38,210,39],[191,38,191,39],[192,38,192,39],[193,38,193,39],[194,38,194,39],[200,38,200,39],[176,38,176,39],[182,38,182,39],[183,38,183,39],[184,38,184,39],[185,38,185,39],[166,38,166,39],[167,38,167,39],[173,38,173,39],[174,38,174,39],[175,38,175,39],[156,38,156,39],[157,38,157,39],[158,38,158,39],[164,38,164,39],[165,38,165,39],[146,38,146,39],[147,38,147,39],[149,38,149,39],[155,38,155,39],[119,38,119,39],[98,38,98,39],[103,38,103,39],[104,38,104,39],[105,38,105,39],[106,38,106,39],[139,38,139,39],[129,38,129,39],[130,38,130,39],[136,38,136,39],[137,38,137,39],[138,38,138,39],[120,38,120,39],[121,38,121,39],[122,38,122,39],[127,38,127,39],[128,38,128,39],[2,2,3,40],[4,2,16,40],[20,38,20,39],[21,38,21,39],[17,38,17,39],[25,2,25,37],[38,38,38,39],[39,38,39,39],[45,38,45,39],[30,38,30,39],[31,38,31,39],[36,38,36,39],[37,38,37,39],[178,2,178,37],[187,2,187,37],[196,2,196,37],[205,2,205,37],[214,2,214,37],[22,38,22,39],[23,38,23,39],[28,38,28,39],[29,38,29,39],[46,38,46,39],[57,38,57,39],[62,38,62,39],[63,38,63,39],[64,38,64,39],[65,38,65,39],[47,38,47,39],[48,38,48,39],[54,38,54,39],[55,38,55,39],[56,38,56,39],[111,38,111,39],[112,38,112,39],[113,38,113,39],[114,38,114,39]]}
[0]
[null,{"$f":"'MOD1'!$B$2","v":"Sistema de Monitoreo y Evaluación de la Educación Ambiental en la Gestión Escolar"}]
[null,null,{"$f":"\"DATOS REGISTRADOS\"","v":"DATOS REGISTRADOS"}]
[]
[null,null,{"$f":"CHAR(10)&CONCATENATE(\"Datos registrados por: \",CLEAN(TRIM(PROPER('MOD1'!D19))),\" \",CLEAN(TRIM(PROPER('MOD1'!AA19))),\", \",'MOD1'!$AP$18,\" \",IF('MOD1'!$AP$19=\"\",\" - \",'MOD1'!$AP$19),\", \",'MOD1'!$D$23,\" \",CLEAN(TRIM('MOD1'!$D$24)),\", \",'MOD1'!$AA$23,\" \",CLEAN(TRIM('MOD1'!$AA$24)),\", \",'MOD1'!$AP$23,\" \",IF('MOD1'!$AP$24=\"\",\" - \",'MOD1'!$AP$24),\", \",'MOD1'!$C$30,\" \",'MOD1'!$D$33,\" \",'MOD1'!$D$34,\", \",'MOD1'!$S$33,\" \",'MOD1'!$S$34,\", \",'MOD1'!$D$38,\" \",'MOD1'!$D$39)&CHAR(10)&CHAR(10)&CONCATENATE('MOD2'!$D$12,\" \",'MOD2'!$D$13,\", \",'MOD2'!$T$12,\" \",'MOD2'!$T$13,\" \",'MOD2'!$AJ$13,\", \",CLEAN(TRIM('MOD2'!$D$16)),\" \",'MOD2'!$D$18,\", \",'MOD2'!$L$16,\" \",'MOD2'!$L$18,\", \",'MOD2'!$T$17,\" \",'MOD2'!$T$18,\", \",'MOD2'!$AA$17,\" \",'MOD2'!$AA$18)&CHAR(10)&CHAR(10)&CONCATENATE('MOD2'!D24,\": \",IF('MOD2'!$B26=1,'MOD2'!D26,'MOD2'!D38),\", \",'MOD2'!M24,\": \",IF('MOD2'!$B26=1,'MOD2'!M26,'MOD2'!M38),\", \",'MOD2'!Q24,\": \",IF('MOD2'!$B26=1,'MOD2'!Q26,'MOD2'!Q38),\", \",'MOD2'!AH24,\": \",IF('MOD2'!$B26=1,'MOD2'!AH26,'MOD2'!AH38),\", \",'MOD2'!AM24,\": \",IF('MOD2'!$B26=1,'MOD2'!AM26,'MOD2'!AM38),\", \",'MOD2'!AP24,\" \",'MOD2'!AP25,\": \",IF('MOD2'!$B26=1,'MOD2'!AP26,'MOD2'!AP38),\", \",'MOD2'!AP24,\" \",'MOD2'!AR25,\": \",IF('MOD2'!$B26=1,'MOD2'!AR26,'MOD2'!AR38),\", \",'MOD2'!AT24,\" \",'MOD2'!AT25,\": \",IF('MOD2'!$B26=1,'MOD2'!AT26,'MOD2'!AT38),\", \",'MOD2'!AT24,\" \",'MOD2'!AV25,\": \",IF('MOD2'!$B26=1,'MOD2'!AV26,'MOD2'!AV38),\", \")&CHAR(10)&CHAR(10)&IF('MOD2'!$B28<>1,\"\",CONCATENATE('MOD2'!D24,\": \",'MOD2'!D28,\", \",'MOD2'!M24,\": \",'MOD2'!M28,\", \",'MOD2'!Q24,\": \",'MOD2'!Q28,\", \",'MOD2'!AH24,\": \",'MOD2'!AH28,\", \",'MOD2'!AM24,\": \",'MOD2'!AM28,\", \",'MOD2'!AP24,\" \",'MOD2'!AP25,\": \",'MOD2'!AP28,\", \",'MOD2'!AP24,\" \",'MOD2'!AR25,\": \",'MOD2'!AR28,\", \",'MOD2'!AT24,\" \",'MOD2'!AT25,\": \",'MOD2'!AT28,\", \",'MOD2'!AT24,\" \",'MOD2'!AV25,\": \",'MOD2'!AV28,\", \"))&IF('MOD2'!$B30<>1,\"\",CONCATENATE('MOD2'!D24,\": \",'MOD2'!D30,\", \",'MOD2'!M24,\": \",'MOD2'!M30,\", \",'MOD2'!Q24,\": \",'MOD2'!Q30,\", \",'MOD2'!AH24,\": \",'MOD2'!AH30,\", \",'MOD2'!AM24,\": \",'MOD2'!AM30,\", \",'MOD2'!AP24,\" \",'MOD2'!AP25,\": \",'MOD2'!AP30,\", \",'MOD2'!AP24,\" \",'MOD2'!AR25,\": \",'MOD2'!AR30,\", \",'MOD2'!AT24,\" \",'MOD2'!AT25,\": \",'MOD2'!AT30,\", \",'MOD2'!AT24,\" \",'MOD2'!AV25,\": \",'MOD2'!AV30,\", \"))&IF('MOD2'!$B40<>1,\"\",CONCATENATE('MOD2'!D24,\": \",'MOD2'!D40,\", \",'MOD2'!M24,\": \",'MOD2'!M40,\", \",'MOD2'!Q24,\": \",'MOD2'!Q40,\", \",'MOD2'!AH24,\": \",'MOD2'!AH40,\", \",'MOD2'!AM24,\": \",'MOD2'!AM40,\", \",'MOD2'!AP24,\" \",'MOD2'!AP25,\": \",'MOD2'!AP40,\", \",'MOD2'!AP24,\" \",'MOD2'!AR25,\": \",'MOD2'!AR40,\", \",'MOD2'!AT24,\" \",'MOD2'!AT25,\": \",'MOD2'!AT40,\", \",'MOD2'!AT24,\" \",'MOD2'!AV25,\": \",'MOD2'!AV40,\", \"))","v":"\nDatos registrados por:  , Teléfono personal:  - , Correo electrónico: , Cargo que desempeña: , Teléfono de la II.EE.:  - , Mi Institución Educativa está ubicada en... El departamento de: Seleccionar, La provincia de: Seleccionar, El distrito de: Seleccionar\n\nNombre de DRE o UGEL que supervisa la IE: , Apellidos y nombres del coodinador del comité ambiental de la IE:  , Cuenta con Plan de Salud Escolar: , Usuario de Qali Warma: , Público/Privado: , Dirección de la Institución Educativa: \n\nNivel educativo: , Código Modular: , Nombre de Institución Educativa - ESCALE: , Modalidad educativa: , Zona: , Estudiantes H: , Estudiantes M: , Docentes H: , Docentes M: , \n\n"}]
[]
[]
[]
[]
[]
[]
[]
[]
[]
[]
[]
[]
[null,null,null,null,null,null,null,null,null,null,null,null,null,null,null,null,null,null,null,null,null,null,null,null,null,null,null,null,null,null,null,null,null,null,null,null,null,null,"SI/NO"]
[null,1,{"$f":"MOD4_1!C9","v":"Gestión Escolar: Gestión Institucional y Gestión Pedagógica"}]
[null,null,"1. La I.E. cuenta con un Comité Ambiental reconocido e institucionalizado."]
[null,null,"El Comité Ambiental y sus comisiones, fueron reconocidos mediante Resolución directoral. ",null,null,null,null,null,null,null,null,null,null,null,null,null,null,null,null,null,null,null,null,null,null,null,null,null,null,null,null,null,null,null,null,null,null,null,{"$f":"LISTAS!D30","v":""}]
[null,null,"Las actividades del Comité Ambiental y sus comisiones están incluidas en el PAT.",null,null,null,null,null,null,null,null,null,null,null,null,null,null,null,null,null,null,null,null,null,null,null,null,null,null,null,null,null,null,null,null,null,null,null,{"$f":"LISTAS!D31","v":""}]
[null,null,"El Comité Ambiental cumplió con la cuota de género y/o interculturalidad (mínimo 30%) en su conformación, según corresponda. ",null,null,null,null,null,null,null,null,null,null,null,null,null,null,null,null,null,null,null,null,null,null,null,null,null,null,null,null,null,null,null,null,null,null,null,{"$f":"LISTAS!D32","v":""}]
[null,null,"El Comité Ambiental está conformado al menos por un (01) representante de la comunidad local (de instituciones privadas, públicas, organizaciones sociales, líderes y otros).",null,null,null,null,null,null,null,null,null,null,null,null,null,null,null,null,null,null,null,null,null,null,null,null,null,null,null,null,null,null,null,null,null,null,null,{"$f":"LISTAS!D33","v":""}]
[null,null,"Aspectos que la IIEE llegara a este logro, así como dificultades"]
[null,null,{"$f":"LISTAS!D34","v":""}]
[]
[null,null,"2. La I.E. actualizó y/o elaboró sus herramientas de gestión escolar con enfoque ambiental."]
[null,null,"La I.E. incluyó en el PEI, en el análisis situacional, su situación ambiental y vincula el diagnóstico al enfoque ambiental en la gestión escolar.",null,null,null,null,null,null,null,null,null,null,null,null,null,null,null,null,null,null,null,null,null,null,null,null,null,null,null,null,null,null,null,null,null,null,null,{"$f":"LISTAS!D35","v":""}]
[null,null,"El PEI de la I.E incorporó el enfoque ambiental en su visión y en los objetivos y/o metas de gestión escolar centrada en los aprendizajes. ",null,null,null,null,null,null,null,null,null,null,null,null,null,null,null,null,null,null,null,null,null,null,null,null,null,null,null,null,null,null,null,null,null,null,null,{"$f":"LISTAS!D36","v":""}]
[null,null,"La I.E. incorporó en el PAT las actividades ambientales estandarizadas consideradas en la presente matriz.",null,null,null,null,null,null,null,null,null,null,null,null,null,null,null,null,null,null,null,null,null,null,null,null,null,null,null,null,null,null,null,null,null,null,null,{"$f":"LISTAS!D37","v":""}]
[null,null,"La I.E. incorporó en su Reglamento Interno al Comité Ambiental.",null,null,null,null,null,null,null,null,null,null,null,null,null,null,null,null,null,null,null,null,null,null,null,null,null,null,null,null,null,null,null,null,null,null,null,{"$f":"LISTAS!D38","v":""}]
[null,null,"Aspectos que la IIEE llegara a este logro, así como dificultades"]
[null,null,{"$f":"LISTAS!D39","v":""}]
[]
[null,null,"3. La I.E. incluyó en el PCI el enfoque ambiental y empleó recursos pedagógicos ambientales propios de la localidad."]
[null,null,"El PCI incluyó el enfoque ambiental en los perfiles, los principios pedagógicos, los propósitos, y/o los enfoques metodológicos.",null,null,null,null,null,null,null,null,null,null,null,null,null,null,null,null,null,null,null,null,null,null,null,null,null,null,null,null,null,null,null,null,null,null,null,{"$f":"LISTAS!D40","v":""}]
[null,null,"La I.E. incluyó el enfoque ambiental en la programación curricular anual y unidades didácticas (en las situaciones significativas).",null,null,null,null,null,null,null,null,null,null,null,null,null,null,null,null,null,null,null,null,null,null,null,null,null,null,null,null,null,null,null,null,null,null,null,{"$f":"LISTAS!D41","v":""}]
[null,null,"La I.E. incluyó en las sesiones de aprendizaje las actividades del calendario ambiental nacional, local y/o comunal, así como los saberes y conocimientos ambientales locales.",null,null,null,null,null,null,null,null,null,null,null,null,null,null,null,null,null,null,null,null,null,null,null,null,null,null,null,null,null,null,null,null,null,null,null,{"$f":"LISTAS!D42","v":""}]
[null,null,"La I.E. incluyó en las sesiones de aprendizaje visitas pedagógicas a espacios naturales y culturales (áreas naturales protegidas, rutas de ecoturismo, proyectos de conservación, bosques comunitarios, playas locales, etc.).",null,null,null,null,null,null,null,null,null,null,null,null,null,null,null,null,null,null,null,null,null,null,null,null,null,null,null,null,null,null,null,null,null,null,null,{"$f":"LISTAS!D43","v":""}]
[null,null,"Aspectos que la IIEE llegara a este logro, así como dificultades"]
[null,null,{"$f":"LISTAS!D44","v":""}]
[]
[null,2,"Cambio climático"]
[null,null,"4. La I.E. realizó actividades de mitigación y adaptación frente al Cambio climático."]
[null,null,"La I.E. implementó actividades de recuperación de espacios en desuso, incremento y/o mantenimiento de áreas verdes dentro de la I.E., en el marco de la condición de cambio climático. ",null,null,null,null,null,null,null,null,null,null,null,null,null,null,null,null,null,null,null,null,null,null,null,null,null,null,null,null,null,null,null,null,null,null,null,{"$f":"LISTAS!D46","v":""}]
[null,null,"La I.E. implementó actividades pedagógicas de valoración y conservación de la diversidad biológica (flora y fauna, terrestre y acuática) y de los servicios ecosistémicos (lo servicios que el ambiente nos brinda), en el marco de la condición de cambio climático. ",null,null,null,null,null,null,null,null,null,null,null,null,null,null,null,null,null,null,null,null,null,null,null,null,null,null,null,null,null,null,null,null,null,null,null,{"$f":"LISTAS!D47","v":""}]
[null,null," La I.E. implementó actividades pedagógicas de promoción de la producción y consumo responsables (valoración de prácticas compatibles con el cuidado del ambiente y los recursos naturales), en el marco de la condición de cambio climático. ",null,null,null,null,null,null,null,null,null,null,null,null,null,null,null,null,null,null,null,null,null,null,null,null,null,null,null,null,null,null,null,null,null,null,null,{"$f":"LISTAS!D48","v":""}]
[null,null,"La I.E. implementó actividades a favor de la recuperación y/o mantenimiento de espacios públicos y áreas verdes aledañas a la I.E. y en la comunidad local (jornadas de limpieza, el abono y/o sembrado de árboles, otras actividades), en el marco de la condición de cambio climático. ",null,null,null,null,null,null,null,null,null,null,null,null,null,null,null,null,null,null,null,null,null,null,null,null,null,null,null,null,null,null,null,null,null,null,null,{"$f":"LISTAS!D49","v":""}]
[null,null,"Aspectos que la IIEE llegara a este logro, así como dificultades"]
[null,null,{"$f":"LISTAS!D50","v":""}]
[]
[null,3,"Ecoeficiencia"]
[null,null,"5. La I.E. realizó actividades de manejo de residuos sólidos. "]
[null,null,"La I.E. cuenta con un Plan de manejo de residuos sólidos, y actividades de las \"3R\" (Reducir, Reusar y Reciclar) incluidos en el PAT.",null,null,null,null,null,null,null,null,null,null,null,null,null,null,null,null,null,null,null,null,null,null,null,null,null,null,null,null,null,null,null,null,null,null,null,{"$f":"LISTAS!D52","v":""}]
[null,null,"La I.E. implementó actividades pedagógicas  sobre el manejo de residuos sólidos y la aplicación de las “3R”: Reducir, Reusar y Reciclar.",null,null,null,null,null,null,null,null,null,null,null,null,null,null,null,null,null,null,null,null,null,null,null,null,null,null,null,null,null,null,null,null,null,null,null,{"$f":"LISTAS!D53","v":""}]
[null,null,"La I.E. coordinó con el gobierno local u otras instituciones aliadas la recolección y transporte de los residuos para la disposición final de los residuos sólidos de la I.E., y/o el reaprovechamiento y comercialización.  ",null,null,null,null,null,null,null,null,null,null,null,null,null,null,null,null,null,null,null,null,null,null,null,null,null,null,null,null,null,null,null,null,null,null,null,{"$f":"LISTAS!D54","v":""}]
[null,null,"La I.E. sensibilizó  a las familias de la comunidad educativa y/o comunidad local  sobre el manejo de residuos sólidos y en actividades de las 3R: Reducir, Reusar y Reciclar.",null,null,null,null,null,null,null,null,null,null,null,null,null,null,null,null,null,null,null,null,null,null,null,null,null,null,null,null,null,null,null,null,null,null,null,{"$f":"LISTAS!D55","v":""}]
[null,null,"Aspectos que la IIEE llegara a este logro, así como dificultades"]
[null,null,{"$f":"LISTAS!D56","v":""}]
[]
[null,null,"6. La I.E. practicó el uso ecoeficiente de la energía."]
[null,null,"La I.E. ha adoptado medidas de uso ecoeficiente de la energía incluidos en el PAT. ",null,null,null,null,null,null,null,null,null,null,null,null,null,null,null,null,null,null,null,null,null,null,null,null,null,null,null,null,null,null,null,null,null,null,null,{"$f":"LISTAS!D57","v":""}]
[null,null,"La I.E. implementó actividades pedagógicas  sobre el consumo responsable de la energía, así como prácticas ecoeficientes asociadas (uso de focos ahorradores, entre otros).",null,null,null,null,null,null,null,null,null,null,null,null,null,null,null,null,null,null,null,null,null,null,null,null,null,null,null,null,null,null,null,null,null,null,null,{"$f":"LISTAS!D58","v":""}]
[null,null,"La I.E.  implementó actividades pedagógicas sobre la importancia del uso de medios de transporte menos nocivos para el ambiente (por ejemplo, transporte público compartido, bicicletas, caminatas, etc.).",null,null,null,null,null,null,null,null,null,null,null,null,null,null,null,null,null,null,null,null,null,null,null,null,null,null,null,null,null,null,null,null,null,null,null,{"$f":"LISTAS!D59","v":""}]
[null,null,"La I.E. sensibilizó a las familias de la comunidad educativa y/o comunidad local para el uso ecoeficiente de la energía.",null,null,null,null,null,null,null,null,null,null,null,null,null,null,null,null,null,null,null,null,null,null,null,null,null,null,null,null,null,null,null,null,null,null,null,{"$f":"LISTAS!D60","v":""}]
[null,null,"Aspectos que la IIEE llegara a este logro, así como dificultades"]
[null,null,{"$f":"LISTAS!D61","v":""}]
[]
[null,null,"7. La I.E. practicó el empleo de energía renovable."]
[null,null,"La I.E. ha incluido medidas sobre el empleo de energía renovable en el PAT. ",null,null,null,null,null,null,null,null,null,null,null,null,null,null,null,null,null,null,null,null,null,null,null,null,null,null,null,null,null,null,null,null,null,null,null,{"$f":"LISTAS!D62","v":""}]
[null,null,"La I.E. implementó actividades pedagógicas  sobre el uso de energía renovable, de acuerdo a su contexto. ",null,null,null,null,null,null,null,null,null,null,null,null,null,null,null,null,null,null,null,null,null,null,null,null,null,null,null,null,null,null,null,null,null,null,null,{"$f":"LISTAS!D63","v":""}]
[null,null,"La I.E. implementó actividades institucionales sobre el uso de la energía renovable (por ejemplo paneles solares), de acuerdo a su contexto.  ",null,null,null,null,null,null,null,null,null,null,null,null,null,null,null,null,null,null,null,null,null,null,null,null,null,null,null,null,null,null,null,null,null,null,null,{"$f":"LISTAS!D64","v":""}]
[null,null,"La I.E. sensibilizó a las familias de la comunidad educativa y/o comunidad local para el empleo de energía renovable.",null,null,null,null,null,null,null,null,null,null,null,null,null,null,null,null,null,null,null,null,null,null,null,null,null,null,null,null,null,null,null,null,null,null,null,{"$f":"LISTAS!D65","v":""}]
[null,null,"Aspectos que la IIEE llegara a este logro, así como dificultades"]
[null,null,{"$f":"LISTAS!D66","v":""}]
[]
[null,null,"8. La I.E. practicó la gestión integral y uso eficiente de los recursos hídricos."]
[null,null,"La I.E. ha incluido medidas para el ahorro y buen uso del agua en la I.E., fomentando una nueva cultura del agua, en el PAT.",null,null,null,null,null,null,null,null,null,null,null,null,null,null,null,null,null,null,null,null,null,null,null,null,null,null,null,null,null,null,null,null,null,null,null,{"$f":"LISTAS!D67","v":""}]
[null,null,"La I.E. ha incluido medidas para el acceso a agua segura en la I.E., fomentando una nueva cultura del agua, en el PAT.",null,null,null,null,null,null,null,null,null,null,null,null,null,null,null,null,null,null,null,null,null,null,null,null,null,null,null,null,null,null,null,null,null,null,null,{"$f":"LISTAS!D68","v":""}]
[null,null,"La I.E. implementó  actividades pedagógicas sobre la gestión integral de los recursos hídricos y una nueva cultura del agua (por ejemplo sobre la protección y conservación de la calidad del agua y de las cuencas hidrográficas; el ahorro y buen uso del agua; el acceso a agua segura; entre otros). ",null,null,null,null,null,null,null,null,null,null,null,null,null,null,null,null,null,null,null,null,null,null,null,null,null,null,null,null,null,null,null,null,null,null,null,{"$f":"LISTAS!D69","v":""}]
[null,null,"La I.E.  sensibilizó a las familias de la comunidad educativa y/o comunidad local para promover la gestión integral de recursos hídricos y una nueva cultura del agua en la I.E. y/o en la comunidad local.",null,null,null,null,null,null,null,null,null,null,null,null,null,null,null,null,null,null,null,null,null,null,null,null,null,null,null,null,null,null,null,null,null,null,null,{"$f":"LISTAS!D70","v":""}]
[null,null,"Aspectos que la IIEE llegara a este logro, así como dificultades"]
[null,null,{"$f":"LISTAS!D71","v":""}]
[]
[null,4,"Salud"]
[null,null,"9. La I.E. Implementó el Plan de Salud Escolar en la I.E."]
[null,null,"La I.E. ha incluido las actividades del Plan de Salud Escolar en el PAT.",null,null,null,null,null,null,null,null,null,null,null,null,null,null,null,null,null,null,null,null,null,null,null,null,null,null,null,null,null,null,null,null,null,null,null,{"$f":"LISTAS!D73","v":""}]
[null,null,"La I.E. entregó al establecimiento de Salud los Consentimientos Informados firmados del Plan de Salud Escolar que fueron entregados a los padres de familia.",null,null,null,null,null,null,null,null,null,null,null,null,null,null,null,null,null,null,null,null,null,null,null,null,null,null,null,null,null,null,null,null,null,null,null,{"$f":"LISTAS!D74","v":""}]
[null,null,"La I.E. preparó los espacios para las actividades del Plan de Salud Escolar.",null,null,null,null,null,null,null,null,null,null,null,null,null,null,null,null,null,null,null,null,null,null,null,null,null,null,null,null,null,null,null,null,null,null,null,{"$f":"LISTAS!D75","v":""}]
[null,null,"La I.E. estableció con el Establecimiento de Salud de su ámbito el cronograma de las actividades del Plan de Salud Escolar.",null,null,null,null,null,null,null,null,null,null,null,null,null,null,null,null,null,null,null,null,null,null,null,null,null,null,null,null,null,null,null,null,null,null,null,{"$f":"LISTAS!D76","v":""}]
[null,null,"Aspectos que la IIEE llegara a este logro, así como dificultades"]
[null,null,{"$f":"LISTAS!D77","v":""}]
[]
[null,null,"10. La I.E. implementa el servicio de alimentación provisto por Qali Warma."]
[null,null,"La I.E. ha incluido las actividades de Qali Warma en el PAT.",null,null,null,null,null,null,null,null,null,null,null,null,null,null,null,null,null,null,null,null,null,null,null,null,null,null,null,null,null,null,null,null,null,null,null,{"$f":"LISTAS!D78","v":""}]
[null,null,"El Comité de Alimentación Escolar (CAE) está conformado y todos sus miembros han sido capacitados.",null,null,null,null,null,null,null,null,null,null,null,null,null,null,null,null,null,null,null,null,null,null,null,null,null,null,null,null,null,null,null,null,null,null,null,{"$f":"LISTAS!D79","v":""}]
[null,null,"El CAE coordinó con el proveedor del servicio alimentario las fechas y horarios de entrega de alimentos a la IE.",null,null,null,null,null,null,null,null,null,null,null,null,null,null,null,null,null,null,null,null,null,null,null,null,null,null,null,null,null,null,null,null,null,null,null,{"$f":"LISTAS!D80","v":""}]
[null,null,"El CAE organizó los turnos y roles en la IE para la recepción, preparación y servido de los alimentos.",null,null,null,null,null,null,null,null,null,null,null,null,null,null,null,null,null,null,null,null,null,null,null,null,null,null,null,null,null,null,null,null,null,null,null,{"$f":"LISTAS!D81","v":""}]
[null,null,"Aspectos que la IIEE llegara a este logro, así como dificultades"]
[null,null,{"$f":"LISTAS!D82","v":""}]
[]
[null,null,"11. La I.E. implementó acciones sobre alimentación saludable y sostenible."]
[null,null,"La I.E. cuenta con una planificación de actividades, así como espacios educativos adecuados, para garantizar la alimentación saludable y sostenible, incluidos en el PAT. ",null,null,null,null,null,null,null,null,null,null,null,null,null,null,null,null,null,null,null,null,null,null,null,null,null,null,null,null,null,null,null,null,null,null,null,{"$f":"LISTAS!D83","v":""}]
[null,null,"La I.E. implementó y promovió actividades pedagógicas para el consumo de alimentos saludables y sostenibles, así como la revalorización y consumo de productos locales.",null,null,null,null,null,null,null,null,null,null,null,null,null,null,null,null,null,null,null,null,null,null,null,null,null,null,null,null,null,null,null,null,null,null,null,{"$f":"LISTAS!D84","v":""}]
[null,null,"La I.E. implementó y supervisó los quioscos, cafetines, cafeterías y/o comedores escolares así como las loncheras escolares, garantizando el acceso, la disponibilidad y el consumo de una alimentación saludable y sostenible, según la normativa vigente.",null,null,null,null,null,null,null,null,null,null,null,null,null,null,null,null,null,null,null,null,null,null,null,null,null,null,null,null,null,null,null,null,null,null,null,{"$f":"LISTAS!D85","v":""}]
[null,null,"La I.E. sensibilizó a las familias de la comunidad educativa para la adopción de una cultura de alimentación saludable y sostenible, así como la revalorización y consumo de productos locales. ",null,null,null,null,null,null,null,null,null,null,null,null,null,null,null,null,null,null,null,null,null,null,null,null,null,null,null,null,null,null,null,null,null,null,null,{"$f":"LISTAS!D86","v":""}]
[null,null,"Aspectos que la IIEE llegara a este logro, así como dificultades"]
[null,null,{"$f":"LISTAS!D87","v":""}]
[]
[null,null,"12. La I.E. implementó  acciones para la práctica de la higiene integral (lavado de manos, higiene bucal, aseo y cuidado personal). "]
[null,null,"La I.E. cuenta con una planificación de actividades, así como espacios educativos adecuados, para garantizar la puesta en práctica de hábitos de higiene integral, incluidos en el PAT.",null,null,null,null,null,null,null,null,null,null,null,null,null,null,null,null,null,null,null,null,null,null,null,null,null,null,null,null,null,null,null,null,null,null,null,{"$f":"LISTAS!D88","v":""}]
[null,null,"La I.E.  Implementó actividades pedagógicas sobre la importancia y la práctica diaria del lavado de manos (antes y después de las comidas y después del uso de los baños) e higiene bucal.",null,null,null,null,null,null,null,null,null,null,null,null,null,null,null,null,null,null,null,null,null,null,null,null,null,null,null,null,null,null,null,null,null,null,null,{"$f":"LISTAS!D89","v":""}]
[null,null,"La I.E. implementó actividades pedagógicas sobre la importancia y la práctica diaria de aseo y del cuidado personal (baño cotidiano, control de la pediculosis, ropa limpia, etc.). ",null,null,null,null,null,null,null,null,null,null,null,null,null,null,null,null,null,null,null,null,null,null,null,null,null,null,null,null,null,null,null,null,null,null,null,{"$f":"LISTAS!D90","v":""}]
[null,null,"La I.E. sensibilizó a las familias de la comunidad educativa y/o comunidad local en la adopción de hábitos de higiene integral.",null,null,null,null,null,null,null,null,null,null,null,null,null,null,null,null,null,null,null,null,null,null,null,null,null,null,null,null,null,null,null,null,null,null,null,{"$f":"LISTAS!D91","v":""}]
[null,null,"Aspectos que la IIEE llegara a este logro, así como dificultades"]
[null,null,{"$f":"LISTAS!D92","v":""}]
[]
[null,null,"13. La I.E. implementó actividades de mantenimiento, orden y limpieza de todos los ambientes como práctica cotidiana y para la prevención de enfermedades prevalentes."]
[null,null,"La I.E. cuenta con una planificación de actividades para promover entornos saludables a través del mantenimiento, orden y limpieza al interior y en los espacios exteriores de la I.E., incluidos en el PAT.",null,null,null,null,null,null,null,null,null,null,null,null,null,null,null,null,null,null,null,null,null,null,null,null,null,null,null,null,null,null,null,null,null,null,null,{"$f":"LISTAS!D93","v":""}]
[null,null,"La I.E. implementó actividades pedagógicas sobre la importancia y la práctica de la limpieza periódica, el orden, la ventilación e iluminación de espacios, como medidas de prevención de enfermedades prevalentes (EDAs, IRAs, Influenza, Dengue y otras de prevalencia local, TBC, entre otros).",null,null,null,null,null,null,null,null,null,null,null,null,null,null,null,null,null,null,null,null,null,null,null,null,null,null,null,null,null,null,null,null,null,null,null,{"$f":"LISTAS!D94","v":""}]
[null,null,"La I.E. implementó actividades institucionales orientadas a mantener la limpieza periódica, el orden, la ventilación e iluminación de espacios, así como la desinfección y fumigación de las aulas, los servicios higiénicos, y otros espacios físicos dentro de la I.E. como en los exteriores de la I.E. (el perímetro, jardines y otros).  ",null,null,null,null,null,null,null,null,null,null,null,null,null,null,null,null,null,null,null,null,null,null,null,null,null,null,null,null,null,null,null,null,null,null,null,{"$f":"LISTAS!D95","v":""}]
[null,null,"La I.E. sensibilizó a las familias de la comunidad educativa y/o comunidad local, y logra su participación en las actividades de conservación y limpieza de los espacios interiores y exteriores a la I.E como medidas preventivas de enfermedades prevalentes.",null,null,null,null,null,null,null,null,null,null,null,null,null,null,null,null,null,null,null,null,null,null,null,null,null,null,null,null,null,null,null,null,null,null,null,{"$f":"LISTAS!D96","v":""}]
[null,null,"Aspectos que la IIEE llegara a este logro, así como dificultades"]
[null,null,{"$f":"LISTAS!D97","v":""}]
[]
[null,null,"14. La I.E. adoptó medidas de protección frente a los efectos nocivos por la exposición a la radiación ultravioleta."]
[null,null,"La I.E. cuenta con una planificación de actividades para la implementación de acciones de protección y prevención de los efectos nocivos de la radiación solar (el uso del gorro/sombrero, gafas, uso permanente de bloqueadores solares, mallas raschel, tiempos para la formación de acuerdo a la normativa vigente, etc.) incluidos en el PAT.",null,null,null,null,null,null,null,null,null,null,null,null,null,null,null,null,null,null,null,null,null,null,null,null,null,null,null,null,null,null,null,null,null,null,null,{"$f":"LISTAS!D98","v":""}]
[null,null,"La I.E. implementó actividades pedagógicas para promover la prevención de los efectos nocivos de la radiación solar. ",null,null,null,null,null,null,null,null,null,null,null,null,null,null,null,null,null,null,null,null,null,null,null,null,null,null,null,null,null,null,null,null,null,null,null,{"$f":"LISTAS!D99","v":""}]
[null,null,"La I.E. implementó medidas y actividades institucionales para la prevención y protección de los efectos nocivos de la radiación solar (por ejemplo la instalación de techos y/o toldos con mallas de tipo raschel en patios, jardines u otros espacios; la dimsinución de los tiempos de las dinámicas de formación escolar al aire libre; entre otros).",null,null,null,null,null,null,null,null,null,null,null,null,null,null,null,null,null,null,null,null,null,null,null,null,null,null,null,null,null,null,null,null,null,null,null,{"$f":"LISTAS!D100","v":""}]
[null,null,"La I.E. sensibilizó a las familias de la comunidad educativa y/o comunidad local sobre las medidas de protección a implementar durante todos el año frente a los efectos nocivos por la exposición a la radiación ultravioleta.",null,null,null,null,null,null,null,null,null,null,null,null,null,null,null,null,null,null,null,null,null,null,null,null,null,null,null,null,null,null,null,null,null,null,null,{"$f":"LISTAS!D101","v":""}]
[null,null,"Aspectos que la IIEE llegara a este logro, así como dificultades"]
[null,null,{"$f":"LISTAS!D102","v":""}]
[]
[null,5,"Gestión del Riesgo de Desastres"]
[null,null,"15. La IE adoptó medidas para la Gestión del Riesgo de Desastres."]
[null,null,"La I.E. cuenta con una planificación de la gestión del Riesgo de Desastres  incluidos en el PAT.",null,null,null,null,null,null,null,null,null,null,null,null,null,null,null,null,null,null,null,null,null,null,null,null,null,null,null,null,null,null,null,null,null,null,null,{"$f":"LISTAS!D104","v":""}]
[null,null,"La I.E. implementó actividades pedagógicas sobre la gestión del riesgo de desastres, en el marco del enfoque ambiental. ",null,null,null,null,null,null,null,null,null,null,null,null,null,null,null,null,null,null,null,null,null,null,null,null,null,null,null,null,null,null,null,null,null,null,null,{"$f":"LISTAS!D105","v":""}]
[null,null,"La I.E. implementó actividades institucionales, incluyendo simulacros, para hacer frente a los desastres, en el marco del enfoque ambiental. ",null,null,null,null,null,null,null,null,null,null,null,null,null,null,null,null,null,null,null,null,null,null,null,null,null,null,null,null,null,null,null,null,null,null,null,{"$f":"LISTAS!D106","v":""}]
[null,null,"La I.E. sensibilizó  a las familias de la comunidad educativa y/o comunidad local en la gestión del riesgo frente a los desastres (sismos, friajes, inundaciones, y otros producto del cambio climático, según el contexto). ",null,null,null,null,null,null,null,null,null,null,null,null,null,null,null,null,null,null,null,null,null,null,null,null,null,null,null,null,null,null,null,null,null,null,null,{"$f":"LISTAS!D107","v":""}]
[null,null,"Aspectos que la IIEE llegara a este logro, así como dificultades"]
[null,null,{"$f":"LISTAS!D108","v":""}]
[]
[null,6,"PROYECTOS EDUCATIVOS AMBIENTALES INTEGRADOS"]
[null,null,"Espacio de Vida – EsVi"]
[null,null,"16. LA I.E. implementó un PEAI como recurso pedagógico y para el desarrollo de la conciencia ambiental y sobre la salud."]
[null,null,"El PEAI fue incluido en el PAT. ",null,null,null,null,null,null,null,null,null,null,null,null,null,null,null,null,null,null,null,null,null,null,null,null,null,null,null,null,null,null,null,null,null,null,null,{"$f":"LISTAS!D166","v":""}]
[null,null,"La I.E. implementó el PEAI con actividades pedagógicas articuladas mínimo a tres áreas curriculares. ",null,null,null,null,null,null,null,null,null,null,null,null,null,null,null,null,null,null,null,null,null,null,null,null,null,null,null,null,null,null,null,null,null,null,null,{"$f":"LISTAS!D167","v":""}]
[null,null,"La I.E. implementó actividades institucionales para la ejecución del PEAI a lo largo de todo el año escolar.",null,null,null,null,null,null,null,null,null,null,null,null,null,null,null,null,null,null,null,null,null,null,null,null,null,null,null,null,null,null,null,null,null,null,null,{"$f":"LISTAS!D168","v":""}]
[null,null,"El PEAI se implementó con apoyo de instituciones del sector público y/o privado.",null,null,null,null,null,null,null,null,null,null,null,null,null,null,null,null,null,null,null,null,null,null,null,null,null,null,null,null,null,null,null,null,null,null,null,{"$f":"LISTAS!D169","v":""}]
[null,null,"Aspectos que la IIEE llegara a este logro, así como dificultades"]
[null,null,{"$f":"LISTAS!D170","v":""}]
[]
[null,null,"Manejo de Residuos Sólidos – MARES"]
[null,null,"16. LA I.E. implementó un PEAI como recurso pedagógico y para el desarrollo de la conciencia ambiental y sobre la salud."]
[null,null,"El PEAI fue incluido en el PAT. ",null,null,null,null,null,null,null,null,null,null,null,null,null,null,null,null,null,null,null,null,null,null,null,null,null,null,null,null,null,null,null,null,null,null,null,{"$f":"LISTAS!D171","v":""}]
[null,null,"La I.E. implementó el PEAI con actividades pedagógicas articuladas mínimo a tres áreas curriculares. ",null,null,null,null,null,null,null,null,null,null,null,null,null,null,null,null,null,null,null,null,null,null,null,null,null,null,null,null,null,null,null,null,null,null,null,{"$f":"LISTAS!D172","v":""}]
[null,null,"La I.E. implementó actividades institucionales para la ejecución del PEAI a lo largo de todo el año escolar.",null,null,null,null,null,null,null,null,null,null,null,null,null,null,null,null,null,null,null,null,null,null,null,null,null,null,null,null,null,null,null,null,null,null,null,{"$f":"LISTAS!D173","v":""}]
[null,null,"El PEAI se implementó con apoyo de instituciones del sector público y/o privado.",null,null,null,null,null,null,null,null,null,null,null,null,null,null,null,null,null,null,null,null,null,null,null,null,null,null,null,null,null,null,null,null,null,null,null,{"$f":"LISTAS!D174","v":""}]
[null,null,"Aspectos que la IIEE llegara a este logro, así como dificultades",null,null,null,null,null,null,null,null,null,null,null,null,null,null,null,null,null,null,null,null,null,null,null,null,null,null,null,null,null,null,null,null,null,null,null,{"$f":"LISTAS!D175","v":""}]
[null,null,{"$f":"LISTAS!D175","v":""}]
[]
[null,null,"Vida y Verde – VIVE"]
[null,null,"16. LA I.E. implementó un PEAI como recurso pedagógico y para el desarrollo de la conciencia ambiental y sobre la salud."]
[null,null,"El PEAI fue incluido en el PAT. ",null,null,null,null,null,null,null,null,null,null,null,null,null,null,null,null,null,null,null,null,null,null,null,null,null,null,null,null,null,null,null,null,null,null,null,{"$f":"LISTAS!D176","v":""}]
[null,null,"La I.E. implementó el PEAI con actividades pedagógicas articuladas mínimo a tres áreas curriculares. ",null,null,null,null,null,null,null,null,null,null,null,null,null,null,null,null,null,null,null,null,null,null,null,null,null,null,null,null,null,null,null,null,null,null,null,{"$f":"LISTAS!D177","v":""}]
[null,null,"La I.E. implementó actividades institucionales para la ejecución del PEAI a lo largo de todo el año escolar.",null,null,null,null,null,null,null,null,null,null,null,null,null,null,null,null,null,null,null,null,null,null,null,null,null,null,null,null,null,null,null,null,null,null,null,{"$f":"LISTAS!D178","v":""}]
[null,null,"El PEAI se implementó con apoyo de instituciones del sector público y/o privado.",null,null,null,null,null,null,null,null,null,null,null,null,null,null,null,null,null,null,null,null,null,null,null,null,null,null,null,null,null,null,null,null,null,null,null,{"$f":"LISTAS!D179","v":""}]
[null,null,"Aspectos que la IIEE llegara a este logro, así como dificultades"]
[null,null,{"$f":"LISTAS!D180","v":""}]
[]
[null,null,"GLOBE Perú"]
[null,null,"16. LA I.E. implementó un PEAI como recurso pedagógico y para el desarrollo de la conciencia ambiental y sobre la salud."]
[null,null,"El PEAI fue incluido en el PAT. ",null,null,null,null,null,null,null,null,null,null,null,null,null,null,null,null,null,null,null,null,null,null,null,null,null,null,null,null,null,null,null,null,null,null,null,{"$f":"LISTAS!D181","v":""}]
[null,null,"La I.E. implementó el PEAI con actividades pedagógicas articuladas mínimo a tres áreas curriculares. ",null,null,null,null,null,null,null,null,null,null,null,null,null,null,null,null,null,null,null,null,null,null,null,null,null,null,null,null,null,null,null,null,null,null,null,{"$f":"LISTAS!D182","v":""}]
[null,null,"La I.E. implementó actividades institucionales para la ejecución del PEAI a lo largo de todo el año escolar.",null,null,null,null,null,null,null,null,null,null,null,null,null,null,null,null,null,null,null,null,null,null,null,null,null,null,null,null,null,null,null,null,null,null,null,{"$f":"LISTAS!D183","v":""}]
[null,null,"El PEAI se implementó con apoyo de instituciones del sector público y/o privado.",null,null,null,null,null,null,null,null,null,null,null,null,null,null,null,null,null,null,null,null,null,null,null,null,null,null,null,null,null,null,null,null,null,null,null,{"$f":"LISTAS!D184","v":""}]
[null,null,"Aspectos que la IIEE llegara a este logro, así como dificultades"]
[null,null,{"$f":"LISTAS!D185","v":""}]
[]
[null,null,"Mi Huella – Mido y reduzco mi huella de carbono"]
[null,null,"16. LA I.E. implementó un PEAI como recurso pedagógico y para el desarrollo de la conciencia ambiental y sobre la salud."]
[null,null,"El PEAI fue incluido en el PAT. ",null,null,null,null,null,null,null,null,null,null,null,null,null,null,null,null,null,null,null,null,null,null,null,null,null,null,null,null,null,null,null,null,null,null,null,{"$f":"LISTAS!D186","v":""}]
[null,null,"La I.E. implementó el PEAI con actividades pedagógicas articuladas mínimo a tres áreas curriculares. ",null,null,null,null,null,null,null,null,null,null,null,null,null,null,null,null,null,null,null,null,null,null,null,null,null,null,null,null,null,null,null,null,null,null,null,{"$f":"LISTAS!D187","v":""}]
[null,null,"La I.E. implementó actividades institucionales para la ejecución del PEAI a lo largo de todo el año escolar.",null,null,null,null,null,null,null,null,null,null,null,null,null,null,null,null,null,null,null,null,null,null,null,null,null,null,null,null,null,null,null,null,null,null,null,{"$f":"LISTAS!D188","v":""}]
[null,null,"El PEAI se implementó con apoyo de instituciones del sector público y/o privado.",null,null,null,null,null,null,null,null,null,null,null,null,null,null,null,null,null,null,null,null,null,null,null,null,null,null,null,null,null,null,null,null,null,null,null,{"$f":"LISTAS!D189","v":""}]
[null,null,"Aspectos que la IIEE llegara a este logro, así como dificultades"]
[null,null,{"$f":"LISTAS!D190","v":""}]
[]
[null,null,{"$f":"IF(LISTAS!AI22=\"\",\"Otros Proyectos 1\",LISTAS!AI22)","v":"Otros Proyectos 1"}]
[null,null,"16. LA I.E. implementó un PEAI como recurso pedagógico y para el desarrollo de la conciencia ambiental y sobre la salud."]
[null,null,"El PEAI fue incluido en el PAT. ",null,null,null,null,null,null,null,null,null,null,null,null,null,null,null,null,null,null,null,null,null,null,null,null,null,null,null,null,null,null,null,null,null,null,null,{"$f":"LISTAS!D191","v":""}]
[null,null,"La I.E. implementó el PEAI con actividades pedagógicas articuladas mínimo a tres áreas curriculares. ",null,null,null,null,null,null,null,null,null,null,null,null,null,null,null,null,null,null,null,null,null,null,null,null,null,null,null,null,null,null,null,null,null,null,null,{"$f":"LISTAS!D192","v":""}]
[null,null,"La I.E. implementó actividades institucionales para la ejecución del PEAI a lo largo de todo el año escolar.",null,null,null,null,null,null,null,null,null,null,null,null,null,null,null,null,null,null,null,null,null,null,null,null,null,null,null,null,null,null,null,null,null,null,null,{"$f":"LISTAS!D193","v":""}]
[null,null,"El PEAI se implementó con apoyo de instituciones del sector público y/o privado.",null,null,null,null,null,null,null,null,null,null,null,null,null,null,null,null,null,null,null,null,null,null,null,null,null,null,null,null,null,null,null,null,null,null,null,{"$f":"LISTAS!D194","v":""}]
[null,null,"Aspectos que la IIEE llegara a este logro, así como dificultades"]
[null,null,{"$f":"LISTAS!D195","v":""}]
[]
[null,null,{"$f":"IF(LISTAS!AI23=\"\",\"Otros Proyectos 2\",LISTAS!AI23)","v":"Otros Proyectos 2"}]
[null,null,"16. LA I.E. implementó un PEAI como recurso pedagógico y para el desarrollo de la conciencia ambiental y sobre la salud."]
[null,null,"El PEAI fue incluido en el PAT. ",null,null,null,null,null,null,null,null,null,null,null,null,null,null,null,null,null,null,null,null,null,null,null,null,null,null,null,null,null,null,null,null,null,null,null,{"$f":"LISTAS!D196","v":""}]
[null,null,"La I.E. implementó el PEAI con actividades pedagógicas articuladas mínimo a tres áreas curriculares. ",null,null,null,null,null,null,null,null,null,null,null,null,null,null,null,null,null,null,null,null,null,null,null,null,null,null,null,null,null,null,null,null,null,null,null,{"$f":"LISTAS!D197","v":""}]
[null,null,"La I.E. implementó actividades institucionales para la ejecución del PEAI a lo largo de todo el año escolar.",null,null,null,null,null,null,null,null,null,null,null,null,null,null,null,null,null,null,null,null,null,null,null,null,null,null,null,null,null,null,null,null,null,null,null,{"$f":"LISTAS!D198","v":""}]
[null,null,"El PEAI se implementó con apoyo de instituciones del sector público y/o privado.",null,null,null,null,null,null,null,null,null,null,null,null,null,null,null,null,null,null,null,null,null,null,null,null,null,null,null,null,null,null,null,null,null,null,null,{"$f":"LISTAS!D199","v":""}]
[null,null,"Aspectos que la IIEE llegara a este logro, así como dificultades"]
[null,null,{"$f":"LISTAS!D200","v":""}]
[]
[null,null,{"$f":"IF(LISTAS!AI24=\"\",\"Otros Proyectos 3\",LISTAS!AI24)","v":"Otros Proyectos 3"}]
[null,null,"16. LA I.E. implementó un PEAI como recurso pedagógico y para el desarrollo de la conciencia ambiental y sobre la salud."]
[null,null,"El PEAI fue incluido en el PAT. ",null,null,null,null,null,null,null,null,null,null,null,null,null,null,null,null,null,null,null,null,null,null,null,null,null,null,null,null,null,null,null,null,null,null,null,{"$f":"LISTAS!D201","v":""}]
[null,null,"La I.E. implementó el PEAI con actividades pedagógicas articuladas mínimo a tres áreas curriculares. ",null,null,null,null,null,null,null,null,null,null,null,null,null,null,null,null,null,null,null,null,null,null,null,null,null,null,null,null,null,null,null,null,null,null,null,{"$f":"LISTAS!D202","v":""}]
[null,null,"La I.E. implementó actividades institucionales para la ejecución del PEAI a lo largo de todo el año escolar.",null,null,null,null,null,null,null,null,null,null,null,null,null,null,null,null,null,null,null,null,null,null,null,null,null,null,null,null,null,null,null,null,null,null,null,{"$f":"LISTAS!D203","v":""}]
[null,null,"El PEAI se implementó con apoyo de instituciones del sector público y/o privado.",null,null,null,null,null,null,null,null,null,null,null,null,null,null,null,null,null,null,null,null,null,null,null,null,null,null,null,null,null,null,null,null,null,null,null,{"$f":"LISTAS!D204","v":""}]
[null,null,"Aspectos que la IIEE llegara a este logro, así como dificultades",null,null,null,null,null,null,null,null,null,null,null,null,null,null,null,null,null,null,null,null,null,null,null,null,null,null,null,null,null,null,null,null,null,null,null,{"$f":"LISTAS!D205","v":""}]
[null,null,{"$f":"LISTAS!D205","v":""}]
[]
[]
[]
[null,".",null,null,null,null,null,null,null,null,null,null,null,null,null,null,null,null,null,null,null,null,null,null,null,null,null,null,null,null,null,null,null,null,null,null,null,null,null,null,null,{"$f":"IF('MOD7'!AJ63=\"\",\"\",'MOD7'!$AJ$63)","v":{"$error":"#VALUE!"}}]

{"sheet":"MOD4_6_1","index":12,"n_rows":49,"n_cols":51,"rows_kept":49,"cut":false,"hidden":true,"merged":[[45,48,46,49],[45,26,46,27],[45,28,46,29],[45,30,46,31],[45,32,46,33],[45,34,46,35],[45,36,46,37],[45,38,46,39],[45,40,46,41],[45,42,46,43],[45,44,46,45],[45,46,46,47],[45,24,46,25],[45,2,46,3],[45,4,46,5],[45,6,46,7],[45,8,46,9],[45,10,46,11],[45,12,46,13],[45,14,46,15],[45,16,46,17],[45,18,46,19],[45,20,46,21],[45,22,46,23],[22,2,25,6],[22,7,25,13],[22,14,25,20],[22,21,25,27],[22,28,25,34],[42,3,43,28],[42,29,43,30],[42,32,43,36],[42,38,43,42],[42,44,43,48],[12,41,21,49],[20,7,21,13],[20,14,21,20],[20,21,21,27],[20,28,21,34],[12,35,25,40],[22,41,25,49],[12,2,21,6],[12,7,19,13],[12,14,19,20],[12,21,19,27],[12,28,19,34],[8,2,9,49],[10,2,11,6],[10,7,10,34],[10,35,11,40],[10,41,11,49],[11,7,11,13],[11,14,11,20],[11,21,11,27],[11,28,11,34]]}
[0]
[null,"Sistema de Monitoreo y Evaluación de la Educación Ambiental en la Gestión Escolar",null,null,null,null,null,null,null,null,null,null,null,null,null,null,null,null,null,null,null,null,null,null,null,null,null,null,null,null,null,null,null,null,null,null,null,null,null,null,null,null,null,null,null,null,null,null,null,null,{"$f":"IF('MOD1'!$AY$2=\"\",\"\",'MOD1'!$AY$2)","v":"Versión de la Herramienta: 1.5"}]
[]
[]
[]
[]
[]
[]
[null,null,{"$f":"LISTAS!AI17","v":"Espacio de Vida – EsVi"}]
[]
[null,null,"Actividades ambientales",null,null,null,null,"Hitos de aplicación del enfoque ambiental",null,null,null,null,null,null,null,null,null,null,null,null,null,null,null,null,null,null,null,null,null,null,null,null,null,null,null,"Indicador",null,null,null,null,null,"Aspectos que la IIEE llegara a este logro, así como dificultades"]
[null,null,null,null,null,null,null,"A",null,null,null,null,null,null,"B",null,null,null,null,null,null,"C",null,null,null,null,null,null,"D"]
[null,null,{"$f":"LISTAS!AJ17","v":"16. LA I.E. implementó un PEAI como recurso pedagógico y para el desarrollo de la conciencia ambiental y sobre la salud."},null,null,null,null,{"$f":"LISTAS!AK17","v":"El PEAI fue incluido en el PAT. "},null,null,null,null,null,null,{"$f":"LISTAS!AL17","v":"La I.E. implementó el PEAI con actividades pedagógicas articuladas mínimo a tres áreas curriculares. "},null,null,null,null,null,null,{"$f":"LISTAS!AM17","v":"La I.E. implementó actividades institucionales para la ejecución del PEAI a lo largo de todo el año escolar."},null,null,null,null,null,null,{"$f":"LISTAS!AN17","v":"El PEAI se implementó con apoyo de instituciones del sector público y/o privado."},null,null,null,null,null,null,{"$f":"LISTAS!AO17","v":"N° de hitos de aplicación del enfoque ambiental puestos en práctica en la implementación del PEAI."}]
[]
[]
[]
[]
[]
[]
[]
[]
[]
[null,null,"Medios de verificación",null,null,null,null,{"$f":"LISTAS!AP17","v":"PAT."},null,null,null,null,null,null,{"$f":"LISTAS!AQ17","v":"Plan de Trabajo del PEAI. PCI."},null,null,null,null,null,null,{"$f":"LISTAS!AR17","v":"PAT."},null,null,null,null,null,null,{"$f":"LISTAS!AS17","v":"Documentos administrativos: Cartas, Oficios, Memo. Actas, Convenios, Acuerdos."},null,null,null,null,null,null,null,null,null,null,null,null,""]
[]
[]
[]
[]
[]
[]
[]
[]
[]
[]
[]
[]
[]
[]
[]
[]
[]
[]
[]
[null,null,null,{"$f":"REPT(CHAR(73),42*(COUNTIF(H21:AI22,\"*\")))","v":""},null,null,null,null,null,null,null,null,null,null,null,null,null,null,null,null,null,null,null,null,null,null,null,null,null,{"$f":"IF(COUNTIF(H21:AI22,\"*\")=4,\"a\",\"\")","v":""},null,null,null,null,null,null,null,null,{"$f":"\"PEAI\"","v":"PEAI"}]
[]
[]
[null,null,"%",null,"&",null,"N",null,"O",null,"Y",null,"b",null,"h",null,"Š",null,"\u008f",null,"§",null,"¨",null,"þ",null,"H",null,"J",null,"M",null,"P",null,"Q",null,"z",null,"~",null,"á",null,"%",null,"&",null,"N",null,"O"]
[]
[]
[null,{"$f":"IF(VALUE(INFO(\"VERSION\"))<14,\"Probablemente la herramienta no pueda operar correctamente por ser una versión muy antigua de MS-Excel, comuníquese con Gestión de la Información!\",IF(ISERROR(CONCATENATE(\"Versión del Sistema Operativo: \",INFO(\"VERSIONSO\"),\",     Versión de MS-Excel: \",INFO(\"VERSION\"))),\"Probablemente la herramienta no pueda operar correctamente, comuníquese con Gestión de la Información!\",CONCATENATE(\"Versión del Sistema Operativo: \",INFO(\"VERSIONSO\"),\",     Versión de MS-Excel: \",INFO(\"VERSION\"))))","v":{"$error":"#VALUE!"}},null,null,null,null,null,null,null,null,null,null,null,null,null,null,null,null,null,null,null,null,null,null,null,null,null,null,null,null,null,null,null,null,null,null,null,null,null,null,null,null,null,null,null,null,null,null,null,null,{"$f":"IF('MOD1'!$AY$49=\"\",\"\",'MOD1'!$AY$49)","v":{"$error":"#VALUE!"}}]

{"sheet":"MOD4_6_2","index":13,"n_rows":49,"n_cols":51,"rows_kept":49,"cut":false,"hidden":true,"merged":[[45,48,46,49],[45,26,46,27],[45,28,46,29],[45,30,46,31],[45,32,46,33],[45,34,46,35],[45,36,46,37],[45,38,46,39],[45,40,46,41],[45,42,46,43],[45,44,46,45],[45,46,46,47],[45,24,46,25],[45,2,46,3],[45,4,46,5],[45,6,46,7],[45,8,46,9],[45,10,46,11],[45,12,46,13],[45,14,46,15],[45,16,46,17],[45,18,46,19],[45,20,46,21],[45,22,46,23],[22,2,25,6],[22,7,25,13],[22,14,25,20],[22,21,25,27],[22,28,25,34],[42,3,43,28],[42,29,43,30],[42,32,43,36],[42,38,43,42],[42,44,43,48],[12,41,21,49],[20,7,21,13],[20,14,21,20],[20,21,21,27],[20,28,21,34],[12,35,25,40],[22,41,25,49],[12,2,21,6],[12,7,19,13],[12,14,19,20],[12,21,19,27],[12,28,19,34],[8,2,9,49],[10,2,11,6],[10,7,10,34],[10,35,11,40],[10,41,11,49],[11,7,11,13],[11,14,11,20],[11,21,11,27],[11,28,11,34]]}
[0]
[null,"Sistema de Monitoreo y Evaluación de la Educación Ambiental en la Gestión Escolar",null,null,null,null,null,null,null,null,null,null,null,null,null,null,null,null,null,null,null,null,null,null,null,null,null,null,null,null,null,null,null,null,null,null,null,null,null,null,null,null,null,null,null,null,null,null,null,null,{"$f":"IF('MOD1'!$AY$2=\"\",\"\",'MOD1'!$AY$2)","v":"Versión de la Herramienta: 1.5"}]
[]
[]
[]
[]
[]
[]
[null,null,{"$f":"LISTAS!AI18","v":"Manejo de Residuos Sólidos – MARES"}]
[]
[null,null,"Actividades ambientales",null,null,null,null,"Hitos de aplicación del enfoque ambiental",null,null,null,null,null,null,null,null,null,null,null,null,null,null,null,null,null,null,null,null,null,null,null,null,null,null,null,"Indicador",null,null,null,null,null,"Aspectos que la IIEE llegara a este logro, así como dificultades"]
[null,null,null,null,null,null,null,"A",null,null,null,null,null,null,"B",null,null,null,null,null,null,"C",null,null,null,null,null,null,"D"]
[null,null,{"$f":"LISTAS!AJ18","v":"16. LA I.E. implementó un PEAI como recurso pedagógico y para el desarrollo de la conciencia ambiental y sobre la salud."},null,null,null,null,{"$f":"LISTAS!AK18","v":"El PEAI fue incluido en el PAT. "},null,null,null,null,null,null,{"$f":"LISTAS!AL18","v":"La I.E. implementó el PEAI con actividades pedagógicas articuladas mínimo a tres áreas curriculares. "},null,null,null,null,null,null,{"$f":"LISTAS!AM18","v":"La I.E. implementó actividades institucionales para la ejecución del PEAI a lo largo de todo el año escolar."},null,null,null,null,null,null,{"$f":"LISTAS!AN18","v":"El PEAI se implementó con apoyo de instituciones del sector público y/o privado."},null,null,null,null,null,null,{"$f":"LISTAS!AO18","v":"N° de hitos de aplicación del enfoque ambiental puestos en práctica en la implementación del PEAI."}]
[]
[]
[]
[]
[]
[]
[]
[]
[]
[null,null,"Medios de verificación",null,null,null,null,{"$f":"LISTAS!AP18","v":"PAT."},null,null,null,null,null,null,{"$f":"LISTAS!AQ18","v":"Plan de Trabajo del PEAI. PCI."},null,null,null,null,null,null,{"$f":"LISTAS!AR18","v":"PAT."},null,null,null,null,null,null,{"$f":"LISTAS!AS18","v":"Documentos administrativos: Cartas, Oficios, Memo. Actas, Convenios, Acuerdos."},null,null,null,null,null,null,null,null,null,null,null,null,""]
[]
[]
[]
[]
[]
[]
[]
[]
[]
[]
[]
[]
[]
[]
[]
[]
[]
[]
[]
[null,null,null,{"$f":"REPT(CHAR(73),42*(COUNTIF(H21:AI22,\"*\")))","v":""},null,null,null,null,null,null,null,null,null,null,null,null,null,null,null,null,null,null,null,null,null,null,null,null,null,{"$f":"IF(COUNTIF(H21:AI22,\"*\")=4,\"a\",\"\")","v":""},null,null,null,null,null,null,null,null,{"$f":"\"PEAI\"","v":"PEAI"}]
[]
[]
[null,null,"%",null,"&",null,"N",null,"O",null,"Y",null,"b",null,"h",null,"Š",null,"\u008f",null,"§",null,"¨",null,"þ",null,"H",null,"J",null,"M",null,"P",null,"Q",null,"z",null,"~",null,"á",null,"%",null,"&",null,"N",null,"O"]
[]
[]
[null,{"$f":"IF(VALUE(INFO(\"VERSION\"))<14,\"Probablemente la herramienta no pueda operar correctamente por ser una versión muy antigua de MS-Excel, comuníquese con Gestión de la Información!\",IF(ISERROR(CONCATENATE(\"Versión del Sistema Operativo: \",INFO(\"VERSIONSO\"),\",     Versión de MS-Excel: \",INFO(\"VERSION\"))),\"Probablemente la herramienta no pueda operar correctamente, comuníquese con Gestión de la Información!\",CONCATENATE(\"Versión del Sistema Operativo: \",INFO(\"VERSIONSO\"),\",     Versión de MS-Excel: \",INFO(\"VERSION\"))))","v":{"$error":"#VALUE!"}},null,null,null,null,null,null,null,null,null,null,null,null,null,null,null,null,null,null,null,null,null,null,null,null,null,null,null,null,null,null,null,null,null,null,null,null,null,null,null,null,null,null,null,null,null,null,null,null,{"$f":"IF('MOD1'!$AY$49=\"\",\"\",'MOD1'!$AY$49)","v":{"$error":"#VALUE!"}}]

{"sheet":"MOD4_6_3","index":14,"n_rows":49,"n_cols":51,"rows_kept":49,"cut":false,"hidden":true,"merged":[[45,48,46,49],[45,26,46,27],[45,28,46,29],[45,30,46,31],[45,32,46,33],[45,34,46,35],[45,36,46,37],[45,38,46,39],[45,40,46,41],[45,42,46,43],[45,44,46,45],[45,46,46,47],[45,24,46,25],[45,2,46,3],[45,4,46,5],[45,6,46,7],[45,8,46,9],[45,10,46,11],[45,12,46,13],[45,14,46,15],[45,16,46,17],[45,18,46,19],[45,20,46,21],[45,22,46,23],[22,2,25,6],[22,7,25,13],[22,14,25,20],[22,21,25,27],[22,28,25,34],[42,3,43,28],[42,29,43,30],[42,32,43,36],[42,38,43,42],[42,44,43,48],[12,41,21,49],[20,7,21,13],[20,14,21,20],[20,21,21,27],[20,28,21,34],[12,35,25,40],[22,41,25,49],[12,2,21,6],[12,7,19,13],[12,14,19,20],[12,21,19,27],[12,28,19,34],[8,2,9,49],[10,2,11,6],[10,7,10,34],[10,35,11,40],[10,41,11,49],[11,7,11,13],[11,14,11,20],[11,21,11,27],[11,28,11,34]]}
[0]
[null,"Sistema de Monitoreo y Evaluación de la Educación Ambiental en la Gestión Escolar",null,null,null,null,null,null,null,null,null,null,null,null,null,null,null,null,null,null,null,null,null,null,null,null,null,null,null,null,null,null,null,null,null,null,null,null,null,null,null,null,null,null,null,null,null,null,null,null,{"$f":"IF('MOD1'!$AY$2=\"\",\"\",'MOD1'!$AY$2)","v":"Versión de la Herramienta: 1.5"}]
[]
[]
[]
[]
[]
[]
[null,null,{"$f":"LISTAS!AI19","v":"Vida y Verde – VIVE"}]
[]
[null,null,"Actividades ambientales",null,null,null,null,"Hitos de aplicación del enfoque ambiental",null,null,null,null,null,null,null,null,null,null,null,null,null,null,null,null,null,null,null,null,null,null,null,null,null,null,null,"Indicador",null,null,null,null,null,"Aspectos que la IIEE llegara a este logro, así como dificultades"]
[null,null,null,null,null,null,null,"A",null,null,null,null,null,null,"B",null,null,null,null,null,null,"C",null,null,null,null,null,null,"D"]
[null,null,{"$f":"LISTAS!AJ19","v":"16. LA I.E. implementó un PEAI como recurso pedagógico y para el desarrollo de la conciencia ambiental y sobre la salud."},null,null,null,null,{"$f":"LISTAS!AK19","v":"El PEAI fue incluido en el PAT. "},null,null,null,null,null,null,{"$f":"LISTAS!AL19","v":"La I.E. implementó el PEAI con actividades pedagógicas articuladas mínimo a tres áreas curriculares. "},null,null,null,null,null,null,{"$f":"LISTAS!AM19","v":"La I.E. implementó actividades institucionales para la ejecución del PEAI a lo largo de todo el año escolar."},null,null,null,null,null,null,{"$f":"LISTAS!AN19","v":"El PEAI se implementó con apoyo de instituciones del sector público y/o privado."},null,null,null,null,null,null,{"$f":"LISTAS!AO19","v":"N° de hitos de aplicación del enfoque ambiental puestos en práctica en la implementación del PEAI."}]
[]
[]
[]
[]
[]
[]
[]
[]
[]
[null,null,"Medios de verificación",null,null,null,null,{"$f":"LISTAS!AP19","v":"PAT."},null,null,null,null,null,null,{"$f":"LISTAS!AQ19","v":"Plan de Trabajo del PEAI. PCI."},null,null,null,null,null,null,{"$f":"LISTAS!AR19","v":"PAT."},null,null,null,null,null,null,{"$f":"LISTAS!AS19","v":"Documentos administrativos: Cartas, Oficios, Memo. Actas, Convenios, Acuerdos."},null,null,null,null,null,null,null,null,null,null,null,null,""]
[]
[]
[]
[]
[]
[]
[]
[]
[]
[]
[]
[]
[]
[]
[]
[]
[]
[]
[]
[null,null,null,{"$f":"REPT(CHAR(73),42*(COUNTIF(H21:AI22,\"*\")))","v":""},null,null,null,null,null,null,null,null,null,null,null,null,null,null,null,null,null,null,null,null,null,null,null,null,null,{"$f":"IF(COUNTIF(H21:AI22,\"*\")=4,\"a\",\"\")","v":""},null,null,null,null,null,null,null,null,{"$f":"\"PEAI\"","v":"PEAI"}]
[]
[]
[null,null,"%",null,"&",null,"N",null,"O",null,"Y",null,"b",null,"h",null,"Š",null,"\u008f",null,"§",null,"¨",null,"þ",null,"H",null,"J",null,"M",null,"P",null,"Q",null,"z",null,"~",null,"á",null,"%",null,"&",null,"N",null,"O"]
[]
[]
[null,{"$f":"IF(VALUE(INFO(\"VERSION\"))<14,\"Probablemente la herramienta no pueda operar correctamente por ser una versión muy antigua de MS-Excel, comuníquese con Gestión de la Información!\",IF(ISERROR(CONCATENATE(\"Versión del Sistema Operativo: \",INFO(\"VERSIONSO\"),\",     Versión de MS-Excel: \",INFO(\"VERSION\"))),\"Probablemente la herramienta no pueda operar correctamente, comuníquese con Gestión de la Información!\",CONCATENATE(\"Versión del Sistema Operativo: \",INFO(\"VERSIONSO\"),\",     Versión de MS-Excel: \",INFO(\"VERSION\"))))","v":{"$error":"#VALUE!"}},null,null,null,null,null,null,null,null,null,null,null,null,null,null,null,null,null,null,null,null,null,null,null,null,null,null,null,null,null,null,null,null,null,null,null,null,null,null,null,null,null,null,null,null,null,null,null,null,{"$f":"IF('MOD1'!$AY$49=\"\",\"\",'MOD1'!$AY$49)","v":{"$error":"#VALUE!"}}]

{"sheet":"MOD4_6_4","index":15,"n_rows":49,"n_cols":51,"rows_kept":49,"cut":false,"hidden":true,"merged":[[45,48,46,49],[45,26,46,27],[45,28,46,29],[45,30,46,31],[45,32,46,33],[45,34,46,35],[45,36,46,37],[45,38,46,39],[45,40,46,41],[45,42,46,43],[45,44,46,45],[45,46,46,47],[45,24,46,25],[45,2,46,3],[45,4,46,5],[45,6,46,7],[45,8,46,9],[45,10,46,11],[45,12,46,13],[45,14,46,15],[45,16,46,17],[45,18,46,19],[45,20,46,21],[45,22,46,23],[22,2,25,6],[22,7,25,13],[22,14,25,20],[22,21,25,27],[22,28,25,34],[42,3,43,28],[42,29,43,30],[42,32,43,36],[42,38,43,42],[42,44,43,48],[12,41,21,49],[20,7,21,13],[20,14,21,20],[20,21,21,27],[20,28,21,34],[12,35,25,40],[22,41,25,49],[12,2,21,6],[12,7,19,13],[12,14,19,20],[12,21,19,27],[12,28,19,34],[8,2,9,49],[10,2,11,6],[10,7,10,34],[10,35,11,40],[10,41,11,49],[11,7,11,13],[11,14,11,20],[11,21,11,27],[11,28,11,34]]}
[0]
[null,"Sistema de Monitoreo y Evaluación de la Educación Ambiental en la Gestión Escolar",null,null,null,null,null,null,null,null,null,null,null,null,null,null,null,null,null,null,null,null,null,null,null,null,null,null,null,null,null,null,null,null,null,null,null,null,null,null,null,null,null,null,null,null,null,null,null,null,{"$f":"IF('MOD1'!$AY$2=\"\",\"\",'MOD1'!$AY$2)","v":"Versión de la Herramienta: 1.5"}]
[]
[]
[]
[]
[]
[]
[null,null,{"$f":"LISTAS!AI20","v":"GLOBE Perú"}]
[]
[null,null,"Actividades ambientales",null,null,null,null,"Hitos de aplicación del enfoque ambiental",null,null,null,null,null,null,null,null,null,null,null,null,null,null,null,null,null,null,null,null,null,null,null,null,null,null,null,"Indicador",null,null,null,null,null,"Aspectos que la IIEE llegara a este logro, así como dificultades"]
[null,null,null,null,null,null,null,"A",null,null,null,null,null,null,"B",null,null,null,null,null,null,"C",null,null,null,null,null,null,"D"]
[null,null,{"$f":"LISTAS!AJ20","v":"16. LA I.E. implementó un PEAI como recurso pedagógico y para el desarrollo de la conciencia ambiental y sobre la salud."},null,null,null,null,{"$f":"LISTAS!AK20","v":"El PEAI fue incluido en el PAT. "},null,null,null,null,null,null,{"$f":"LISTAS!AL20","v":"La I.E. implementó el PEAI con actividades pedagógicas articuladas mínimo a tres áreas curriculares. "},null,null,null,null,null,null,{"$f":"LISTAS!AM20","v":"La I.E. implementó actividades institucionales para la ejecución del PEAI a lo largo de todo el año escolar."},null,null,null,null,null,null,{"$f":"LISTAS!AN20","v":"El PEAI se implementó con apoyo de instituciones del sector público y/o privado."},null,null,null,null,null,null,{"$f":"LISTAS!AO20","v":"N° de hitos de aplicación del enfoque ambiental puestos en práctica en la implementación del PEAI."}]
[]
[]
[]
[]
[]
[]
[]
[]
[]
[null,null,"Medios de verificación",null,null,null,null,{"$f":"LISTAS!AP20","v":"PAT."},null,null,null,null,null,null,{"$f":"LISTAS!AQ20","v":"Plan de Trabajo del PEAI. PCI."},null,null,null,null,null,null,{"$f":"LISTAS!AR20","v":"PAT."},null,null,null,null,null,null,{"$f":"LISTAS!AS20","v":"Documentos administrativos: Cartas, Oficios, Memo. Actas, Convenios, Acuerdos."},null,null,null,null,null,null,null,null,null,null,null,null,""]
[]
[]
[]
[]
[]
[]
[]
[]
[]
[]
[]
[]
[]
[]
[]
[]
[]
[]
[]
[null,null,null,{"$f":"REPT(CHAR(73),42*(COUNTIF(H21:AI22,\"*\")))","v":""},null,null,null,null,null,null,null,null,null,null,null,null,null,null,null,null,null,null,null,null,null,null,null,null,null,{"$f":"IF(COUNTIF(H21:AI22,\"*\")=4,\"a\",\"\")","v":""},null,null,null,null,null,null,null,null,{"$f":"\"PEAI\"","v":"PEAI"}]
[]
[]
[null,null,"%",null,"&",null,"N",null,"O",null,"Y",null,"b",null,"h",null,"Š",null,"\u008f",null,"§",null,"¨",null,"þ",null,"H",null,"J",null,"M",null,"P",null,"Q",null,"z",null,"~",null,"á",null,"%",null,"&",null,"N",null,"O"]
[]
[]
[null,{"$f":"IF(VALUE(INFO(\"VERSION\"))<14,\"Probablemente la herramienta no pueda operar correctamente por ser una versión muy antigua de MS-Excel, comuníquese con Gestión de la Información!\",IF(ISERROR(CONCATENATE(\"Versión del Sistema Operativo: \",INFO(\"VERSIONSO\"),\",     Versión de MS-Excel: \",INFO(\"VERSION\"))),\"Probablemente la herramienta no pueda operar correctamente, comuníquese con Gestión de la Información!\",CONCATENATE(\"Versión del Sistema Operativo: \",INFO(\"VERSIONSO\"),\",     Versión de MS-Excel: \",INFO(\"VERSION\"))))","v":{"$error":"#VALUE!"}},null,null,null,null,null,null,null,null,null,null,null,null,null,null,null,null,null,null,null,null,null,null,null,null,null,null,null,null,null,null,null,null,null,null,null,null,null,null,null,null,null,null,null,null,null,null,null,null,{"$f":"IF('MOD1'!$AY$49=\"\",\"\",'MOD1'!$AY$49)","v":{"$error":"#VALUE!"}}]

{"sheet":"MOD4_6_5","index":16,"n_rows":49,"n_cols":51,"rows_kept":49,"cut":false,"hidden":true,"merged":[[45,48,46,49],[45,26,46,27],[45,28,46,29],[45,30,46,31],[45,32,46,33],[45,34,46,35],[45,36,46,37],[45,38,46,39],[45,40,46,41],[45,42,46,43],[45,44,46,45],[45,46,46,47],[45,24,46,25],[45,2,46,3],[45,4,46,5],[45,6,46,7],[45,8,46,9],[45,10,46,11],[45,12,46,13],[45,14,46,15],[45,16,46,17],[45,18,46,19],[45,20,46,21],[45,22,46,23],[22,2,25,6],[22,7,25,13],[22,14,25,20],[22,21,25,27],[22,28,25,34],[42,3,43,28],[42,29,43,30],[42,32,43,36],[42,38,43,42],[42,44,43,48],[12,41,21,49],[20,7,21,13],[20,14,21,20],[20,21,21,27],[20,28,21,34],[12,35,25,40],[22,41,25,49],[12,2,21,6],[12,7,19,13],[12,14,19,20],[12,21,19,27],[12,28,19,34],[8,2,9,49],[10,2,11,6],[10,7,10,34],[10,35,11,40],[10,41,11,49],[11,7,11,13],[11,14,11,20],[11,21,11,27],[11,28,11,34]]}
[0]
[null,"Sistema de Monitoreo y Evaluación de la Educación Ambiental en la Gestión Escolar",null,null,null,null,null,null,null,null,null,null,null,null,null,null,null,null,null,null,null,null,null,null,null,null,null,null,null,null,null,null,null,null,null,null,null,null,null,null,null,null,null,null,null,null,null,null,null,null,{"$f":"IF('MOD1'!$AY$2=\"\",\"\",'MOD1'!$AY$2)","v":"Versión de la Herramienta: 1.5"}]
[]
[]
[]
[]
[]
[]
[null,null,{"$f":"LISTAS!AI21","v":"Mi Huella – Mido y reduzco mi huella de carbono"}]
[]
[null,null,"Actividades ambientales",null,null,null,null,"Hitos de aplicación del enfoque ambiental",null,null,null,null,null,null,null,null,null,null,null,null,null,null,null,null,null,null,null,null,null,null,null,null,null,null,null,"Indicador",null,null,null,null,null,"Aspectos que la IIEE llegara a este logro, así como dificultades"]
[null,null,null,null,null,null,null,"A",null,null,null,null,null,null,"B",null,null,null,null,null,null,"C",null,null,null,null,null,null,"D"]
[null,null,{"$f":"LISTAS!AJ21","v":"16. LA I.E. implementó un PEAI como recurso pedagógico y para el desarrollo de la conciencia ambiental y sobre la salud."},null,null,null,null,{"$f":"LISTAS!AK21","v":"El PEAI fue incluido en el PAT. "},null,null,null,null,null,null,{"$f":"LISTAS!AL21","v":"La I.E. implementó el PEAI con actividades pedagógicas articuladas mínimo a tres áreas curriculares. "},null,null,null,null,null,null,{"$f":"LISTAS!AM21","v":"La I.E. implementó actividades institucionales para la ejecución del PEAI a lo largo de todo el año escolar."},null,null,null,null,null,null,{"$f":"LISTAS!AN21","v":"El PEAI se implementó con apoyo de instituciones del sector público y/o privado."},null,null,null,null,null,null,{"$f":"LISTAS!AO21","v":"N° de hitos de aplicación del enfoque ambiental puestos en práctica en la implementación del PEAI."}]
[]
[]
[]
[]
[]
[]
[]
[]
[]
[null,null,"Medios de verificación",null,null,null,null,{"$f":"LISTAS!AP21","v":"PAT."},null,null,null,null,null,null,{"$f":"LISTAS!AQ21","v":"Plan de Trabajo del PEAI. PCI."},null,null,null,null,null,null,{"$f":"LISTAS!AR21","v":"PAT."},null,null,null,null,null,null,{"$f":"LISTAS!AS21","v":"Documentos administrativos: Cartas, Oficios, Memo. Actas, Convenios, Acuerdos."},null,null,null,null,null,null,null,null,null,null,null,null,""]
[]
[]
[]
[]
[]
[]
[]
[]
[]
[]
[]
[]
[]
[]
[]
[]
[]
[]
[]
[null,null,null,{"$f":"REPT(CHAR(73),42*(COUNTIF(H21:AI22,\"*\")))","v":""},null,null,null,null,null,null,null,null,null,null,null,null,null,null,null,null,null,null,null,null,null,null,null,null,null,{"$f":"IF(COUNTIF(H21:AI22,\"*\")=4,\"a\",\"\")","v":""},null,null,null,null,null,null,null,null,{"$f":"\"PEAI\"","v":"PEAI"}]
[]
[]
[null,null,"%",null,"&",null,"N",null,"O",null,"Y",null,"b",null,"h",null,"Š",null,"\u008f",null,"§",null,"¨",null,"þ",null,"H",null,"J",null,"M",null,"P",null,"Q",null,"z",null,"~",null,"á",null,"%",null,"&",null,"N",null,"O"]
[]
[]
[null,{"$f":"IF(VALUE(INFO(\"VERSION\"))<14,\"Probablemente la herramienta no pueda operar correctamente por ser una versión muy antigua de MS-Excel, comuníquese con Gestión de la Información!\",IF(ISERROR(CONCATENATE(\"Versión del Sistema Operativo: \",INFO(\"VERSIONSO\"),\",     Versión de MS-Excel: \",INFO(\"VERSION\"))),\"Probablemente la herramienta no pueda operar correctamente, comuníquese con Gestión de la Información!\",CONCATENATE(\"Versión del Sistema Operativo: \",INFO(\"VERSIONSO\"),\",     Versión de MS-Excel: \",INFO(\"VERSION\"))))","v":{"$error":"#VALUE!"}},null,null,null,null,null,null,null,null,null,null,null,null,null,null,null,null,null,null,null,null,null,null,null,null,null,null,null,null,null,null,null,null,null,null,null,null,null,null,null,null,null,null,null,null,null,null,null,null,{"$f":"IF('MOD1'!$AY$49=\"\",\"\",'MOD1'!$AY$49)","v":{"$error":"#VALUE!"}}]

{"sheet":"MOD4_6_6","index":17,"n_rows":49,"n_cols":51,"rows_kept":49,"cut":false,"hidden":true,"merged":[[45,48,46,49],[45,26,46,27],[45,28,46,29],[45,30,46,31],[45,32,46,33],[45,34,46,35],[45,36,46,37],[45,38,46,39],[45,40,46,41],[45,42,46,43],[45,44,46,45],[45,46,46,47],[45,24,46,25],[45,2,46,3],[45,4,46,5],[45,6,46,7],[45,8,46,9],[45,10,46,11],[45,12,46,13],[45,14,46,15],[45,16,46,17],[45,18,46,19],[45,20,46,21],[45,22,46,23],[22,2,25,6],[22,7,25,13],[22,14,25,20],[22,21,25,27],[22,28,25,34],[42,3,43,28],[42,29,43,30],[42,32,43,36],[42,38,43,42],[42,44,43,48],[12,41,21,49],[20,7,21,13],[20,14,21,20],[20,21,21,27],[20,28,21,34],[12,35,25,40],[22,41,25,49],[12,2,21,6],[12,7,19,13],[12,14,19,20],[12,21,19,27],[12,28,19,34],[8,2,9,49],[10,2,11,6],[10,7,10,34],[10,35,11,40],[10,41,11,49],[11,7,11,13],[11,14,11,20],[11,21,11,27],[11,28,11,34]]}
[0]
[null,"Sistema de Monitoreo y Evaluación de la Educación Ambiental en la Gestión Escolar",null,null,null,null,null,null,null,null,null,null,null,null,null,null,null,null,null,null,null,null,null,null,null,null,null,null,null,null,null,null,null,null,null,null,null,null,null,null,null,null,null,null,null,null,null,null,null,null,{"$f":"IF('MOD1'!$AY$2=\"\",\"\",'MOD1'!$AY$2)","v":"Versión de la Herramienta: 1.5"}]
[]
[]
[]
[]
[]
[]
[null,null,{"$f":"LISTAS!AI22","v":""}]
[]
[null,null,"Actividades ambientales",null,null,null,null,"Hitos de aplicación del enfoque ambiental",null,null,null,null,null,null,null,null,null,null,null,null,null,null,null,null,null,null,null,null,null,null,null,null,null,null,null,"Indicador",null,null,null,null,null,"Aspectos que la IIEE llegara a este logro, así como dificultades"]
[null,null,null,null,null,null,null,"A",null,null,null,null,null,null,"B",null,null,null,null,null,null,"C",null,null,null,null,null,null,"D"]
[null,null,{"$f":"LISTAS!AJ22","v":"16. LA I.E. implementó un PEAI como recurso pedagógico y para el desarrollo de la conciencia ambiental y sobre la salud."},null,null,null,null,{"$f":"LISTAS!AK22","v":"El PEAI fue incluido en el PAT. "},null,null,null,null,null,null,{"$f":"LISTAS!AL22","v":"La I.E. implementó el PEAI con actividades pedagógicas articuladas mínimo a tres áreas curriculares. "},null,null,null,null,null,null,{"$f":"LISTAS!AM22","v":"La I.E. implementó actividades institucionales para la ejecución del PEAI a lo largo de todo el año escolar."},null,null,null,null,null,null,{"$f":"LISTAS!AN22","v":"El PEAI se implementó con apoyo de instituciones del sector público y/o privado."},null,null,null,null,null,null,{"$f":"LISTAS!AO22","v":"N° de hitos de aplicación del enfoque ambiental puestos en práctica en la implementación del PEAI."}]
[]
[]
[]
[]
[]
[]
[]
[]
[]
[null,null,"Medios de verificación",null,null,null,null,{"$f":"LISTAS!AP22","v":"PAT."},null,null,null,null,null,null,{"$f":"LISTAS!AQ22","v":"Plan de Trabajo del PEAI. PCI."},null,null,null,null,null,null,{"$f":"LISTAS!AR22","v":"PAT."},null,null,null,null,null,null,{"$f":"LISTAS!AS22","v":"Documentos administrativos: Cartas, Oficios, Memo. Actas, Convenios, Acuerdos."},null,null,null,null,null,null,null,null,null,null,null,null,""]
[]
[]
[]
[]
[]
[]
[]
[]
[]
[]
[]
[]
[]
[]
[]
[]
[]
[]
[]
[null,null,null,{"$f":"REPT(CHAR(73),42*(COUNTIF(H21:AI22,\"*\")))","v":""},null,null,null,null,null,null,null,null,null,null,null,null,null,null,null,null,null,null,null,null,null,null,null,null,null,{"$f":"IF(COUNTIF(H21:AI22,\"*\")=4,\"a\",\"\")","v":""},null,null,null,null,null,null,null,null,{"$f":"\"PEAI\"","v":"PEAI"}]
[]
[]
[null,null,"%",null,"&",null,"N",null,"O",null,"Y",null,"b",null,"h",null,"Š",null,"\u008f",null,"§",null,"¨",null,"þ",null,"H",null,"J",null,"M",null,"P",null,"Q",null,"z",null,"~",null,"á",null,"%",null,"&",null,"N",null,"O"]
[]
[]
[null,{"$f":"IF(VALUE(INFO(\"VERSION\"))<14,\"Probablemente la herramienta no pueda operar correctamente por ser una versión muy antigua de MS-Excel, comuníquese con Gestión de la Información!\",IF(ISERROR(CONCATENATE(\"Versión del Sistema Operativo: \",INFO(\"VERSIONSO\"),\",     Versión de MS-Excel: \",INFO(\"VERSION\"))),\"Probablemente la herramienta no pueda operar correctamente, comuníquese con Gestión de la Información!\",CONCATENATE(\"Versión del Sistema Operativo: \",INFO(\"VERSIONSO\"),\",     Versión de MS-Excel: \",INFO(\"VERSION\"))))","v":{"$error":"#VALUE!"}},null,null,null,null,null,null,null,null,null,null,null,null,null,null,null,null,null,null,null,null,null,null,null,null,null,null,null,null,null,null,null,null,null,null,null,null,null,null,null,null,null,null,null,null,null,null,null,null,{"$f":"IF('MOD1'!$AY$49=\"\",\"\",'MOD1'!$AY$49)","v":{"$error":"#VALUE!"}}]

{"sheet":"MOD4_6_7","index":18,"n_rows":49,"n_cols":51,"rows_kept":49,"cut":false,"hidden":true,"merged":[[45,48,46,49],[45,26,46,27],[45,28,46,29],[45,30,46,31],[45,32,46,33],[45,34,46,35],[45,36,46,37],[45,38,46,39],[45,40,46,41],[45,42,46,43],[45,44,46,45],[45,46,46,47],[45,24,46,25],[45,2,46,3],[45,4,46,5],[45,6,46,7],[45,8,46,9],[45,10,46,11],[45,12,46,13],[45,14,46,15],[45,16,46,17],[45,18,46,19],[45,20,46,21],[45,22,46,23],[22,2,25,6],[22,7,25,13],[22,14,25,20],[22,21,25,27],[22,28,25,34],[42,3,43,28],[42,29,43,30],[42,32,43,36],[42,38,43,42],[42,44,43,48],[12,41,21,49],[20,7,21,13],[20,14,21,20],[20,21,21,27],[20,28,21,34],[12,35,25,40],[22,41,25,49],[12,2,21,6],[12,7,19,13],[12,14,19,20],[12,21,19,27],[12,28,19,34],[8,2,9,49],[10,2,11,6],[10,7,10,34],[10,35,11,40],[10,41,11,49],[11,7,11,13],[11,14,11,20],[11,21,11,27],[11,28,11,34]]}
[0]
[null,"Sistema de Monitoreo y Evaluación de la Educación Ambiental en la Gestión Escolar",null,null,null,null,null,null,null,null,null,null,null,null,null,null,null,null,null,null,null,null,null,null,null,null,null,null,null,null,null,null,null,null,null,null,null,null,null,null,null,null,null,null,null,null,null,null,null,null,{"$f":"IF('MOD1'!$AY$2=\"\",\"\",'MOD1'!$AY$2)","v":"Versión de la Herramienta: 1.5"}]
[]
[]
[]
[]
[]
[]
[null,null,{"$f":"LISTAS!AI23","v":""}]
[]
[null,null,"Actividades ambientales",null,null,null,null,"Hitos de aplicación del enfoque ambiental",null,null,null,null,null,null,null,null,null,null,null,null,null,null,null,null,null,null,null,null,null,null,null,null,null,null,null,"Indicador",null,null,null,null,null,"Aspectos que la IIEE llegara a este logro, así como dificultades"]
[null,null,null,null,null,null,null,"A",null,null,null,null,null,null,"B",null,null,null,null,null,null,"C",null,null,null,null,null,null,"D"]
[null,null,{"$f":"LISTAS!AJ23","v":"16. LA I.E. implementó un PEAI como recurso pedagógico y para el desarrollo de la conciencia ambiental y sobre la salud."},null,null,null,null,{"$f":"LISTAS!AK23","v":"El PEAI fue incluido en el PAT. "},null,null,null,null,null,null,{"$f":"LISTAS!AL23","v":"La I.E. implementó el PEAI con actividades pedagógicas articuladas mínimo a tres áreas curriculares. "},null,null,null,null,null,null,{"$f":"LISTAS!AM23","v":"La I.E. implementó actividades institucionales para la ejecución del PEAI a lo largo de todo el año escolar."},null,null,null,null,null,null,{"$f":"LISTAS!AN23","v":"El PEAI se implementó con apoyo de instituciones del sector público y/o privado."},null,null,null,null,null,null,{"$f":"LISTAS!AO23","v":"N° de hitos de aplicación del enfoque ambiental puestos en práctica en la implementación del PEAI."}]
[]
[]
[]
[]
[]
[]
[]
[]
[]
[null,null,"Medios de verificación",null,null,null,null,{"$f":"LISTAS!AP23","v":"PAT."},null,null,null,null,null,null,{"$f":"LISTAS!AQ23","v":"Plan de Trabajo del PEAI. PCI."},null,null,null,null,null,null,{"$f":"LISTAS!AR23","v":"PAT."},null,null,null,null,null,null,{"$f":"LISTAS!AS23","v":"Documentos administrativos: Cartas, Oficios, Memo. Actas, Convenios, Acuerdos."},null,null,null,null,null,null,null,null,null,null,null,null,""]
[]
[]
[]
[]
[]
[]
[]
[]
[]
[]
[]
[]
[]
[]
[]
[]
[]
[]
[]
[null,null,null,{"$f":"REPT(CHAR(73),42*(COUNTIF(H21:AI22,\"*\")))","v":""},null,null,null,null,null,null,null,null,null,null,null,null,null,null,null,null,null,null,null,null,null,null,null,null,null,{"$f":"IF(COUNTIF(H21:AI22,\"*\")=4,\"a\",\"\")","v":""},null,null,null,null,null,null,null,null,{"$f":"\"PEAI\"","v":"PEAI"}]
[]
[]
[null,null,"%",null,"&",null,"N",null,"O",null,"Y",null,"b",null,"h",null,"Š",null,"\u008f",null,"§",null,"¨",null,"þ",null,"H",null,"J",null,"M",null,"P",null,"Q",null,"z",null,"~",null,"á",null,"%",null,"&",null,"N",null,"O"]
[]
[]
[null,{"$f":"IF(VALUE(INFO(\"VERSION\"))<14,\"Probablemente la herramienta no pueda operar correctamente por ser una versión muy antigua de MS-Excel, comuníquese con Gestión de la Información!\",IF(ISERROR(CONCATENATE(\"Versión del Sistema Operativo: \",INFO(\"VERSIONSO\"),\",     Versión de MS-Excel: \",INFO(\"VERSION\"))),\"Probablemente la herramienta no pueda operar correctamente, comuníquese con Gestión de la Información!\",CONCATENATE(\"Versión del Sistema Operativo: \",INFO(\"VERSIONSO\"),\",     Versión de MS-Excel: \",INFO(\"VERSION\"))))","v":{"$error":"#VALUE!"}},null,null,null,null,null,null,null,null,null,null,null,null,null,null,null,null,null,null,null,null,null,null,null,null,null,null,null,null,null,null,null,null,null,null,null,null,null,null,null,null,null,null,null,null,null,null,null,null,{"$f":"IF('MOD1'!$AY$49=\"\",\"\",'MOD1'!$AY$49)","v":{"$error":"#VALUE!"}}]

{"sheet":"MOD4_6_8","index":19,"n_rows":49,"n_cols":51,"rows_kept":49,"cut":false,"hidden":true,"merged":[[45,48,46,49],[45,26,46,27],[45,28,46,29],[45,30,46,31],[45,32,46,33],[45,34,46,35],[45,36,46,37],[45,38,46,39],[45,40,46,41],[45,42,46,43],[45,44,46,45],[45,46,46,47],[45,24,46,25],[45,2,46,3],[45,4,46,5],[45,6,46,7],[45,8,46,9],[45,10,46,11],[45,12,46,13],[45,14,46,15],[45,16,46,17],[45,18,46,19],[45,20,46,21],[45,22,46,23],[22,2,25,6],[22,7,25,13],[22,14,25,20],[22,21,25,27],[22,28,25,34],[42,3,43,28],[42,29,43,30],[42,32,43,36],[42,38,43,42],[42,44,43,48],[12,41,21,49],[20,7,21,13],[20,14,21,20],[20,21,21,27],[20,28,21,34],[12,35,25,40],[22,41,25,49],[12,2,21,6],[12,7,19,13],[12,14,19,20],[12,21,19,27],[12,28,19,34],[8,2,9,49],[10,2,11,6],[10,7,10,34],[10,35,11,40],[10,41,11,49],[11,7,11,13],[11,14,11,20],[11,21,11,27],[11,28,11,34]]}
[0]
[null,"Sistema de Monitoreo y Evaluación de la Educación Ambiental en la Gestión Escolar",null,null,null,null,null,null,null,null,null,null,null,null,null,null,null,null,null,null,null,null,null,null,null,null,null,null,null,null,null,null,null,null,null,null,null,null,null,null,null,null,null,null,null,null,null,null,null,null,{"$f":"IF('MOD1'!$AY$2=\"\",\"\",'MOD1'!$AY$2)","v":"Versión de la Herramienta: 1.5"}]
[]
[]
[]
[]
[]
[]
[null,null,{"$f":"LISTAS!AI24","v":""}]
[]
[null,null,"Actividades ambientales",null,null,null,null,"Hitos de aplicación del enfoque ambiental",null,null,null,null,null,null,null,null,null,null,null,null,null,null,null,null,null,null,null,null,null,null,null,null,null,null,null,"Indicador",null,null,null,null,null,"Aspectos que la IIEE llegara a este logro, así como dificultades"]
[null,null,null,null,null,null,null,"A",null,null,null,null,null,null,"B",null,null,null,null,null,null,"C",null,null,null,null,null,null,"D"]
[null,null,{"$f":"LISTAS!AJ24","v":"16. LA I.E. implementó un PEAI como recurso pedagógico y para el desarrollo de la conciencia ambiental y sobre la salud."},null,null,null,null,{"$f":"LISTAS!AK24","v":"El PEAI fue incluido en el PAT. "},null,null,null,null,null,null,{"$f":"LISTAS!AL24","v":"La I.E. implementó el PEAI con actividades pedagógicas articuladas mínimo a tres áreas curriculares. "},null,null,null,null,null,null,{"$f":"LISTAS!AM24","v":"La I.E. implementó actividades institucionales para la ejecución del PEAI a lo largo de todo el año escolar."},null,null,null,null,null,null,{"$f":"LISTAS!AN24","v":"El PEAI se implementó con apoyo de instituciones del sector público y/o privado."},null,null,null,null,null,null,{"$f":"LISTAS!AO24","v":"N° de hitos de aplicación del enfoque ambiental puestos en práctica en la implementación del PEAI."}]
[]
[]
[]
[]
[]
[]
[]
[]
[]
[null,null,"Medios de verificación",null,null,null,null,{"$f":"LISTAS!AP24","v":"PAT."},null,null,null,null,null,null,{"$f":"LISTAS!AQ24","v":"Plan de Trabajo del PEAI. PCI."},null,null,null,null,null,null,{"$f":"LISTAS!AR24","v":"PAT."},null,null,null,null,null,null,{"$f":"LISTAS!AS24","v":"Documentos administrativos: Cartas, Oficios, Memo. Actas, Convenios, Acuerdos."},null,null,null,null,null,null,null,null,null,null,null,null,""]
[]
[]
[]
[]
[]
[]
[]
[]
[]
[]
[]
[]
[]
[]
[]
[]
[]
[]
[]
[null,null,null,{"$f":"REPT(CHAR(73),42*(COUNTIF(H21:AI22,\"*\")))","v":""},null,null,null,null,null,null,null,null,null,null,null,null,null,null,null,null,null,null,null,null,null,null,null,null,null,{"$f":"IF(COUNTIF(H21:AI22,\"*\")=4,\"a\",\"\")","v":""},null,null,null,null,null,null,null,null,{"$f":"\"PEAI\"","v":"PEAI"}]
[]
[]
[null,null,"%",null,"&",null,"N",null,"O",null,"Y",null,"b",null,"h",null,"Š",null,"\u008f",null,"§",null,"¨",null,"þ",null,"H",null,"J",null,"M",null,"P",null,"Q",null,"z",null,"~",null,"á",null,"%",null,"&",null,"N",null,"O"]
[]
[]
[null,{"$f":"IF(VALUE(INFO(\"VERSION\"))<14,\"Probablemente la herramienta no pueda operar correctamente por ser una versión muy antigua de MS-Excel, comuníquese con Gestión de la Información!\",IF(ISERROR(CONCATENATE(\"Versión del Sistema Operativo: \",INFO(\"VERSIONSO\"),\",     Versión de MS-Excel: \",INFO(\"VERSION\"))),\"Probablemente la herramienta no pueda operar correctamente, comuníquese con Gestión de la Información!\",CONCATENATE(\"Versión del Sistema Operativo: \",INFO(\"VERSIONSO\"),\",     Versión de MS-Excel: \",INFO(\"VERSION\"))))","v":{"$error":"#VALUE!"}},null,null,null,null,null,null,null,null,null,null,null,null,null,null,null,null,null,null,null,null,null,null,null,null,null,null,null,null,null,null,null,null,null,null,null,null,null,null,null,null,null,null,null,null,null,null,null,null,{"$f":"IF('MOD1'!$AY$49=\"\",\"\",'MOD1'!$AY$49)","v":{"$error":"#VALUE!"}}]

{"sheet":"LISTAS","index":20,"n_rows":1864,"n_cols":78,"rows_kept":1864,"cut":false,"hidden":false,"merged":[]}
[null,null,null,null,null,null,"DEPAR",null,0,"DEPAR","PROVI",null,{"$f":"O1&\" \"&P1&\" \"&Q1","v":"DEPAR PROVI DISTR"},0,"DEPAR","PROVI","DISTR","CODGEO",null,0,"REGION","UNIDAD EJECUTORA","UGEL",null,0,"UGEL",null,0,"PROVI",null,0,"DISTR",null,"ITEM","COMPONENTE","ACTIVIDAD","A","B","C","D","INDICADOR","VA","VB","VC","VD","VO",null,null,null,null,null,"N","NOMBRE","CODGEO",null,null,null,null,null,{"$f":"IF(ISERROR(VLOOKUP(BH2,$F$30:$F$205,1,FALSE))=FALSE,1,0)","v":0},{"$f":"IF(ISERROR(VLOOKUP(BI2,$F$30:$F$205,1,FALSE))=FALSE,1,0)","v":0},0,0,0,0,0,0,0,0,0,0,0,0,0,0,0,0,0]
[null,null,"APELLIDOS",{"$f":"IF('MOD1'!D19=\"\",\"\",'MOD1'!D19)","v":""},null,null,"Seleccionar",null,{"$f":"IF($D$9=J2,I1+1,0)","v":0},"AMAZONAS","BAGUA",null,{"$f":"O2&\" \"&P2&\" \"&Q2","v":"AMAZONAS BAGUA ARAMANGO"},{"$f":"IF(AND($D$9=O2,$D$10=P2),N1+1,0)","v":0},"AMAZONAS","BAGUA","ARAMANGO","C010202",null,{"$f":"IF($D$9=U2,T1+1,0)","v":0},"AMAZONAS","303. EDUCACION BAGUA CAPITAL","UGEL BAGUA",null,1,{"$f":"IFERROR(VLOOKUP(Y2,T1:W222,4,FALSE),\"\")","v":""},null,1,{"$f":"IFERROR(VLOOKUP(AB2,$I$1:$K$197,3,FALSE),\"\")","v":""},null,1,{"$f":"IFERROR(VLOOKUP(AE2,$N$1:$R$1864,4,FALSE),\"\")","v":""},null,1,"Gestión Escolar: Gestión Institucional y Gestión Pedagógica","1. La I.E. cuenta con un Comité Ambiental reconocido e institucionalizado.","El Comité Ambiental y sus comisiones, fueron reconocidos mediante Resolución directoral. ","Las actividades del Comité Ambiental y sus comisiones están incluidas en el PAT.","El Comité Ambiental cumplió con la cuota de género y/o interculturalidad (mínimo 30%) en su conformación, según corresponda. ","El Comité Ambiental está conformado al menos por un (01) representante de la comunidad local (de instituciones privadas, públicas, organizaciones sociales, líderes y otros).","N° de hitos de aplicación del enfoque ambiental puestos en práctica en la institucionalización del Comité Ambiental. ","Resolución Directoral de conformación del Comité Ambiental.","Plan de Trabajo del Comité. PAT.","Resolución Directoral de conformación del Comité Ambiental.","Resolución Directoral de conformación del Comité Ambiental.",null,"Fotos u otros medios audiovisuales.","","","",null,1,null,null,null,0,0,0,null,"Acta de conformación. PAT.","Cargo de entrega. Consentimientos informados firmados.","Cartas u oficios de coordinación del Gobierno regional u otros aliados. PAT.","Documentos administrativos: Cartas, Oficios, Memo. Actas, Convenios, Acuerdos.","PAT.","PAT. Cartas, Oficios, Memo.","PAT. Documentos administrativos: Cartas, Oficios, Memo. Lista de Asistencia.","PAT. Documentos administrativos: Cartas, Oficios, Memo. Lista de Asistencia. Fotografías.","PCI.","PCI. PAT.","PEI.","Plan de Manejo de Residuos Sólidos. PAT.","Plan de Salud Escolar. PAT.","Plan de Trabajo del Comité. PAT.","Plan de Trabajo del PEAI. PCI.","Programa Curricular Anual.","Programa Curricular Anual. Documentos de autorización de visitas y excursiones pedagógicas para el aprendizaje vivencial del enfoque ambiental.","Resolución Directoral de conformación del Comité Ambiental.","RI."]
[null,null,"NOMBRES",{"$f":"IF('MOD1'!AA19=\"\",\"\",'MOD1'!AA19)","v":""},null,null,"AMAZONAS",null,{"$f":"IF($D$9=J3,I2+1,0)","v":0},"AMAZONAS","BONGARA",null,{"$f":"O3&\" \"&P3&\" \"&Q3","v":"AMAZONAS BAGUA BAGUA"},{"$f":"IF(AND($D$9=O3,$D$10=P3),N2+1,0)","v":0},"AMAZONAS","BAGUA","BAGUA","C010201",null,{"$f":"IF($D$9=U3,T2+1,0)","v":0},"AMAZONAS","300. EDUCACION AMAZONAS","UGEL BONGARA",null,2,{"$f":"IFERROR(VLOOKUP(Y3,T2:W223,4,FALSE),\"\")","v":""},null,2,{"$f":"IFERROR(VLOOKUP(AB3,$I$1:$K$197,3,FALSE),\"\")","v":""},null,2,{"$f":"IFERROR(VLOOKUP(AE3,$N$1:$R$1864,4,FALSE),\"\")","v":""},null,1,"Gestión Escolar: Gestión Institucional y Gestión Pedagógica","2. La I.E. actualizó y/o elaboró sus herramientas de gestión escolar con enfoque ambiental.","La I.E. incluyó en el PEI, en el análisis situacional, su situación ambiental y vincula el diagnóstico al enfoque ambiental en la gestión escolar.","El PEI de la I.E incorporó el enfoque ambiental en su visión y en los objetivos y/o metas de gestión escolar centrada en los aprendizajes. ","La I.E. incorporó en el PAT las actividades ambientales estandarizadas consideradas en la presente matriz.","La I.E. incorporó en su Reglamento Interno al Comité Ambiental.","N° de hitos de aplicación del enfoque ambiental puestos en práctica en la formulación de herramientas de gestión escolar.","PEI.","PEI.","PAT.","RI.",null,"Fotos u otros medios audiovisuales.","","","Acta de conformación.",null,2,null,null,null,{"$f":"BE3+BD2","v":0},{"$f":"IF(BF3>0,1,0)","v":0},{"$f":"COUNTIFS($BH$1:$BZ$1,1,BH3:BZ3,1)","v":0},"Acta de conformación.",1]
[null,null,"TELEFONO",{"$f":"IF('MOD1'!AP19=\"\",\"\",'MOD1'!AP19)","v":""},null,null,"ANCASH",null,0,"AMAZONAS","CHACHAPOYAS",null,"AMAZONAS BAGUA COPALLIN",0,"AMAZONAS","BAGUA","COPALLIN","C010203",null,0,"AMAZONAS","300. EDUCACION AMAZONAS","UGEL CHACHAPOYAS",null,3,"",null,3,"",null,3,"",null,1,"Gestión Escolar: Gestión Institucional y Gestión Pedagógica","3. La I.E. incluyó en el PCI el enfoque ambiental y empleó recursos pedagógicos ambientales propios de la localidad.","El PCI incluyó el enfoque ambiental en los perfiles, los principios pedagógicos, los propósitos, y/o los enfoques metodológicos.","La I.E. incluyó el enfoque ambiental en la programación curricular anual y unidades didácticas (en las situaciones significativas).","La I.E. incluyó en las sesiones de aprendizaje las actividades del calendario ambiental nacional, local y/o comunal, así como los saberes y conocimientos ambientales locales.","La I.E. incluyó en las sesiones de aprendizaje visitas pedagógicas a espacios naturales y culturales (áreas naturales protegidas, rutas de ecoturismo, proyectos de conservación, bosques comunitarios, playas locales, etc.).","N° de hitos de aplicación del enfoque ambiental incluidos en los procesos de aprendizaje. ","PCI.","Programa Curricular Anual.","Programa Curricular Anual.","Programa Curricular Anual. Documentos de autorización de visitas y excursiones pedagógicas para el aprendizaje vivencial del enfoque ambiental.",null,"Fotos u otros medios audiovisuales.","","","Actas, Convenios, Acuerdos.",null,3,null,null,null,{"$f":"BE4+BD3","v":0},{"$f":"IF(BF4>0,1,0)","v":0},{"$f":"COUNTIFS($BH$1:$BZ$1,1,BH4:BZ4,1)","v":0},"Actas, Convenios, Acuerdos.",null,null,null,1]
[null,null,"EMAIL",{"$f":"IF('MOD1'!D24=\"\",\"\",'MOD1'!D24)","v":""},null,null,"APURIMAC",null,0,"AMAZONAS","CONDORCANQUI",null,"AMAZONAS BAGUA EL PARCO",0,"AMAZONAS","BAGUA","EL PARCO","C010204",null,0,"AMAZONAS","302. EDUCACION CONDORCANQUI","UGEL CONDORCANQUI",null,4,"",null,4,"",null,4,"",null,2,"Cambio climático","4. La I.E. realizó actividades de mitigación y adaptación frente al Cambio climático.","La I.E. implementó actividades de recuperación de espacios en desuso, incremento y/o mantenimiento de áreas verdes dentro de la I.E., en el marco de la condición de cambio climático. ","La I.E. implementó actividades pedagógicas de valoración y conservación de la diversidad biológica (flora y fauna, terrestre y acuática) y de los servicios ecosistémicos (lo servicios que el ambiente nos brinda), en el marco de la condición de cambio climático. "," La I.E. implementó actividades pedagógicas de promoción de la producción y consumo responsables (valoración de prácticas compatibles con el cuidado del ambiente y los recursos naturales), en el marco de la condición de cambio climático. ","La I.E. implementó actividades a favor de la recuperación y/o mantenimiento de espacios públicos y áreas verdes aledañas a la I.E. y en la comunidad local (jornadas de limpieza, el abono y/o sembrado de árboles, otras actividades), en el marco de la condición de cambio climático. ","N° de hitos de aplicación del enfoque ambiental puestos en práctica para la mitigación y adaptación frente al Cambio climático.","PCI. PAT.","PCI.","PCI.","PCI. PAT.",null,"Informe del Comité Ambiental.","Fotos u otros medios audiovisuales.","","Cargo de entrega.",null,null,null,null,null,0,0,0,"Cargo de entrega.",null,1]
[null,null,"CARGO",{"$f":"IF('MOD1'!AA24=\"\",\"\",'MOD1'!AA24)","v":""},null,null,"AREQUIPA",null,0,"AMAZONAS","LUYA",null,"AMAZONAS BAGUA IMAZA",0,"AMAZONAS","BAGUA","IMAZA","C010205",null,0,"AMAZONAS","303. EDUCACION BAGUA CAPITAL","UGEL IBIR-IMAZA",null,5,"",null,5,"",null,5,"",null,3,"Ecoeficiencia","5. La I.E. realizó actividades de manejo de residuos sólidos. ","La I.E. cuenta con un Plan de manejo de residuos sólidos, y actividades de las \"3R\" (Reducir, Reusar y Reciclar) incluidos en el PAT.","La I.E. implementó actividades pedagógicas  sobre el manejo de residuos sólidos y la aplicación de las “3R”: Reducir, Reusar y Reciclar.","La I.E. coordinó con el gobierno local u otras instituciones aliadas la recolección y transporte de los residuos para la disposición final de los residuos sólidos de la I.E., y/o el reaprovechamiento y comercialización.  ","La I.E. sensibilizó  a las familias de la comunidad educativa y/o comunidad local  sobre el manejo de residuos sólidos y en actividades de las 3R: Reducir, Reusar y Reciclar.","N° de hitos de aplicación del enfoque ambiental puestos en práctica en el manejo de residuos sólidos.","Plan de Manejo de Residuos Sólidos. PAT.","PCI.","Cartas u oficios de coordinación del Gobierno regional u otros aliados. PAT.","PAT. Documentos administrativos: Cartas, Oficios, Memo. Lista de Asistencia.",null,"Informe del Comité Ambiental.","Fotos u otros medios audiovisuales.","","Cartas u oficios de coordinación del Gobierno regional u otros aliados.",null,null,null,null,null,0,0,0,"Cartas u oficios de coordinación del Gobierno regional u otros aliados.",null,null,1]
[null,null,"FONOIIEE",{"$f":"IF('MOD1'!AP24=\"\",\"\",'MOD1'!AP24)","v":""},null,null,"AYACUCHO",null,0,"AMAZONAS","RODRIGUEZ DE MENDOZA",null,"AMAZONAS BAGUA LA PECA",0,"AMAZONAS","BAGUA","LA PECA","C010206",null,0,"AMAZONAS","300. EDUCACION AMAZONAS","UGEL LUYA",null,6,"",null,6,"",null,6,"",null,3,"Ecoeficiencia","6. La I.E. practicó el uso ecoeficiente de la energía.","La I.E. ha adoptado medidas de uso ecoeficiente de la energía incluidos en el PAT. ","La I.E. implementó actividades pedagógicas  sobre el consumo responsable de la energía, así como prácticas ecoeficientes asociadas (uso de focos ahorradores, entre otros).","La I.E.  implementó actividades pedagógicas sobre la importancia del uso de medios de transporte menos nocivos para el ambiente (por ejemplo, transporte público compartido, bicicletas, caminatas, etc.).","La I.E. sensibilizó a las familias de la comunidad educativa y/o comunidad local para el uso ecoeficiente de la energía.","N° de hitos de aplicación del enfoque ambiental puestos en práctica en el uso ecoeficiente de la energía.","PAT.","PCI.","PCI.","PAT. Documentos administrativos: Cartas, Oficios, Memo. Lista de Asistencia.",null,"Informe del Comité Ambiental.","Fotos u otros medios audiovisuales.","","Cartas, Oficios, Memo.",null,null,null,null,null,0,0,0,"Cartas, Oficios, Memo.",null,null,null,null,null,1]
[null,null,null,null,null,null,"CAJAMARCA",null,0,"AMAZONAS","UTCUBAMBA",null,"AMAZONAS BONGARA CHISQUILLA",0,"AMAZONAS","BONGARA","CHISQUILLA","C010302",null,0,"AMAZONAS","300. EDUCACION AMAZONAS","UGEL RODRIGUEZ DE MENDOZA",null,7,"",null,7,"",null,7,"",null,3,"Ecoeficiencia","7. La I.E. practicó el empleo de energía renovable.","La I.E. ha incluido medidas sobre el empleo de energía renovable en el PAT. ","La I.E. implementó actividades pedagógicas  sobre el uso de energía renovable, de acuerdo a su contexto. ","La I.E. implementó actividades institucionales sobre el uso de la energía renovable (por ejemplo paneles solares), de acuerdo a su contexto.  ","La I.E. sensibilizó a las familias de la comunidad educativa y/o comunidad local para el empleo de energía renovable.","N° de hitos de aplicación del enfoque ambiental puestos en práctica en el empleo de energía renovable.","PCI. PAT.","PCI. PAT.","PCI. PAT.","PAT. Documentos administrativos: Cartas, Oficios, Memo. Lista de Asistencia. Fotografías.",null,"Informe del Comité Ambiental.","Fotos u otros medios audiovisuales.","","Consentimientos informados firmados.",null,null,null,null,null,0,0,0,"Consentimientos informados firmados.",null,1,null,null,null,null,1]
[null,null,"DEPARTAMENTO",{"$f":"'MOD1'!D34","v":"Seleccionar"},null,null,"CALLAO",null,0,"ANCASH","AIJA",null,"AMAZONAS BONGARA CHURUJA",0,"AMAZONAS","BONGARA","CHURUJA","C010303",null,0,"AMAZONAS","301. EDUCACION BAGUA","UGEL UTCUBAMBA",null,8,"",null,8,"",null,8,"",null,3,"Ecoeficiencia","8. La I.E. practicó la gestión integral y uso eficiente de los recursos hídricos.","La I.E. ha incluido medidas para el ahorro y buen uso del agua en la I.E., fomentando una nueva cultura del agua, en el PAT.","La I.E. ha incluido medidas para el acceso a agua segura en la I.E., fomentando una nueva cultura del agua, en el PAT.","La I.E. implementó  actividades pedagógicas sobre la gestión integral de los recursos hídricos y una nueva cultura del agua (por ejemplo sobre la protección y conservación de la calidad del agua y de las cuencas hidrográficas; el ahorro y buen uso del agua; el acceso a agua segura; entre otros). ","La I.E.  sensibilizó a las familias de la comunidad educativa y/o comunidad local para promover la gestión integral de recursos hídricos y una nueva cultura del agua en la I.E. y/o en la comunidad local.","N° de hitos de aplicación del enfoque ambiental puestos en práctica en el cuidado y el uso ecoeficiente de los recursos hídricos, fomentando una nueva cultura del agua.","PCI. PAT.","PCI. PAT.","PCI. PAT.","Documentos administrativos: Cartas, Oficios, Memo. Actas, Convenios, Acuerdos.",null,"Informe del Comité Ambiental.","Fotos u otros medios audiovisuales.","","Documentos administrativos: Cartas, Oficios, Memo.",null,null,null,null,null,0,0,0,"Documentos administrativos: Cartas, Oficios, Memo.",null,null,null,1,null,null,null,1]
[null,null,"PROVINCIA",{"$f":"'MOD1'!S34","v":"Seleccionar"},null,null,"CUSCO",null,0,"ANCASH","ANTONIO RAYMONDI",null,"AMAZONAS BONGARA COROSHA",0,"AMAZONAS","BONGARA","COROSHA","C010304",null,0,"ANCASH","304. EDUCACION AIJA","UGEL AIJA",null,9,"",null,9,"",null,9,"",null,4,"Salud SALUD","9. La I.E. Implementó el Plan de Salud Escolar en la I.E.","La I.E. ha incluido las actividades del Plan de Salud Escolar en el PAT.","La I.E. entregó al establecimiento de Salud los Consentimientos Informados firmados del Plan de Salud Escolar que fueron entregados a los padres de familia.","La I.E. preparó los espacios para las actividades del Plan de Salud Escolar.","La I.E. estableció con el Establecimiento de Salud de su ámbito el cronograma de las actividades del Plan de Salud Escolar.","N° de hitos de aplicación del enfoque ambiental puestos en práctica en la implementación del Plan de salud escolar o del Plan de Salud de la  I.E.","Plan de Salud Escolar. PAT.","Cargo de entrega. Consentimientos informados firmados.","PAT.","Documentos administrativos: Cartas, Oficios, Memo. Actas, Convenios, Acuerdos.",null,"Informe del Comité Ambiental.","Fotos u otros medios audiovisuales.","","Documentos de autorización de visitas y excursiones pedagógicas para el aprendizaje vivencial del enfoque ambiental.",null,null,null,null,null,0,0,0,"Documentos de autorización de visitas y excursiones pedagógicas para el aprendizaje vivencial del enfoque ambiental.",null,null,null,null,null,null,null,null,null,null,null,null,null,null,null,null,1]
[null,null,"DISTRITO",{"$f":"'MOD1'!D39","v":"Seleccionar"},null,null,"HUANCAVELICA",null,0,"ANCASH","ASUNCION",null,"AMAZONAS BONGARA CUISPES",0,"AMAZONAS","BONGARA","CUISPES","C010305",null,0,"ANCASH","312. EDUCACION ANTONIO RAIMONDI","UGEL ANTONIO RAYMONDI",null,10,"",null,10,"",null,10,"",null,4,"Salud QALI WARMA","10. La I.E. implementa el servicio de alimentación provisto por Qali Warma.","La I.E. ha incluido las actividades de Qali Warma en el PAT.","El Comité de Alimentación Escolar (CAE) está conformado y todos sus miembros han sido capacitados.","El CAE coordinó con el proveedor del servicio alimentario las fechas y horarios de entrega de alimentos a la IE.","El CAE organizó los turnos y roles en la IE para la recepción, preparación y servido de los alimentos.","N° de hitos de aplicación del enfoque ambiental puestos en práctica para la provisión del servicio de alimentación de Qali Warma.","PAT.","Acta de conformación. PAT.","PAT.","PAT.",null,"Informe del Comité Ambiental.","Fotos u otros medios audiovisuales.","","Fotografías.",null,null,null,null,null,0,0,0,"Fotografías.",null,null,null,null,null,null,null,1]
[null,null,null,null,null,null,"HUANUCO",null,0,"ANCASH","BOLOGNESI",null,"AMAZONAS BONGARA FLORIDA",0,"AMAZONAS","BONGARA","FLORIDA","C010306",null,0,"ANCASH","314. EDUCACION ASUNCION","UGEL ASUNCION",null,11,"",null,11,"",null,11,"",null,4,"Salud","11. La I.E. implementó acciones sobre alimentación saludable y sostenible.","La I.E. cuenta con una planificación de actividades, así como espacios educativos adecuados, para garantizar la alimentación saludable y sostenible, incluidos en el PAT. ","La I.E. implementó y promovió actividades pedagógicas para el consumo de alimentos saludables y sostenibles, así como la revalorización y consumo de productos locales.","La I.E. implementó y supervisó los quioscos, cafetines, cafeterías y/o comedores escolares así como las loncheras escolares, garantizando el acceso, la disponibilidad y el consumo de una alimentación saludable y sostenible, según la normativa vigente.","La I.E. sensibilizó a las familias de la comunidad educativa para la adopción de una cultura de alimentación saludable y sostenible, así como la revalorización y consumo de productos locales. ","N° de hitos de aplicación del enfoque ambiental puestos en práctica en la implementación de acciones de alimentación saludable y sostenible.","PAT.","PCI.","PAT. Cartas, Oficios, Memo.","PAT. Documentos administrativos: Cartas, Oficios, Memo. Lista de Asistencia. Fotografías.",null,"Informe del Comité Ambiental.","Fotos u otros medios audiovisuales.","","Fotos u otros medios audiovisuales.",null,null,null,null,null,0,0,0,"Fotos u otros medios audiovisuales."]
[null,{"$f":"D9&\" \"&D10&\" \"&D11","v":"Seleccionar Seleccionar Seleccionar"},"CODGEO",{"$f":"IFERROR(VLOOKUP(B13,M1:R1864,6,FALSE),\"\")","v":""},null,null,"ICA",null,0,"ANCASH","CARHUAZ",null,"AMAZONAS BONGARA JAZAN",0,"AMAZONAS","BONGARA","JAZAN","C010307",null,0,"ANCASH","313. EDUCACION BOLOGNESI","UGEL BOLOGNESI",null,12,"",null,12,"",null,12,"",null,4,"Salud","12. La I.E. implementó  acciones para la práctica de la higiene integral (lavado de manos, higiene bucal, aseo y cuidado personal). ","La I.E. cuenta con una planificación de actividades, así como espacios educativos adecuados, para garantizar la puesta en práctica de hábitos de higiene integral, incluidos en el PAT.","La I.E.  Implementó actividades pedagógicas sobre la importancia y la práctica diaria del lavado de manos (antes y después de las comidas y después del uso de los baños) e higiene bucal.","La I.E. implementó actividades pedagógicas sobre la importancia y la práctica diaria de aseo y del cuidado personal (baño cotidiano, control de la pediculosis, ropa limpia, etc.). ","La I.E. sensibilizó a las familias de la comunidad educativa y/o comunidad local en la adopción de hábitos de higiene integral.","N° de hitos de aplicación del enfoque ambiental puestos en práctica en la implementación de hábitos de higiene integral.","PAT.","PCI.","PCI.","PAT. Documentos administrativos: Cartas, Oficios, Memo. Lista de Asistencia. Fotografías.",null,"Informe del Comité Ambiental.","Fotos u otros medios audiovisuales.","","Informe del Comité Ambiental.",null,null,null,null,null,0,0,0,"Informe del Comité Ambiental."]
[null,null,null,null,null,null,"JUNIN",null,0,"ANCASH","CARLOS FERMIN FITZCARRALD",null,"AMAZONAS BONGARA JUMBILLA",0,"AMAZONAS","BONGARA","JUMBILLA","C010301",null,0,"ANCASH","315. EDUCACION CARHUAZ","UGEL CARHUAZ",null,13,"",null,13,"",null,13,"",null,4,"Salud","13. La I.E. implementó actividades de mantenimiento, orden y limpieza de todos los ambientes como práctica cotidiana y para la prevención de enfermedades prevalentes.","La I.E. cuenta con una planificación de actividades para promover entornos saludables a través del mantenimiento, orden y limpieza al interior y en los espacios exteriores de la I.E., incluidos en el PAT.","La I.E. implementó actividades pedagógicas sobre la importancia y la práctica de la limpieza periódica, el orden, la ventilación e iluminación de espacios, como medidas de prevención de enfermedades prevalentes (EDAs, IRAs, Influenza, Dengue y otras de prevalencia local, TBC, entre otros).","La I.E. implementó actividades institucionales orientadas a mantener la limpieza periódica, el orden, la ventilación e iluminación de espacios, así como la desinfección y fumigación de las aulas, los servicios higiénicos, y otros espacios físicos dentro de la I.E. como en los exteriores de la I.E. (el perímetro, jardines y otros).  ","La I.E. sensibilizó a las familias de la comunidad educativa y/o comunidad local, y logra su participación en las actividades de conservación y limpieza de los espacios interiores y exteriores a la I.E como medidas preventivas de enfermedades prevalentes.","N° de hitos de aplicación del enfoque ambiental puestos en práctica para el mantenimiento, orden y limpieza de todos los ambientes como medidas de prevención de enfermedades prevalentes.","PAT.","PCI. PAT.","PCI. PAT.","PAT. Documentos administrativos: Cartas, Oficios, Memo. Lista de Asistencia. Fotografías.",null,"Informe del Comité Ambiental.","Fotos u otros medios audiovisuales.","","Lista de Asistencia.",null,null,null,null,null,0,0,0,"Lista de Asistencia.",null,null,null,null,null,null,1,1]
[null,null,"VALIDACION1",{"$f":"(COUNTIF(D2:D3,\"\")+COUNTIF(D5:D6,\"\")+COUNTIF(D9:D11,\"Seleccionar\"))=0","v":false},null,null,"LA LIBERTAD",null,0,"ANCASH","CASMA",null,"AMAZONAS BONGARA RECTA",0,"AMAZONAS","BONGARA","RECTA","C010308",null,0,"ANCASH","307. EDUCACION CARLOS F. FITZCARRALD","UGEL CARLOS FERMIN FITZCARRALD",null,14,"",null,14,"",null,14,"",null,4,"Salud","14. La I.E. adoptó medidas de protección frente a los efectos nocivos por la exposición a la radiación ultravioleta.","La I.E. cuenta con una planificación de actividades para la implementación de acciones de protección y prevención de los efectos nocivos de la radiación solar (el uso del gorro/sombrero, gafas, uso permanente de bloqueadores solares, mallas raschel, tiempos para la formación de acuerdo a la normativa vigente, etc.) incluidos en el PAT.","La I.E. implementó actividades pedagógicas para promover la prevención de los efectos nocivos de la radiación solar. ","La I.E. implementó medidas y actividades institucionales para la prevención y protección de los efectos nocivos de la radiación solar (por ejemplo la instalación de techos y/o toldos con mallas de tipo raschel en patios, jardines u otros espacios; la dimsinución de los tiempos de las dinámicas de formación escolar al aire libre; entre otros).","La I.E. sensibilizó a las familias de la comunidad educativa y/o comunidad local sobre las medidas de protección a implementar durante todos el año frente a los efectos nocivos por la exposición a la radiación ultravioleta.","N° de hitos de aplicación del enfoque ambiental puestos en práctica en la promoción de protección de la radiación solar.","PAT.","PCI.","PAT.","PAT. Documentos administrativos: Cartas, Oficios, Memo. Lista de Asistencia. Fotografías.",null,"Informe del Comité Ambiental.","Fotos u otros medios audiovisuales.","","Otros.",null,null,null,null,null,0,0,0,"Otros."]
[null,null,null,null,null,null,"LAMBAYEQUE",null,0,"ANCASH","CORONGO",null,"AMAZONAS BONGARA SAN CARLOS",0,"AMAZONAS","BONGARA","SAN CARLOS","C010309",null,0,"ANCASH","310. EDUCACION CASMA","UGEL CASMA",null,15,"",null,15,"",null,15,"",null,5,"Gestión del Riesgo de Desastres","15. La IE adoptó medidas para la Gestión del Riesgo de Desastres.","La I.E. cuenta con una planificación de la gestión del Riesgo de Desastres  incluidos en el PAT.","La I.E. implementó actividades pedagógicas sobre la gestión del riesgo de desastres, en el marco del enfoque ambiental. ","La I.E. implementó actividades institucionales, incluyendo simulacros, para hacer frente a los desastres, en el marco del enfoque ambiental. ","La I.E. sensibilizó  a las familias de la comunidad educativa y/o comunidad local en la gestión del riesgo frente a los desastres (sismos, friajes, inundaciones, y otros producto del cambio climático, según el contexto). ","N° de hitos de aplicación del enfoque ambiental puestos en práctica en la gestión de riesgos de desastres.","PAT.","PCI.","PAT.","PAT. Documentos administrativos: Cartas, Oficios, Memo. Lista de Asistencia. Fotografías.",null,"Informe del Comité Ambiental.","Fotos u otros medios audiovisuales.","","PAT.",null,null,null,null,null,0,0,0,"PAT.",1,null,1,null,1,1,1,1,null,1,null,1,1,1]
[null,null,"Nombre de DRE o UGEL",{"$f":"IF('MOD2'!D13=\"\",\"\",'MOD2'!D13)","v":""},null,null,"LIMA",null,0,"ANCASH","HUARAZ",null,"AMAZONAS BONGARA SHIPASBAMBA",0,"AMAZONAS","BONGARA","SHIPASBAMBA","C010310",null,0,"ANCASH","320. EDUCACION CORONGO","UGEL CORONGO",null,16,"",null,16,"",null,16,"",null,null,"Espacio de Vida – EsVi","16. LA I.E. implementó un PEAI como recurso pedagógico y para el desarrollo de la conciencia ambiental y sobre la salud.","El PEAI fue incluido en el PAT. ","La I.E. implementó el PEAI con actividades pedagógicas articuladas mínimo a tres áreas curriculares. ","La I.E. implementó actividades institucionales para la ejecución del PEAI a lo largo de todo el año escolar.","El PEAI se implementó con apoyo de instituciones del sector público y/o privado.","N° de hitos de aplicación del enfoque ambiental puestos en práctica en la implementación del PEAI.","PAT.","Plan de Trabajo del PEAI. PCI.","PAT.","Documentos administrativos: Cartas, Oficios, Memo. Actas, Convenios, Acuerdos.",null,"Informe del Comité Ambiental.","Fotografías.","Otros.","PCI.",null,null,null,null,null,0,0,0,"PCI.",null,null,null,null,null,null,null,null,1,1,null,null,null,null,1]
[null,null,"Apellidos del coodinador ",{"$f":"IF('MOD2'!T13=\"\",\"\",'MOD2'!T13)","v":""},null,null,"LORETO",null,0,"ANCASH","HUARI",null,"AMAZONAS BONGARA VALERA",0,"AMAZONAS","BONGARA","VALERA","C010311",null,0,"ANCASH","311. EDUCACION HUARAZ","UGEL HUARAZ",null,17,"",null,17,"",null,17,"",null,null,"Manejo de Residuos Sólidos – MARES","16. LA I.E. implementó un PEAI como recurso pedagógico y para el desarrollo de la conciencia ambiental y sobre la salud.","El PEAI fue incluido en el PAT. ","La I.E. implementó el PEAI con actividades pedagógicas articuladas mínimo a tres áreas curriculares. ","La I.E. implementó actividades institucionales para la ejecución del PEAI a lo largo de todo el año escolar.","El PEAI se implementó con apoyo de instituciones del sector público y/o privado.","N° de hitos de aplicación del enfoque ambiental puestos en práctica en la implementación del PEAI.","PAT.","Plan de Trabajo del PEAI. PCI.","PAT.","Documentos administrativos: Cartas, Oficios, Memo. Actas, Convenios, Acuerdos.",null,"Informe del Comité Ambiental.","Fotografías.","Otros.","PEI.",null,null,null,null,null,0,0,0,"PEI.",null,null,null,null,null,null,null,null,null,null,1]
[null,null,"Nombres del coodinador ",{"$f":"IF('MOD2'!AJ13=\"\",\"\",'MOD2'!AJ13)","v":""},null,null,"MADRE DE DIOS",null,0,"ANCASH","HUARMEY",null,"AMAZONAS BONGARA YAMBRASBAMBA",0,"AMAZONAS","BONGARA","YAMBRASBAMBA","C010312",null,0,"ANCASH","308. EDUCACION HUARI","UGEL HUARI",null,18,"",null,18,"",null,18,"",null,null,"Vida y Verde – VIVE","16. LA I.E. implementó un PEAI como recurso pedagógico y para el desarrollo de la conciencia ambiental y sobre la salud.","El PEAI fue incluido en el PAT. ","La I.E. implementó el PEAI con actividades pedagógicas articuladas mínimo a tres áreas curriculares. ","La I.E. implementó actividades institucionales para la ejecución del PEAI a lo largo de todo el año escolar.","El PEAI se implementó con apoyo de instituciones del sector público y/o privado.","N° de hitos de aplicación del enfoque ambiental puestos en práctica en la implementación del PEAI.","PAT.","Plan de Trabajo del PEAI. PCI.","PAT.","Documentos administrativos: Cartas, Oficios, Memo. Actas, Convenios, Acuerdos.",null,"Informe del Comité Ambiental.","Fotografías.","Otros.","Plan de Manejo de Residuos Sólidos.",null,null,null,null,null,0,0,0,"Plan de Manejo de Residuos Sólidos.",null,null,null,null,null,null,null,null,null,null,null,1]
[null,null,null,null,null,null,"MOQUEGUA",null,0,"ANCASH","HUAYLAS",null,"AMAZONAS CHACHAPOYAS ASUNCION",0,"AMAZONAS","CHACHAPOYAS","ASUNCION","C010102",null,0,"ANCASH","303. EDUCACION HUARMEY","UGEL HUARMEY",null,19,"",null,19,"",null,19,"",null,null,"GLOBE Perú","16. LA I.E. implementó un PEAI como recurso pedagógico y para el desarrollo de la conciencia ambiental y sobre la salud.","El PEAI fue incluido en el PAT. ","La I.E. implementó el PEAI con actividades pedagógicas articuladas mínimo a tres áreas curriculares. ","La I.E. implementó actividades institucionales para la ejecución del PEAI a lo largo de todo el año escolar.","El PEAI se implementó con apoyo de instituciones del sector público y/o privado.","N° de hitos de aplicación del enfoque ambiental puestos en práctica en la implementación del PEAI.","PAT.","Plan de Trabajo del PEAI. PCI.","PAT.","Documentos administrativos: Cartas, Oficios, Memo. Actas, Convenios, Acuerdos.",null,"Informe del Comité Ambiental.","Fotografías.","Otros.","Plan de Salud Escolar.",null,null,null,null,null,0,0,0,"Plan de Salud Escolar.",null,null,null,null,null,null,null,null,null,null,null,null,1]
[null,null,"Plan de Salud Escolar",{"$f":"IF('MOD2'!D18=\"\",\"\",'MOD2'!D18)","v":""},null,null,"PASCO",null,0,"ANCASH","MARISCAL LUZURIAGA",null,"AMAZONAS CHACHAPOYAS BALSAS",0,"AMAZONAS","CHACHAPOYAS","BALSAS","C010103",null,0,"ANCASH","302. EDUCACION HUAYLAS","UGEL HUAYLAS",null,20,"",null,20,"",null,20,"",null,null,"Mi Huella – Mido y reduzco mi huella de carbono","16. LA I.E. implementó un PEAI como recurso pedagógico y para el desarrollo de la conciencia ambiental y sobre la salud.","El PEAI fue incluido en el PAT. ","La I.E. implementó el PEAI con actividades pedagógicas articuladas mínimo a tres áreas curriculares. ","La I.E. implementó actividades institucionales para la ejecución del PEAI a lo largo de todo el año escolar.","El PEAI se implementó con apoyo de instituciones del sector público y/o privado.","N° de hitos de aplicación del enfoque ambiental puestos en práctica en la implementación del PEAI.","PAT.","Plan de Trabajo del PEAI. PCI.","PAT.","Documentos administrativos: Cartas, Oficios, Memo. Actas, Convenios, Acuerdos.",null,"Informe del Comité Ambiental.","Fotografías.","Otros.","Plan de Trabajo del Comité.",null,null,null,null,null,0,0,0,"Plan de Trabajo del Comité.",null,null,null,null,null,null,null,null,null,null,null,null,null,1,1]
[null,null,"Qali Warma",{"$f":"IF('MOD2'!L18=\"\",\"\",'MOD2'!L18)","v":""},null,null,"PIURA",null,0,"ANCASH","OCROS",null,"AMAZONAS CHACHAPOYAS CHACHAPOYAS",0,"AMAZONAS","CHACHAPOYAS","CHACHAPOYAS","C010101",null,0,"ANCASH","316. EDUCACION MARISCAL LUZURIAGA","UGEL MARISCAL LUZURIAGA",null,21,"",null,21,"",null,21,"",null,null,{"$f":"D145","v":""},"16. LA I.E. implementó un PEAI como recurso pedagógico y para el desarrollo de la conciencia ambiental y sobre la salud.","El PEAI fue incluido en el PAT. ","La I.E. implementó el PEAI con actividades pedagógicas articuladas mínimo a tres áreas curriculares. ","La I.E. implementó actividades institucionales para la ejecución del PEAI a lo largo de todo el año escolar.","El PEAI se implementó con apoyo de instituciones del sector público y/o privado.","N° de hitos de aplicación del enfoque ambiental puestos en práctica en la implementación del PEAI.","PAT.","Plan de Trabajo del PEAI. PCI.","PAT.","Documentos administrativos: Cartas, Oficios, Memo. Actas, Convenios, Acuerdos.",null,"Informe del Comité Ambiental.","Fotografías.","Otros.","Programa Curricular Anual.",null,null,null,null,null,0,0,0,"Programa Curricular Anual.",null,null,null,null,null,null,null,null,null,null,null,null,null,null,null,1,1]
[null,null,null,null,null,null,"PUNO",null,0,"ANCASH","PALLASCA",null,"AMAZONAS CHACHAPOYAS CHETO",0,"AMAZONAS","CHACHAPOYAS","CHETO","C010104",null,0,"ANCASH","317. EDUCACION OCROS","UGEL OCROS",null,22,"",null,22,"",null,22,"",null,null,{"$f":"D151","v":""},"16. LA I.E. implementó un PEAI como recurso pedagógico y para el desarrollo de la conciencia ambiental y sobre la salud.","El PEAI fue incluido en el PAT. ","La I.E. implementó el PEAI con actividades pedagógicas articuladas mínimo a tres áreas curriculares. ","La I.E. implementó actividades institucionales para la ejecución del PEAI a lo largo de todo el año escolar.","El PEAI se implementó con apoyo de instituciones del sector público y/o privado.","N° de hitos de aplicación del enfoque ambiental puestos en práctica en la implementación del PEAI.","PAT.","Plan de Trabajo del PEAI. PCI.","PAT.","Documentos administrativos: Cartas, Oficios, Memo. Actas, Convenios, Acuerdos.",null,"Informe del Comité Ambiental.","Fotografías.","Otros.","Resolución Directoral de conformación del Comité Ambiental.",null,null,null,null,null,0,0,0,"Resolución Directoral de conformación del Comité Ambiental.",null,null,null,null,null,null,null,null,null,null,null,null,null,null,null,null,null,1]
[null,null,"Público/Privado:",{"$f":"IF('MOD2'!T18=\"\",\"\",'MOD2'!T18)","v":""},null,null,"SAN MARTIN",null,0,"ANCASH","POMABAMBA",null,"AMAZONAS CHACHAPOYAS CHILIQUIN",0,"AMAZONAS","CHACHAPOYAS","CHILIQUIN","C010105",null,0,"ANCASH","309. EDUCACION PALLASCA","UGEL PALLASCA",null,23,"",null,23,"",null,23,"",null,null,{"$f":"D157","v":""},"16. LA I.E. implementó un PEAI como recurso pedagógico y para el desarrollo de la conciencia ambiental y sobre la salud.","El PEAI fue incluido en el PAT. ","La I.E. implementó el PEAI con actividades pedagógicas articuladas mínimo a tres áreas curriculares. ","La I.E. implementó actividades institucionales para la ejecución del PEAI a lo largo de todo el año escolar.","El PEAI se implementó con apoyo de instituciones del sector público y/o privado.","N° de hitos de aplicación del enfoque ambiental puestos en práctica en la implementación del PEAI.","PAT.","Plan de Trabajo del PEAI. PCI.","PAT.","Documentos administrativos: Cartas, Oficios, Memo. Actas, Convenios, Acuerdos.",null,"Informe del Comité Ambiental.","Fotografías.","Otros.","RI.",null,null,null,null,null,0,0,0,"RI.",null,null,null,null,null,null,null,null,null,null,null,null,null,null,null,null,null,null,1]
[null,null,"Dirección de la IIEE:",{"$f":"IF('MOD2'!AA18=\"\",\"\",'MOD2'!AA18)","v":""},null,null,"TACNA",null,0,"ANCASH","RECUAY",null,"AMAZONAS CHACHAPOYAS CHUQUIBAMBA",0,"AMAZONAS","CHACHAPOYAS","CHUQUIBAMBA","C010106",null,0,"ANCASH","305. EDUCACION POMABAMBA","UGEL POMABAMBA",null,24,"",null,24,"",null,24,""]
[null,null,"CODREG",{"$f":"IF('MOD2'!M26=\"\",D13&'MOD2'!M38,D13&'MOD2'!M26)","v":""},null,null,"TUMBES",null,0,"ANCASH","SANTA",null,"AMAZONAS CHACHAPOYAS GRANADA",0,"AMAZONAS","CHACHAPOYAS","GRANADA","C010107",null,0,"ANCASH","318. EDUCACION RECUAY","UGEL RECUAY",null,25,"",null,25,"",null,25,""]
[null,null,null,null,null,null,"UCAYALI",null,0,"ANCASH","SIHUAS",null,"AMAZONAS CHACHAPOYAS HUANCAS",0,"AMAZONAS","CHACHAPOYAS","HUANCAS","C010108",null,0,"ANCASH","301. EDUCACION SANTA","UGEL SANTA",null,26,{"$f":"IFERROR(VLOOKUP(Y27,T26:W247,4,FALSE),\"\")","v":""},null,null,null,null,26,""]
[null,null,"VALIDACION2",{"$f":"AND((COUNTIF(D24:D25,\"\")+COUNTIF(D17,\"\")+COUNTIF(D21:D22,\"\"))=0,COUNTIF($BA$2:$BA$4,\"\")<5)","v":false},null,null,null,null,0,"ANCASH","YUNGAY",null,"AMAZONAS CHACHAPOYAS LA JALCA",0,"AMAZONAS","CHACHAPOYAS","LA JALCA","C010109",null,0,"ANCASH","306. EDUCACION SIHUAS","UGEL SIHUAS",null,27,"",null,null,null,null,27,""]
[null,null,null,null,null,null,null,null,0,"APURIMAC","ABANCAY",null,"AMAZONAS CHACHAPOYAS LEIMEBAMBA",0,"AMAZONAS","CHACHAPOYAS","LEIMEBAMBA","C010110",null,0,"ANCASH","319. EDUCACION YUNGAY","UGEL YUNGAY",null,28,"",null,null,null,null,28,""]
[1,"GESTION ESCOLAR","P1A",{"$f":"IF(MOD4_1!H$21=\"\",\"\",MOD4_1!H$21)","v":""},"Resolución Directoral de conformación del Comité Ambiental.",{"$f":"IF(D30=\"SI\",E30,\"\")","v":""},null,null,0,"APURIMAC","ANDAHUAYLAS",null,"AMAZONAS CHACHAPOYAS LEVANTO",0,"AMAZONAS","CHACHAPOYAS","LEVANTO","C010111",null,0,"APURIMAC","307. EDUCACION ABANCAY","UGEL ABANCAY",null,29,"",null,null,null,null,29,""]
[1,"GESTION ESCOLAR","P1B",{"$f":"IF(MOD4_1!O$21=\"\",\"\",MOD4_1!O$21)","v":""},"Plan de Trabajo del Comité. PAT.",{"$f":"IF(D31=\"SI\",E31,\"\")","v":""},null,null,0,"APURIMAC","ANTABAMBA",null,"AMAZONAS CHACHAPOYAS MAGDALENA",0,"AMAZONAS","CHACHAPOYAS","MAGDALENA","C010112",null,0,"APURIMAC","301. EDUCACION CHANKA","UGEL ANDAHUAYLAS",null,30,"",null,null,null,null,30,""]
[1,"GESTION ESCOLAR","P1C",{"$f":"IF(MOD4_1!V$21=\"\",\"\",MOD4_1!V$21)","v":""},"Resolución Directoral de conformación del Comité Ambiental.","",null,null,0,"APURIMAC","AYMARAES",null,"AMAZONAS CHACHAPOYAS MARISCAL CASTILLA",0,"AMAZONAS","CHACHAPOYAS","MARISCAL CASTILLA","C010113",null,0,"APURIMAC","308. EDUCACION ANTABAMBA","UGEL ANTABAMBA",null,31,"",null,null,null,null,31,""]
[1,"GESTION ESCOLAR","P1D",{"$f":"IF(MOD4_1!AC$21=\"\",\"\",MOD4_1!AC$21)","v":""},"Resolución Directoral de conformación del Comité Ambiental.","",null,null,0,"APURIMAC","CHINCHEROS",null,"AMAZONAS CHACHAPOYAS MOLINOPAMPA",0,"AMAZONAS","CHACHAPOYAS","MOLINOPAMPA","C010114",null,0,"APURIMAC","306. EDUCACION AYMARAES","UGEL AYMARAES",null,32,"",null,null,null,null,32,""]
[null,"GESTION ESCOLAR","P1E",{"$f":"IF(MOD4_1!AP$13=\"\",\"\",MOD4_1!AP$13)","v":""},null,"",null,null,0,"APURIMAC","COTABAMBAS",null,"AMAZONAS CHACHAPOYAS MONTEVIDEO",0,"AMAZONAS","CHACHAPOYAS","MONTEVIDEO","C010115",null,0,"APURIMAC","303. EDUCACION CHINCHEROS","UGEL CHINCHEROS",null,33,"",null,null,null,null,33,""]
[1,"GESTION ESCOLAR","P2A",{"$f":"IF(MOD4_1!H$36=\"\",\"\",MOD4_1!H$36)","v":""},"PEI.","",null,null,0,"APURIMAC","GRAU",null,"AMAZONAS CHACHAPOYAS OLLEROS",0,"AMAZONAS","CHACHAPOYAS","OLLEROS","C010116",null,0,"APURIMAC","302. EDUCACION COTABAMBAS","UGEL COTABAMBAS",null,34,"",null,null,null,null,34,""]
[1,"GESTION ESCOLAR","P2B",{"$f":"IF(MOD4_1!O$36=\"\",\"\",MOD4_1!O$36)","v":""},"PEI.","",null,null,0,"AREQUIPA","AREQUIPA",null,"AMAZONAS CHACHAPOYAS QUINJALCA",0,"AMAZONAS","CHACHAPOYAS","QUINJALCA","C010117",null,0,"APURIMAC","304. EDUCACION GRAU","UGEL GRAU",null,35,"",null,null,null,null,35,""]
[1,"GESTION ESCOLAR","P2C",{"$f":"IF(MOD4_1!V$36=\"\",\"\",MOD4_1!V$36)","v":""},"PAT.","",null,null,0,"AREQUIPA","CAMANA",null,"AMAZONAS CHACHAPOYAS SAN FRANCISCO DE DAGUAS",0,"AMAZONAS","CHACHAPOYAS","SAN FRANCISCO DE DAGUAS","C010118",null,0,"APURIMAC","305. EDUCACION HUANCARAMA","UGEL HUANCARAMA",null,null,null,null,null,null,null,36,""]
[1,"GESTION ESCOLAR","P2D",{"$f":"IF(MOD4_1!AC$36=\"\",\"\",MOD4_1!AC$36)","v":""},"RI.","",null,null,0,"AREQUIPA","CARAVELI",null,"AMAZONAS CHACHAPOYAS SAN ISIDRO DE MAINO",0,"AMAZONAS","CHACHAPOYAS","SAN ISIDRO DE MAINO","C010119",null,0,"AREQUIPA","302. EDUCACION AREQUIPA NORTE","UGEL AREQUIPA NORTE",null,null,null,null,null,null,null,37,""]
[null,"GESTION ESCOLAR","P2E",{"$f":"IF(MOD4_1!AP$28=\"\",\"\",MOD4_1!AP$28)","v":""},null,"",null,null,0,"AREQUIPA","CASTILLA",null,"AMAZONAS CHACHAPOYAS SOLOCO",0,"AMAZONAS","CHACHAPOYAS","SOLOCO","C010120",null,0,"AREQUIPA","303. EDUCACION AREQUIPA SUR","UGEL AREQUIPA SUR",null,null,null,null,null,null,null,38,""]
[1,"GESTION ESCOLAR","P3A",{"$f":"IF(MOD4_1!H$51=\"\",\"\",MOD4_1!H$51)","v":""},"PCI.","",null,null,0,"AREQUIPA","CAYLLOMA",null,"AMAZONAS CHACHAPOYAS SONCHE",0,"AMAZONAS","CHACHAPOYAS","SONCHE","C010121",null,0,"AREQUIPA","300. EDUCACION AREQUIPA","UGEL CAMANA",null,null,null,null,null,null,null,39,""]
[1,"GESTION ESCOLAR","P3B",{"$f":"IF(MOD4_1!O$51=\"\",\"\",MOD4_1!O$51)","v":""},"Programa Curricular Anual.","",null,null,0,"AREQUIPA","CONDESUYOS",null,"AMAZONAS CONDORCANQUI EL CENEPA",0,"AMAZONAS","CONDORCANQUI","EL CENEPA","C010402",null,0,"AREQUIPA","300. EDUCACION AREQUIPA","UGEL CARAVELI",null,null,null,null,null,null,null,40,""]
[1,"GESTION ESCOLAR","P3C",{"$f":"IF(MOD4_1!V$51=\"\",\"\",MOD4_1!V$51)","v":""},"Programa Curricular Anual.","",null,null,0,"AREQUIPA","ISLAY",null,"AMAZONAS CONDORCANQUI NIEVA",0,"AMAZONAS","CONDORCANQUI","NIEVA","C010401",null,0,"AREQUIPA","300. EDUCACION AREQUIPA","UGEL CASTILLA",null,null,null,null,null,null,null,41,""]
[1,"GESTION ESCOLAR","P3D",{"$f":"IF(MOD4_1!AC$51=\"\",\"\",MOD4_1!AC$51)","v":""},"Programa Curricular Anual. Documentos de autorización de visitas y excursiones pedagógicas para el aprendizaje vivencial del enfoque ambiental.","",null,null,0,"AREQUIPA","LA UNION",null,"AMAZONAS CONDORCANQUI RIO SANTIAGO",0,"AMAZONAS","CONDORCANQUI","RIO SANTIAGO","C010403",null,0,"AREQUIPA","302. EDUCACION AREQUIPA NORTE","UGEL CAYLLOMA",null,null,null,null,null,null,null,42,""]
[null,"GESTION ESCOLAR","P3E",{"$f":"IF(MOD4_1!AP$43=\"\",\"\",MOD4_1!AP$43)","v":""},null,"",null,null,0,"AYACUCHO","CANGALLO",null,"AMAZONAS LUYA CAMPORREDONDO",0,"AMAZONAS","LUYA","CAMPORREDONDO","C010502",null,0,"AREQUIPA","300. EDUCACION AREQUIPA","UGEL CONDESUYOS",null,null,null,null,null,null,null,43,""]
[null,null,"VALIDACION4.1",{"$f":"(COUNTIF(D40:D43,\"\")+COUNTIF(D30:D33,\"\")+COUNTIF(D35:D38,\"\"))=0","v":false},null,"",null,null,0,"AYACUCHO","HUAMANGA",null,"AMAZONAS LUYA COCABAMBA",0,"AMAZONAS","LUYA","COCABAMBA","C010503",null,0,"AREQUIPA","300. EDUCACION AREQUIPA","UGEL ISLAY",null,null,null,null,null,null,null,44,""]
[2,"EDUCACION PARA EL CAMBIO CLIMATICO","P1A",{"$f":"IF(MOD4_2!H$21=\"\",\"\",MOD4_2!H$21)","v":""},"PCI. PAT.","",null,null,0,"AYACUCHO","HUANCA SANCOS",null,"AMAZONAS LUYA COLCAMAR",0,"AMAZONAS","LUYA","COLCAMAR","C010504",null,0,"AREQUIPA","302. EDUCACION AREQUIPA NORTE","UGEL LA JOYA",null,null,null,null,null,null,null,45,""]
[2,"EDUCACION PARA EL CAMBIO CLIMATICO","P1B",{"$f":"IF(MOD4_2!O$21=\"\",\"\",MOD4_2!O$21)","v":""},"PCI.","",null,null,0,"AYACUCHO","HUANTA",null,"AMAZONAS LUYA CONILA",0,"AMAZONAS","LUYA","CONILA","C010505",null,0,"AREQUIPA","300. EDUCACION AREQUIPA","UGEL LA UNION",null,null,null,null,null,null,null,46,""]
[2,"EDUCACION PARA EL CAMBIO CLIMATICO","P1C",{"$f":"IF(MOD4_2!V$21=\"\",\"\",MOD4_2!V$21)","v":""},"PCI.","",null,null,0,"AYACUCHO","LA MAR",null,"AMAZONAS LUYA INGUILPATA",0,"AMAZONAS","LUYA","INGUILPATA","C010506",null,0,"AYACUCHO","301. EDUCACION CENTRO AYACUCHO","UGEL CANGALLO",null,null,null,null,null,null,null,47,""]
[2,"EDUCACION PARA EL CAMBIO CLIMATICO","P1D",{"$f":"IF(MOD4_2!AC$21=\"\",\"\",MOD4_2!AC$21)","v":""},"PCI. PAT.","",null,null,0,"AYACUCHO","LUCANAS",null,"AMAZONAS LUYA LAMUD",0,"AMAZONAS","LUYA","LAMUD","C010501",null,0,"AYACUCHO","308. EDUCACION HUAMANGA","UGEL HUAMANGA",null,null,null,null,null,null,null,48,""]
[null,"EDUCACION PARA EL CAMBIO CLIMATICO","P1E",{"$f":"IF(MOD4_2!AP$13=\"\",\"\",MOD4_2!AP$13)","v":""},null,"",null,null,0,"AYACUCHO","PARINACOCHAS",null,"AMAZONAS LUYA LONGUITA",0,"AMAZONAS","LUYA","LONGUITA","C010507",null,0,"AYACUCHO","312. EDUCACION HUANCASANCOS","UGEL HUANCASANCOS",null,null,null,null,null,null,null,49,""]
[null,null,"VALIDACION4.2",{"$f":"COUNTIF(D46:D49,\"\")=0","v":false},null,"",null,null,0,"AYACUCHO","PAUCAR DEL SARA SARA",null,"AMAZONAS LUYA LONYA CHICO",0,"AMAZONAS","LUYA","LONYA CHICO","C010508",null,0,"AYACUCHO","305. EDUCACION HUANTA","UGEL HUANTA",null,null,null,null,null,null,null,50,""]
[3,"EDUCACION EN ECOEFICIENCIA","P1A",{"$f":"IF(MOD4_3!H$21=\"\",\"\",MOD4_3!H$21)","v":""},"Plan de Manejo de Residuos Sólidos. PAT.","",null,null,0,"AYACUCHO","SUCRE",null,"AMAZONAS LUYA LUYA",0,"AMAZONAS","LUYA","LUYA","C010509",null,0,"AYACUCHO","307. EDUCACION VRAE LA MAR","UGEL LA MAR"]
[3,"EDUCACION EN ECOEFICIENCIA","P1B",{"$f":"IF(MOD4_3!O$21=\"\",\"\",MOD4_3!O$21)","v":""},"PCI.","",null,null,0,"AYACUCHO","VICTOR FAJARDO",null,"AMAZONAS LUYA LUYA VIEJO",0,"AMAZONAS","LUYA","LUYA VIEJO","C010510",null,0,"AYACUCHO","302. EDUCACION LUCANAS","UGEL LUCANAS"]
[3,"EDUCACION EN ECOEFICIENCIA","P1C",{"$f":"IF(MOD4_3!V$21=\"\",\"\",MOD4_3!V$21)","v":""},"Cartas u oficios de coordinación del Gobierno regional u otros aliados. PAT.","",null,null,0,"AYACUCHO","VILCAS HUAMAN",null,"AMAZONAS LUYA MARIA",0,"AMAZONAS","LUYA","MARIA","C010511",null,0,"AYACUCHO","303. EDUCACION SARA SARA","UGEL PARINACOCHAS"]
[3,"EDUCACION EN ECOEFICIENCIA","P1D",{"$f":"IF(MOD4_3!AC$21=\"\",\"\",MOD4_3!AC$21)","v":""},"PAT. Documentos administrativos: Cartas, Oficios, Memo. Lista de Asistencia.","",null,null,0,"CAJAMARCA","CAJABAMBA",null,"AMAZONAS LUYA OCALLI",0,"AMAZONAS","LUYA","OCALLI","C010512",null,0,"AYACUCHO","304. EDUCACION SUR PAUZA","UGEL PAUCAR DE SARASARA"]
[null,"EDUCACION EN ECOEFICIENCIA","P1E",{"$f":"IF(MOD4_3!AP$13=\"\",\"\",MOD4_3!AP$13)","v":""},null,"",null,null,0,"CAJAMARCA","CAJAMARCA",null,"AMAZONAS LUYA OCUMAL",0,"AMAZONAS","LUYA","OCUMAL","C010513",null,0,"AYACUCHO","309. EDUCACION UGEL SUCRE","UGEL SUCRE"]
[3,"EDUCACION EN ECOEFICIENCIA","P2A",{"$f":"IF(MOD4_3!H$36=\"\",\"\",MOD4_3!H$36)","v":""},"PAT.","",null,null,0,"CAJAMARCA","CELENDIN",null,"AMAZONAS LUYA PISUQUIA",0,"AMAZONAS","LUYA","PISUQUIA","C010514",null,0,"AYACUCHO","310. EDUCACION UGEL VICTOR FAJARDO","UGEL VICTOR FAJARDO"]
[3,"EDUCACION EN ECOEFICIENCIA","P2B",{"$f":"IF(MOD4_3!O$36=\"\",\"\",MOD4_3!O$36)","v":""},"PCI.","",null,null,0,"CAJAMARCA","CHOTA",null,"AMAZONAS LUYA PROVIDENCIA",0,"AMAZONAS","LUYA","PROVIDENCIA","C010515",null,0,"AYACUCHO","311. EDUCACION VILCASHUAMAN","UGEL VILCASHUAMAN",null,null,null,null,null,null,null,null,null,null,null,null,null,null,null,null,null,null,null,{"$f":"IF(LISTAS!D45=TRUE,\"Anterior\",\"\")","v":""}]
[3,"EDUCACION EN ECOEFICIENCIA","P2C",{"$f":"IF(MOD4_3!V$36=\"\",\"\",MOD4_3!V$36)","v":""},"PCI.","",null,null,0,"CAJAMARCA","CONTUMAZA",null,"AMAZONAS LUYA SAN CRISTOBAL",0,"AMAZONAS","LUYA","SAN CRISTOBAL","C010516",null,0,"CAJAMARCA","306. EDUCACION UGEL CAJABAMBA","UGEL CAJABAMBA"]
[3,"EDUCACION EN ECOEFICIENCIA","P2D",{"$f":"IF(MOD4_3!AC$36=\"\",\"\",MOD4_3!AC$36)","v":""},"PAT. Documentos administrativos: Cartas, Oficios, Memo. Lista de Asistencia.","",null,null,0,"CAJAMARCA","CUTERVO",null,"AMAZONAS LUYA SAN FRANCISCO DEL YESO",0,"AMAZONAS","LUYA","SAN FRANCISCO DEL YESO","C010517",null,0,"CAJAMARCA","309. EDUCACION UGEL CAJAMARCA","UGEL CAJAMARCA"]
[null,"EDUCACION EN ECOEFICIENCIA","P2E",{"$f":"IF(MOD4_3!AP$28=\"\",\"\",MOD4_3!AP$28)","v":""},null,"",null,null,0,"CAJAMARCA","HUALGAYOC",null,"AMAZONAS LUYA SAN JERONIMO",0,"AMAZONAS","LUYA","SAN JERONIMO","C010518",null,0,"CAJAMARCA","308. EDUCACION UGEL CELENDIN","UGEL CELENDIN"]
[3,"EDUCACION EN ECOEFICIENCIA","P3A",{"$f":"IF(MOD4_3!H$51=\"\",\"\",MOD4_3!H$51)","v":""},"PCI. PAT.","",null,null,0,"CAJAMARCA","JAEN",null,"AMAZONAS LUYA SAN JUAN DE LOPECANCHA",0,"AMAZONAS","LUYA","SAN JUAN DE LOPECANCHA","C010519",null,0,"CAJAMARCA","301. EDUCACION CHOTA","UGEL CHOTA"]
[3,"EDUCACION EN ECOEFICIENCIA","P3B",{"$f":"IF(MOD4_3!O$51=\"\",\"\",MOD4_3!O$51)","v":""},"PCI. PAT.","",null,null,0,"CAJAMARCA","SAN IGNACIO",null,"AMAZONAS LUYA SANTA CATALINA",0,"AMAZONAS","LUYA","SANTA CATALINA","C010520",null,0,"CAJAMARCA","311. EDUCACION UGEL CONTUMAZA","UGEL CONTUMAZA"]
[3,"EDUCACION EN ECOEFICIENCIA","P3C",{"$f":"IF(MOD4_3!V$51=\"\",\"\",MOD4_3!V$51)","v":""},"PCI. PAT.","",null,null,0,"CAJAMARCA","SAN MARCOS",null,"AMAZONAS LUYA SANTO TOMAS",0,"AMAZONAS","LUYA","SANTO TOMAS","C010521",null,0,"CAJAMARCA","302. EDUCACION CUTERVO","UGEL CUTERVO"]
[3,"EDUCACION EN ECOEFICIENCIA","P3D",{"$f":"IF(MOD4_3!AC$51=\"\",\"\",MOD4_3!AC$51)","v":""},"PAT. Documentos administrativos: Cartas, Oficios, Memo. Lista de Asistencia. Fotografías.","",null,null,0,"CAJAMARCA","SAN MIGUEL",null,"AMAZONAS LUYA TINGO",0,"AMAZONAS","LUYA","TINGO","C010522",null,0,"CAJAMARCA","307. EDUCACION UGEL BAMBAMARCA","UGEL HUALGAYOC"]
[null,"EDUCACION EN ECOEFICIENCIA","P3E",{"$f":"IF(MOD4_3!AP$43=\"\",\"\",MOD4_3!AP$43)","v":""},null,"",null,null,0,"CAJAMARCA","SAN PABLO",null,"AMAZONAS LUYA TRITA",0,"AMAZONAS","LUYA","TRITA","C010523",null,0,"CAJAMARCA","303. EDUCACION JAEN","UGEL JAEN"]
[3,"EDUCACION EN ECOEFICIENCIA","P4A",{"$f":"IF(MOD4_3!H$66=\"\",\"\",MOD4_3!H$66)","v":""},"PCI. PAT.","",null,null,{"$f":"IF($D$9=J67,I66+1,0)","v":0},"CAJAMARCA","SANTA CRUZ",null,{"$f":"O67&\" \"&P67&\" \"&Q67","v":"AMAZONAS RODRIGUEZ DE MENDOZA CHIRIMOTO"},{"$f":"IF(AND($D$9=O67,$D$10=P67),N66+1,0)","v":0},"AMAZONAS","RODRIGUEZ DE MENDOZA","CHIRIMOTO","C010602",null,{"$f":"IF($D$9=U67,T66+1,0)","v":0},"CAJAMARCA","304. EDUCACION SAN IGNACIO","UGEL SAN IGNACIO"]
[3,"EDUCACION EN ECOEFICIENCIA","P4B",{"$f":"IF(MOD4_3!O$66=\"\",\"\",MOD4_3!O$66)","v":""},"PCI. PAT.","",null,null,0,"CALLAO","CALLAO",null,"AMAZONAS RODRIGUEZ DE MENDOZA COCHAMAL",0,"AMAZONAS","RODRIGUEZ DE MENDOZA","COCHAMAL","C010603",null,0,"CAJAMARCA","310. EDUCACION UGEL SAN MARCOS","UGEL SAN MARCOS"]
[3,"EDUCACION EN ECOEFICIENCIA","P4C",{"$f":"IF(MOD4_3!V$66=\"\",\"\",MOD4_3!V$66)","v":""},"PCI. PAT.","",null,null,0,"CUSCO","ACOMAYO",null,"AMAZONAS RODRIGUEZ DE MENDOZA HUAMBO",0,"AMAZONAS","RODRIGUEZ DE MENDOZA","HUAMBO","C010604",null,0,"CAJAMARCA","312. EDUCACION UGEL SAN MIGUEL","UGEL SAN MIGUEL"]
[3,"EDUCACION EN ECOEFICIENCIA","P4D",{"$f":"IF(MOD4_3!AC$66=\"\",\"\",MOD4_3!AC$66)","v":""},"Documentos administrativos: Cartas, Oficios, Memo. Actas, Convenios, Acuerdos.","",null,null,0,"CUSCO","ANTA",null,"AMAZONAS RODRIGUEZ DE MENDOZA LIMABAMBA",0,"AMAZONAS","RODRIGUEZ DE MENDOZA","LIMABAMBA","C010605",null,0,"CAJAMARCA","313. EDUCACION UGEL SAN PABLO","UGEL SAN PABLO"]
[null,"EDUCACION EN ECOEFICIENCIA","P4E",{"$f":"IF(MOD4_3!AP$58=\"\",\"\",MOD4_3!AP$58)","v":""},null,"",null,null,0,"CUSCO","CALCA",null,"AMAZONAS RODRIGUEZ DE MENDOZA LONGAR",0,"AMAZONAS","RODRIGUEZ DE MENDOZA","LONGAR","C010606",null,0,"CAJAMARCA","305. EDUCACION UGEL SANTA CRUZ","UGEL SANTA CRUZ"]
[null,null,"VALIDACION4.3",{"$f":"(COUNTIF(D62:D65,\"\")+COUNTIF(D52:D55,\"\")+COUNTIF(D67:D70,\"\")+COUNTIF(D57:D60,\"\"))=0","v":false},null,"",null,null,0,"CUSCO","CANAS",null,"AMAZONAS RODRIGUEZ DE MENDOZA MARISCAL BENAVIDES",0,"AMAZONAS","RODRIGUEZ DE MENDOZA","MARISCAL BENAVIDES","C010607",null,0,"CUSCO","303. EDUCACION QUISPICANCHIS","UGEL ACOMAYO"]
[4,"EDUCACION EN SALUD","P1A",{"$f":"IF(MOD4_4!H$21=\"\",\"\",MOD4_4!H$21)","v":""},"Plan de Salud Escolar. PAT.","",null,null,0,"CUSCO","CANCHIS",null,"AMAZONAS RODRIGUEZ DE MENDOZA MILPUC",0,"AMAZONAS","RODRIGUEZ DE MENDOZA","MILPUC","C010608",null,0,"CUSCO","300. EDUCACION CUSCO","UGEL ANTA"]
[4,"EDUCACION EN SALUD","P1B",{"$f":"IF(MOD4_4!O$21=\"\",\"\",MOD4_4!O$21)","v":""},"Cargo de entrega. Consentimientos informados firmados.","",null,null,0,"CUSCO","CHUMBIVILCAS",null,"AMAZONAS RODRIGUEZ DE MENDOZA OMIA",0,"AMAZONAS","RODRIGUEZ DE MENDOZA","OMIA","C010609",null,0,"CUSCO","311. UGEL CALCA","UGEL CALCA"]
[4,"EDUCACION EN SALUD","P1C",{"$f":"IF(MOD4_4!V$21=\"\",\"\",MOD4_4!V$21)","v":""},"PAT.","",null,null,0,"CUSCO","CUSCO",null,"AMAZONAS RODRIGUEZ DE MENDOZA SAN NICOLAS",0,"AMAZONAS","RODRIGUEZ DE MENDOZA","SAN NICOLAS","C010601",null,0,"CUSCO","302. EDUCACION CANCHIS","UGEL CANAS"]
[4,"EDUCACION EN SALUD","P1D",{"$f":"IF(MOD4_4!AC$21=\"\",\"\",MOD4_4!AC$21)","v":""},"Documentos administrativos: Cartas, Oficios, Memo. Actas, Convenios, Acuerdos.","",null,null,0,"CUSCO","ESPINAR",null,"AMAZONAS RODRIGUEZ DE MENDOZA SANTA ROSA",0,"AMAZONAS","RODRIGUEZ DE MENDOZA","SANTA ROSA","C010610",null,0,"CUSCO","302. EDUCACION CANCHIS","UGEL CANCHIS"]
[null,"EDUCACION EN SALUD","P1E",{"$f":"IF(MOD4_4!AP$13=\"\",\"\",MOD4_4!AP$13)","v":""},null,"",null,null,0,"CUSCO","LA CONVENCION",null,"AMAZONAS RODRIGUEZ DE MENDOZA TOTORA",0,"AMAZONAS","RODRIGUEZ DE MENDOZA","TOTORA","C010611",null,0,"CUSCO","305. EDUCACION CHUMBIVILCAS","UGEL CHUMBIVILCAS"]
[4,"EDUCACION EN SALUD","P2A",{"$f":"IF(MOD4_4!H$36=\"\",\"\",MOD4_4!H$36)","v":""},"PAT.","",null,null,0,"CUSCO","PARURO",null,"AMAZONAS RODRIGUEZ DE MENDOZA VISTA ALEGRE",0,"AMAZONAS","RODRIGUEZ DE MENDOZA","VISTA ALEGRE","C010612",null,0,"CUSCO","312. UGEL CUSCO","UGEL CUSCO"]
[4,"EDUCACION EN SALUD","P2B",{"$f":"IF(MOD4_4!O$36=\"\",\"\",MOD4_4!O$36)","v":""},"Acta de conformación. PAT.","",null,null,0,"CUSCO","PAUCARTAMBO",null,"AMAZONAS UTCUBAMBA BAGUA GRANDE",0,"AMAZONAS","UTCUBAMBA","BAGUA GRANDE","C010701",null,0,"CUSCO","310. EDUCACION ESPINAR","UGEL ESPINAR"]
[4,"EDUCACION EN SALUD","P2C",{"$f":"IF(MOD4_4!V$36=\"\",\"\",MOD4_4!V$36)","v":""},"PAT.","",null,null,0,"CUSCO","QUISPICANCHI",null,"AMAZONAS UTCUBAMBA CAJARURO",0,"AMAZONAS","UTCUBAMBA","CAJARURO","C010702",null,0,"CUSCO","304. EDUCACION LA CONVENCION","UGEL LA CONVENCION"]
[4,"EDUCACION EN SALUD","P2D",{"$f":"IF(MOD4_4!AC$36=\"\",\"\",MOD4_4!AC$36)","v":""},"PAT.","",null,null,0,"CUSCO","URUBAMBA",null,"AMAZONAS UTCUBAMBA CUMBA",0,"AMAZONAS","UTCUBAMBA","CUMBA","C010703",null,0,"CUSCO","306. UGEL PARURO","UGEL PARURO"]
[null,"EDUCACION EN SALUD","P2E",{"$f":"IF(MOD4_4!AP$28=\"\",\"\",MOD4_4!AP$28)","v":""},null,"",null,null,0,"HUANCAVELICA","ACOBAMBA",null,"AMAZONAS UTCUBAMBA EL MILAGRO",0,"AMAZONAS","UTCUBAMBA","EL MILAGRO","C010704",null,0,"CUSCO","309. EDUCACION PAUCARTAMBO","UGEL PAUCARTAMBO"]
[4,"EDUCACION EN SALUD","P3A",{"$f":"IF(MOD4_4!H$51=\"\",\"\",MOD4_4!H$51)","v":""},"PAT.","",null,null,0,"HUANCAVELICA","ANGARAES",null,"AMAZONAS UTCUBAMBA JAMALCA",0,"AMAZONAS","UTCUBAMBA","JAMALCA","C010705",null,0,"CUSCO","300. EDUCACION CUSCO","UGEL PICHARI-KIMBIRI"]
[4,"EDUCACION EN SALUD","P3B",{"$f":"IF(MOD4_4!O$51=\"\",\"\",MOD4_4!O$51)","v":""},"PCI.","",null,null,0,"HUANCAVELICA","CASTROVIRREYNA",null,"AMAZONAS UTCUBAMBA LONYA GRANDE",0,"AMAZONAS","UTCUBAMBA","LONYA GRANDE","C010706",null,0,"CUSCO","303. EDUCACION QUISPICANCHIS","UGEL QUISPICANCHI"]
[4,"EDUCACION EN SALUD","P3C",{"$f":"IF(MOD4_4!V$51=\"\",\"\",MOD4_4!V$51)","v":""},"PAT. Cartas, Oficios, Memo.","",null,null,0,"HUANCAVELICA","CHURCAMPA",null,"AMAZONAS UTCUBAMBA YAMON",0,"AMAZONAS","UTCUBAMBA","YAMON","C010707",null,0,"CUSCO","308. UGEL URUBAMBA","UGEL URUBAMBA"]
[4,"EDUCACION EN SALUD","P3D",{"$f":"IF(MOD4_4!AC$51=\"\",\"\",MOD4_4!AC$51)","v":""},"PAT. Documentos administrativos: Cartas, Oficios, Memo. Lista de Asistencia. Fotografías.","",null,null,0,"HUANCAVELICA","HUANCAVELICA",null,"ANCASH AIJA AIJA",0,"ANCASH","AIJA","AIJA","C020201",null,0,"HUANCAVELICA","008. GERENCIA SUB-REGIONAL ACOBAMBA","UGEL ACOBAMBA"]
[null,"EDUCACION EN SALUD","P3E",{"$f":"IF(MOD4_4!AP$43=\"\",\"\",MOD4_4!AP$43)","v":""},null,"",null,null,0,"HUANCAVELICA","HUAYTARA",null,"ANCASH AIJA CORIS",0,"ANCASH","AIJA","CORIS","C020202",null,0,"HUANCAVELICA","307. EDUCACION UGEL ANGARAES","UGEL ANGARAES"]
[4,"EDUCACION EN SALUD","P4A",{"$f":"IF(MOD4_4!H$66=\"\",\"\",MOD4_4!H$66)","v":""},"PAT.","",null,null,0,"HUANCAVELICA","TAYACAJA",null,"ANCASH AIJA HUACLLAN",0,"ANCASH","AIJA","HUACLLAN","C020203",null,0,"HUANCAVELICA","006. GERENCIA SUB-REGIONAL CASTROVIRREYNA","UGEL CASTROVIRREYNA"]
[4,"EDUCACION EN SALUD","P4B",{"$f":"IF(MOD4_4!O$66=\"\",\"\",MOD4_4!O$66)","v":""},"PCI.","",null,null,0,"HUANUCO","AMBO",null,"ANCASH AIJA LA MERCED",0,"ANCASH","AIJA","LA MERCED","C020204",null,0,"HUANCAVELICA","005. GERENCIA SUB-REGIONAL CHURCAMPA","UGEL CHURCAMPA"]
[4,"EDUCACION EN SALUD","P4C",{"$f":"IF(MOD4_4!V$66=\"\",\"\",MOD4_4!V$66)","v":""},"PCI.","",null,null,0,"HUANUCO","DOS DE MAYO",null,"ANCASH AIJA SUCCHA",0,"ANCASH","AIJA","SUCCHA","C020205",null,0,"HUANCAVELICA","300. EDUCACION HUANCAVELICA","UGEL HUANCAVELICA"]
[4,"EDUCACION EN SALUD","P4D",{"$f":"IF(MOD4_4!AC$66=\"\",\"\",MOD4_4!AC$66)","v":""},"PAT. Documentos administrativos: Cartas, Oficios, Memo. Lista de Asistencia. Fotografías.","",null,null,0,"HUANUCO","HUACAYBAMBA",null,"ANCASH ANTONIO RAYMONDI ACZO",0,"ANCASH","ANTONIO RAYMONDI","ACZO","C020302",null,0,"HUANCAVELICA","007. GERENCIA SUB-REGIONAL HUAYTARA","UGEL HUAYTARA"]
[null,"EDUCACION EN SALUD","P4E",{"$f":"IF(MOD4_4!AP$58=\"\",\"\",MOD4_4!AP$58)","v":""},null,"",null,null,0,"HUANUCO","HUAMALIES",null,"ANCASH ANTONIO RAYMONDI CHACCHO",0,"ANCASH","ANTONIO RAYMONDI","CHACCHO","C020303",null,0,"HUANCAVELICA","002. GERENCIA SUB-REGIONAL TAYACAJA","UGEL SURCUBAMBA"]
[4,"EDUCACION EN SALUD","P5A",{"$f":"IF(MOD4_4!H$81=\"\",\"\",MOD4_4!H$81)","v":""},"PAT.","",null,null,0,"HUANUCO","HUANUCO",null,"ANCASH ANTONIO RAYMONDI CHINGAS",0,"ANCASH","ANTONIO RAYMONDI","CHINGAS","C020304",null,0,"HUANCAVELICA","002. GERENCIA SUB-REGIONAL TAYACAJA","UGEL TAYACAJA"]
[4,"EDUCACION EN SALUD","P5B",{"$f":"IF(MOD4_4!O$81=\"\",\"\",MOD4_4!O$81)","v":""},"PCI. PAT.","",null,null,0,"HUANUCO","LAURICOCHA",null,"ANCASH ANTONIO RAYMONDI LLAMELLIN",0,"ANCASH","ANTONIO RAYMONDI","LLAMELLIN","C020301",null,0,"HUANUCO","308. EDUCACION UGEL AMBO","UGEL AMBO"]
[4,"EDUCACION EN SALUD","P5C",{"$f":"IF(MOD4_4!V$81=\"\",\"\",MOD4_4!V$81)","v":""},"PCI. PAT.",{"$f":"IF(D95=\"SI\",E95,\"\")","v":""},null,null,0,"HUANUCO","LEONCIO PRADO",null,"ANCASH ANTONIO RAYMONDI MIRGAS",0,"ANCASH","ANTONIO RAYMONDI","MIRGAS","C020305",null,0,"HUANUCO","303. EDUCACION DOS DE MAYO","UGEL DOS DE MAYO"]
[4,"EDUCACION EN SALUD","P5D",{"$f":"IF(MOD4_4!AC$81=\"\",\"\",MOD4_4!AC$81)","v":""},"PAT. Documentos administrativos: Cartas, Oficios, Memo. Lista de Asistencia. Fotografías.","",null,null,0,"HUANUCO","MARAÑON",null,"ANCASH ANTONIO RAYMONDI SAN JUAN DE RONTOY",0,"ANCASH","ANTONIO RAYMONDI","SAN JUAN DE RONTOY","C020306",null,0,"HUANUCO","307. EDUCACION UGEL HUACAYBAMBA","UGEL HUACAYBAMBA"]
[null,"EDUCACION EN SALUD","P5E",{"$f":"IF(MOD4_4!AP$73=\"\",\"\",MOD4_4!AP$73)","v":""},null,"",null,null,0,"HUANUCO","PACHITEA",null,"ANCASH ASUNCION ACOCHACA",0,"ANCASH","ASUNCION","ACOCHACA","C020402",null,0,"HUANUCO","305. EDUCACION UGEL HUAMALIES","UGEL HUAMALIES"]
[4,"EDUCACION EN SALUD","P6A",{"$f":"IF(MOD4_4!H$96=\"\",\"\",MOD4_4!H$96)","v":""},"PAT.","",null,null,0,"HUANUCO","PUERTO INCA",null,"ANCASH ASUNCION CHACAS",0,"ANCASH","ASUNCION","CHACAS","C020401",null,0,"HUANUCO","311. EDUCACION UGEL HUANUCO","UGEL HUANUCO"]
[4,"EDUCACION EN SALUD","P6B",{"$f":"IF(MOD4_4!O$96=\"\",\"\",MOD4_4!O$96)","v":""},"PCI.","",null,null,0,"HUANUCO","YAROWILCA",null,"ANCASH BOLOGNESI ABELARDO PARDO LEZAMETA",0,"ANCASH","BOLOGNESI","ABELARDO PARDO LEZAMETA","C020502",null,0,"HUANUCO","309. EDUCACION UGEL LAURICOCHA","UGEL LAURICOCHA"]
[4,"EDUCACION EN SALUD","P6C",{"$f":"IF(MOD4_4!V$96=\"\",\"\",MOD4_4!V$96)","v":""},"PAT.","",null,null,0,"ICA","CHINCHA",null,"ANCASH BOLOGNESI ANTONIO RAYMONDI",0,"ANCASH","BOLOGNESI","ANTONIO RAYMONDI","C020503",null,0,"HUANUCO","302. EDUCACION LEONCIO PRADO","UGEL LEONCIO PRADO"]
[4,"EDUCACION EN SALUD","P6D",{"$f":"IF(MOD4_4!AC$96=\"\",\"\",MOD4_4!AC$96)","v":""},"PAT. Documentos administrativos: Cartas, Oficios, Memo. Lista de Asistencia. Fotografías.","",null,null,0,"ICA","ICA",null,"ANCASH BOLOGNESI AQUIA",0,"ANCASH","BOLOGNESI","AQUIA","C020504",null,0,"HUANUCO","301. EDUCACION MARANON","UGEL MARANON"]
[null,"EDUCACION EN SALUD","P6E",{"$f":"IF(MOD4_4!AP$88=\"\",\"\",MOD4_4!AP$88)","v":""},null,"",null,null,0,"ICA","NAZCA",null,"ANCASH BOLOGNESI CAJACAY",0,"ANCASH","BOLOGNESI","CAJACAY","C020505",null,0,"HUANUCO","304. EDUCACION UGEL PACHITEA","UGEL PACHITEA"]
[null,null,"VALIDACION4.4",{"$f":"(IF(D21=\"NO\",0,COUNTIF(D73:D76,\"\"))+IF(D22=\"NO\",0,COUNTIF(D78:D81,\"\"))+COUNTIF(D93:D96,\"\")+COUNTIF(D83:D86,\"\")+COUNTIF(D98:D101,\"\")+COUNTIF(D88:D91,\"\"))=0","v":false},null,"",null,null,0,"ICA","PALPA",null,"ANCASH BOLOGNESI CANIS",0,"ANCASH","BOLOGNESI","CANIS","C020506",null,0,"HUANUCO","306. EDUCACION UGEL PUERTO INCA","UGEL PUERTO INCA"]
[5,"GESTION DEL RIESGO DE DESASTRES","P1A",{"$f":"IF(MOD4_5!H$21=\"\",\"\",MOD4_5!H$21)","v":""},"PAT.","",null,null,0,"ICA","PISCO",null,"ANCASH BOLOGNESI CHIQUIAN",0,"ANCASH","BOLOGNESI","CHIQUIAN","C020501",null,0,"HUANUCO","310. EDUCACION UGEL YAROWILCA","UGEL YAROWILCA"]
[5,"GESTION DEL RIESGO DE DESASTRES","P1B",{"$f":"IF(MOD4_5!O$21=\"\",\"\",MOD4_5!O$21)","v":""},"PCI.","",null,null,0,"JUNIN","CHANCHAMAYO",null,"ANCASH BOLOGNESI COLQUIOC",0,"ANCASH","BOLOGNESI","COLQUIOC","C020507",null,0,"ICA","301. EDUCACION CHINCHA","UGEL CHINCHA"]
[5,"GESTION DEL RIESGO DE DESASTRES","P1C",{"$f":"IF(MOD4_5!V$21=\"\",\"\",MOD4_5!V$21)","v":""},"PAT.","",null,null,0,"JUNIN","CHUPACA",null,"ANCASH BOLOGNESI HUALLANCA",0,"ANCASH","BOLOGNESI","HUALLANCA","C020508",null,0,"ICA","300. EDUCACION ICA","UGEL ICA"]
[5,"GESTION DEL RIESGO DE DESASTRES","P1D",{"$f":"IF(MOD4_5!AC$21=\"\",\"\",MOD4_5!AC$21)","v":""},"PAT. Documentos administrativos: Cartas, Oficios, Memo. Lista de Asistencia. Fotografías.","",null,null,0,"JUNIN","CONCEPCION",null,"ANCASH BOLOGNESI HUASTA",0,"ANCASH","BOLOGNESI","HUASTA","C020509",null,0,"ICA","302. EDUCACION NASCA","UGEL NAZCA"]
[null,"GESTION DEL RIESGO DE DESASTRES","P1E",{"$f":"IF(MOD4_5!AP$13=\"\",\"\",MOD4_5!AP$13)","v":""},null,"",null,null,0,"JUNIN","HUANCAYO",null,"ANCASH BOLOGNESI HUAYLLACAYAN",0,"ANCASH","BOLOGNESI","HUAYLLACAYAN","C020510",null,0,"ICA","304. EDUCACION PALPA","UGEL PALPA"]
[null,null,"VALIDACION4.5",{"$f":"COUNTIF(D104:D107,\"\")=0","v":false},null,"",null,null,0,"JUNIN","JAUJA",null,"ANCASH BOLOGNESI LA PRIMAVERA",0,"ANCASH","BOLOGNESI","LA PRIMAVERA","C020511",null,0,"ICA","303. EDUCACION PISCO","UGEL PISCO"]
[null,null,"VALIDACION4",{"$f":"(COUNTIF(D45,TRUE)+COUNTIF(D51,TRUE)+COUNTIF(D72,TRUE)+COUNTIF(D103,TRUE)+COUNTIF(D109,TRUE))=5","v":false},null,"",null,null,0,"JUNIN","JUNIN",null,"ANCASH BOLOGNESI MANGAS",0,"ANCASH","BOLOGNESI","MANGAS","C020512",null,0,"JUNIN","303. EDUCACION CHANCHAMAYO","UGEL CHANCHAMAYO"]
["PEIA","PROYECTO EJECUTADO EN EL 2016","Espacio de Vida – EsVi",{"$f":"IF(MOD4_6!W20=\"\",\"\",MOD4_6!W20)","v":""},null,"",null,null,0,"JUNIN","SATIPO",null,"ANCASH BOLOGNESI PACLLON",0,"ANCASH","BOLOGNESI","PACLLON","C020513",null,0,"JUNIN","306. EDUCACION CHUPACA","UGEL CHUPACA"]
["PEIA","PROYECTO EJECUTADO EN EL 2017","Manejo de Residuos Sólidos – MARES",{"$f":"IF(MOD4_6!W23=\"\",\"\",MOD4_6!W23)","v":""},null,"",null,null,0,"JUNIN","TARMA",null,"ANCASH BOLOGNESI SAN MIGUEL DE CORPANQUI",0,"ANCASH","BOLOGNESI","SAN MIGUEL DE CORPANQUI","C020514",null,0,"JUNIN","305. EDUCACION CONCEPCION","UGEL CONCEPCION"]
["PEIA","PROYECTO EJECUTADO EN EL 2018","Vida y Verde – VIVE",{"$f":"IF(MOD4_6!W26=\"\",\"\",MOD4_6!W26)","v":""},null,"",null,null,0,"JUNIN","YAULI",null,"ANCASH BOLOGNESI TICLLOS",0,"ANCASH","BOLOGNESI","TICLLOS","C020515",null,0,"JUNIN","304. EDUCACION HUANCAYO","UGEL HUANCAYO"]
["PEIA","PROYECTO EJECUTADO EN EL 2019","GLOBE Perú",{"$f":"IF(MOD4_6!W29=\"\",\"\",MOD4_6!W29)","v":""},null,"",null,null,0,"LA LIBERTAD","ASCOPE",null,"ANCASH CARHUAZ ACOPAMPA",0,"ANCASH","CARHUAZ","ACOPAMPA","C020602",null,0,"JUNIN","307. EDUCACION JAUJA","UGEL JAUJA"]
["PEIA","PROYECTO EJECUTADO EN EL 2020","Mi Huella – Mido y reduzco mi huella de carbono",{"$f":"IF(MOD4_6!W32=\"\",\"\",MOD4_6!W32)","v":""},null,"",null,null,0,"LA LIBERTAD","BOLIVAR",null,"ANCASH CARHUAZ AMASHCA",0,"ANCASH","CARHUAZ","AMASHCA","C020603",null,0,"JUNIN","309. EDUCACION PROVINCIA DE JUNIN","UGEL JUNIN"]
["PEIA","PROYECTO EJECUTADO EN EL 2021","Otro proyecto 1",{"$f":"IF(MOD4_6!W35=\"\",\"\",MOD4_6!W35)","v":""},null,"",null,null,0,"LA LIBERTAD","CHEPEN",null,"ANCASH CARHUAZ ANTA",0,"ANCASH","CARHUAZ","ANTA","C020604",null,0,"JUNIN","302. EDUCACION SATIPO","UGEL PANGOA"]
["PEIA","PROYECTO EJECUTADO EN EL 2022","Otro proyecto 2",{"$f":"IF(MOD4_6!W38=\"\",\"\",MOD4_6!W38)","v":""},null,"",null,null,0,"LA LIBERTAD","GRAN CHIMU",null,"ANCASH CARHUAZ ATAQUERO",0,"ANCASH","CARHUAZ","ATAQUERO","C020605",null,0,"JUNIN","303. EDUCACION CHANCHAMAYO","UGEL PICHANAKI"]
["PEIA","PROYECTO EJECUTADO EN EL 2023","Otro proyecto 3",{"$f":"IF(MOD4_6!W41=\"\",\"\",MOD4_6!W41)","v":""},null,"",null,null,0,"LA LIBERTAD","JULCAN",null,"ANCASH CARHUAZ CARHUAZ",0,"ANCASH","CARHUAZ","CARHUAZ","C020601",null,0,"JUNIN","302. EDUCACION SATIPO","UGEL RIO ENE-MANTARO"]
[null,null,null,null,null,"",null,null,0,"LA LIBERTAD","OTUZCO",null,"ANCASH CARHUAZ MARCARA",0,"ANCASH","CARHUAZ","MARCARA","C020606",null,0,"JUNIN","302. EDUCACION SATIPO","UGEL RIO TAMBO"]
[null,"Cambio climático","Espacio de Vida – EsVi",{"$f":"IF(MOD4_6!AA20=\"\",\"\",MOD4_6!AA20)","v":""},null,"",null,null,0,"LA LIBERTAD","PACASMAYO",null,"ANCASH CARHUAZ PARIAHUANCA",0,"ANCASH","CARHUAZ","PARIAHUANCA","C020607",null,0,"JUNIN","302. EDUCACION SATIPO","UGEL SATIPO"]
[null,"Ecoeficiencia","Espacio de Vida – EsVi",{"$f":"IF(MOD4_6!AE20=\"\",\"\",MOD4_6!AE20)","v":""},null,"",null,null,0,"LA LIBERTAD","PATAZ",null,"ANCASH CARHUAZ SAN MIGUEL DE ACO",0,"ANCASH","CARHUAZ","SAN MIGUEL DE ACO","C020608",null,0,"JUNIN","301. EDUCACION TARMA","UGEL TARMA"]
[null,"Salud","Espacio de Vida – EsVi",{"$f":"IF(MOD4_6!AI20=\"\",\"\",MOD4_6!AI20)","v":""},null,"",null,null,0,"LA LIBERTAD","SANCHEZ CARRION",null,"ANCASH CARHUAZ SHILLA",0,"ANCASH","CARHUAZ","SHILLA","C020609",null,0,"JUNIN","308. EDUCACION YAULI - LA OROYA","UGEL YAULI"]
[null,"Gestión de riesgo","Espacio de Vida – EsVi",{"$f":"IF(MOD4_6!AM20=\"\",\"\",MOD4_6!AM20)","v":""},null,"",null,null,0,"LA LIBERTAD","SANTIAGO DE CHUCO",null,"ANCASH CARHUAZ TINCO",0,"ANCASH","CARHUAZ","TINCO","C020610",null,0,"LA LIBERTAD","313. EDUCACION EL PORVENIR","UGEL 01 - EL PORVENIR"]
[null,null,null,null,null,"",null,null,0,"LA LIBERTAD","TRUJILLO",null,"ANCASH CARHUAZ YUNGAR",0,"ANCASH","CARHUAZ","YUNGAR","C020611",null,0,"LA LIBERTAD","314. EDUCACION LA ESPERANZA","UGEL 02 - LA ESPERANZA"]
[null,"Cambio climático","Manejo de Residuos Sólidos – MARES",{"$f":"IF(MOD4_6!AA23=\"\",\"\",MOD4_6!AA23)","v":""},null,"",null,null,0,"LA LIBERTAD","VIRU",null,"ANCASH CARLOS FERMIN FITZCARRALD SAN LUIS",0,"ANCASH","CARLOS FERMIN FITZCARRALD","SAN LUIS","C020701",null,0,"LA LIBERTAD","315. EDUCACION TRUJILLO NOR OESTE","UGEL 03 - TRUJILLO NOR OESTE"]
[null,"Ecoeficiencia","Manejo de Residuos Sólidos – MARES",{"$f":"IF(MOD4_6!AE23=\"\",\"\",MOD4_6!AE23)","v":""},null,"",null,null,0,"LAMBAYEQUE","CHICLAYO",null,"ANCASH CARLOS FERMIN FITZCARRALD SAN NICOLAS",0,"ANCASH","CARLOS FERMIN FITZCARRALD","SAN NICOLAS","C020702",null,0,"LA LIBERTAD","316. EDUCACION TRUJILLO SUR ESTE","UGEL 04 - TRUJILLO SUR ESTE"]
[null,"Salud","Manejo de Residuos Sólidos – MARES",{"$f":"IF(MOD4_6!AI23=\"\",\"\",MOD4_6!AI23)","v":""},null,"",null,null,0,"LAMBAYEQUE","FERREÑAFE",null,"ANCASH CARLOS FERMIN FITZCARRALD YAUYA",0,"ANCASH","CARLOS FERMIN FITZCARRALD","YAUYA","C020703",null,0,"LA LIBERTAD","303. EDUCACION ASCOPE","UGEL ASCOPE"]
[null,"Gestión de riesgo","Manejo de Residuos Sólidos – MARES",{"$f":"IF(MOD4_6!AM23=\"\",\"\",MOD4_6!AM23)","v":""},null,"",null,null,0,"LAMBAYEQUE","LAMBAYEQUE",null,"ANCASH CASMA BUENA VISTA ALTA",0,"ANCASH","CASMA","BUENA VISTA ALTA","C020802",null,0,"LA LIBERTAD","309. EDUCACION BOLIVAR","UGEL BOLIVAR"]
[null,null,null,null,null,"",null,null,0,"LIMA","BARRANCA",null,"ANCASH CASMA CASMA",0,"ANCASH","CASMA","CASMA","C020801",null,0,"LA LIBERTAD","301. EDUCACION CHEPEN","UGEL CHEPEN"]
[null,"Cambio climático","Vida y Verde – VIVE",{"$f":"IF(MOD4_6!AA26=\"\",\"\",MOD4_6!AA26)","v":""},null,"",null,null,0,"LIMA","CAJATAMBO",null,"ANCASH CASMA COMANDANTE NOEL",0,"ANCASH","CASMA","COMANDANTE NOEL","C020803",null,0,"LA LIBERTAD","304. EDUCACION GRAN CHIMU","UGEL GRAN CHIMU"]
[null,"Ecoeficiencia","Vida y Verde – VIVE",{"$f":"IF(MOD4_6!AE26=\"\",\"\",MOD4_6!AE26)","v":""},null,"",null,null,{"$f":"IF($D$9=J131,I130+1,0)","v":0},"LIMA","CANTA",null,{"$f":"O131&\" \"&P131&\" \"&Q131","v":"ANCASH CASMA YAUTAN"},{"$f":"IF(AND($D$9=O131,$D$10=P131),N130+1,0)","v":0},"ANCASH","CASMA","YAUTAN","C020804",null,{"$f":"IF($D$9=U131,T130+1,0)","v":0},"LA LIBERTAD","311. EDUCACION JULCAN","UGEL JULCAN"]
[null,"Salud","Vida y Verde – VIVE",{"$f":"IF(MOD4_6!AI26=\"\",\"\",MOD4_6!AI26)","v":""},null,"",null,null,0,"LIMA","CAÑETE",null,"ANCASH CORONGO ACO",0,"ANCASH","CORONGO","ACO","C020902",null,0,"LA LIBERTAD","305. EDUCACION OTUZCO","UGEL OTUZCO"]
[null,"Gestión de riesgo","Vida y Verde – VIVE",{"$f":"IF(MOD4_6!AM26=\"\",\"\",MOD4_6!AM26)","v":""},null,"",null,null,0,"LIMA","HUARAL",null,"ANCASH CORONGO BAMBAS",0,"ANCASH","CORONGO","BAMBAS","C020903",null,0,"LA LIBERTAD","302. EDUCACION PACASMAYO","UGEL PACASMAYO"]
[null,null,null,null,null,"",null,null,0,"LIMA","HUAROCHIRI",null,"ANCASH CORONGO CORONGO",0,"ANCASH","CORONGO","CORONGO","C020901",null,0,"LA LIBERTAD","308. EDUCACION PATAZ","UGEL PATAZ"]
[null,"Cambio climático","GLOBE Perú",{"$f":"IF(MOD4_6!AA29=\"\",\"\",MOD4_6!AA29)","v":""},null,"",null,null,0,"LIMA","HUAURA",null,"ANCASH CORONGO CUSCA",0,"ANCASH","CORONGO","CUSCA","C020904",null,0,"LA LIBERTAD","307. EDUCACION SANCHEZ CARRION","UGEL SANCHEZ CARRION"]
[null,"Ecoeficiencia","GLOBE Perú",{"$f":"IF(MOD4_6!AE29=\"\",\"\",MOD4_6!AE29)","v":""},null,"",null,null,0,"LIMA","LIMA",null,"ANCASH CORONGO LA PAMPA",0,"ANCASH","CORONGO","LA PAMPA","C020905",null,0,"LA LIBERTAD","306. EDUCACION SANTIAGO DE CHUCO","UGEL SANTIAGO DE CHUCO"]
[null,"Salud","GLOBE Perú",{"$f":"IF(MOD4_6!AI29=\"\",\"\",MOD4_6!AI29)","v":""},null,"",null,null,0,"LIMA","OYON",null,"ANCASH CORONGO YANAC",0,"ANCASH","CORONGO","YANAC","C020906",null,0,"LA LIBERTAD","312. EDUCACION VIRU","UGEL VIRU"]
[null,"Gestión de riesgo","GLOBE Perú",{"$f":"IF(MOD4_6!AM29=\"\",\"\",MOD4_6!AM29)","v":""},null,"",null,null,0,"LIMA","YAUYOS",null,"ANCASH CORONGO YUPAN",0,"ANCASH","CORONGO","YUPAN","C020907",null,0,"LAMBAYEQUE","300. EDUCACION CHICLAYO","UGEL CHICLAYO"]
[null,null,null,null,null,"",null,null,0,"LORETO","ALTO AMAZONAS",null,"ANCASH HUARAZ COCHABAMBA",0,"ANCASH","HUARAZ","COCHABAMBA","C020102",null,0,"LAMBAYEQUE","303. EDUCACION FERRENAFE","UGEL FERRENAFE"]
[null,"Cambio climático","Mi Huella – Mido y reduzco mi huella de carbono",{"$f":"IF(MOD4_6!AA32=\"\",\"\",MOD4_6!AA32)","v":""},null,"",null,null,0,"LORETO","DATEM DEL MARAÑON",null,"ANCASH HUARAZ COLCABAMBA",0,"ANCASH","HUARAZ","COLCABAMBA","C020103",null,0,"LAMBAYEQUE","302. EDUCACION LAMBAYEQUE","UGEL LAMBAYEQUE"]
[null,"Ecoeficiencia","Mi Huella – Mido y reduzco mi huella de carbono",{"$f":"IF(MOD4_6!AE32=\"\",\"\",MOD4_6!AE32)","v":""},null,"",null,null,0,"LORETO","LORETO",null,"ANCASH HUARAZ HUANCHAY",0,"ANCASH","HUARAZ","HUANCHAY","C020104",null,0,"LIMA","001-56: 01 SAN JUAN DE MIRAFLORES","UGEL 01 SAN JUAN DE MIRAFLORES"]
[null,"Salud","Mi Huella – Mido y reduzco mi huella de carbono",{"$f":"IF(MOD4_6!AI32=\"\",\"\",MOD4_6!AI32)","v":""},null,"",null,null,0,"LORETO","MARISCAL RAMON CASTILLA",null,"ANCASH HUARAZ HUARAZ",0,"ANCASH","HUARAZ","HUARAZ","C020101",null,0,"LIMA","002-57: 02 SAN MARTIN DE PORRAS","UGEL 02 RIMAC"]
[null,"Gestión de riesgo","Mi Huella – Mido y reduzco mi huella de carbono",{"$f":"IF(MOD4_6!AM32=\"\",\"\",MOD4_6!AM32)","v":""},null,"",null,null,0,"LORETO","MAYNAS",null,"ANCASH HUARAZ INDEPENDENCIA",0,"ANCASH","HUARAZ","INDEPENDENCIA","C020105",null,0,"LIMA","003-58: 03 CERCADO","UGEL 03 BRENA"]
[null,null,null,null,null,"",null,null,0,"LORETO","PUTUMAYO",null,"ANCASH HUARAZ JANGAS",0,"ANCASH","HUARAZ","JANGAS","C020106",null,0,"LIMA","004-59: 04 COMAS","UGEL 04 COMAS"]
[null,"Nombre del proyecto",null,{"$f":"IF(MOD4_6!K35=\"\",\"\",MOD4_6!K35)","v":""},null,"",null,null,0,"LORETO","REQUENA",null,"ANCASH HUARAZ LA LIBERTAD",0,"ANCASH","HUARAZ","LA LIBERTAD","C020107",null,0,"LIMA","005-60: 05 SAN JUAN DE LURIGANCHO","UGEL 05 SAN JUAN DE LURIGANCHO"]
[null,"Cambio climático","Otro proyecto 1",{"$f":"IF(MOD4_6!AA35=\"\",\"\",MOD4_6!AA35)","v":""},null,"",null,null,0,"LORETO","UCAYALI",null,"ANCASH HUARAZ OLLEROS",0,"ANCASH","HUARAZ","OLLEROS","C020108",null,0,"LIMA","006-61: 06 VITARTE","UGEL 06 ATE"]
[null,"Ecoeficiencia","Otro proyecto 1",{"$f":"IF(MOD4_6!AE35=\"\",\"\",MOD4_6!AE35)","v":""},null,"",null,null,0,"MADRE DE DIOS","MANU",null,"ANCASH HUARAZ PAMPAS GRANDE",0,"ANCASH","HUARAZ","PAMPAS GRANDE","C020109",null,0,"LIMA","007-62: 07 SAN BORJA","UGEL 07 SAN BORJA"]
[null,"Salud","Otro proyecto 1",{"$f":"IF(MOD4_6!AI35=\"\",\"\",MOD4_6!AI35)","v":""},null,"",null,null,0,"MADRE DE DIOS","TAHUAMANU",null,"ANCASH HUARAZ PARIACOTO",0,"ANCASH","HUARAZ","PARIACOTO","C020110",null,0,"LIMA","301. EDUCACION CANETE","UGEL 08 CANETE"]
[null,"Gestión de riesgo","Otro proyecto 1",{"$f":"IF(MOD4_6!AM35=\"\",\"\",MOD4_6!AM35)","v":""},null,"",null,null,0,"MADRE DE DIOS","TAMBOPATA",null,"ANCASH HUARAZ PIRA",0,"ANCASH","HUARAZ","PIRA","C020111",null,0,"LIMA","302. EDUCACION HUAURA","UGEL 09 HUAURA"]
[null,null,null,null,null,"",null,null,0,"MOQUEGUA","GENERAL SANCHEZ CERRO",null,"ANCASH HUARAZ TARICA",0,"ANCASH","HUARAZ","TARICA","C020112",null,0,"LIMA","303. EDUCACION HUARAL","UGEL 10 HUARAL"]
[null,"Nombre del proyecto",null,{"$f":"IF(MOD4_6!K38=\"\",\"\",MOD4_6!K38)","v":""},null,"",null,null,0,"MOQUEGUA","ILO",null,"ANCASH HUARI ANRA",0,"ANCASH","HUARI","ANRA","C021002",null,0,"LIMA","304. EDUCACION CAJATAMBO","UGEL 11 CAJATAMBO"]
[null,"Cambio climático","Otro proyecto 2",{"$f":"IF(MOD4_6!AA38=\"\",\"\",MOD4_6!AA38)","v":""},null,"",null,null,0,"MOQUEGUA","MARISCAL NIETO",null,"ANCASH HUARI CAJAY",0,"ANCASH","HUARI","CAJAY","C021003",null,0,"LIMA","305. EDUCACION CANTA","UGEL 12 CANTA"]
[null,"Ecoeficiencia","Otro proyecto 2",{"$f":"IF(MOD4_6!AE38=\"\",\"\",MOD4_6!AE38)","v":""},null,"",null,null,0,"PASCO","DANIEL ALCIDES CARRION",null,"ANCASH HUARI CHAVIN DE HUANTAR",0,"ANCASH","HUARI","CHAVIN DE HUANTAR","C021004",null,0,"LIMA","306. EDUCACION YAUYOS","UGEL 13 YAUYOS"]
[null,"Salud","Otro proyecto 2",{"$f":"IF(MOD4_6!AI38=\"\",\"\",MOD4_6!AI38)","v":""},null,"",null,null,0,"PASCO","OXAPAMPA",null,"ANCASH HUARI HUACACHI",0,"ANCASH","HUARI","HUACACHI","C021005",null,0,"LIMA","307. EDUCACION OYON","UGEL 14 OYON"]
[null,"Gestión de riesgo","Otro proyecto 2",{"$f":"IF(MOD4_6!AM38=\"\",\"\",MOD4_6!AM38)","v":""},null,"",null,null,0,"PASCO","PASCO",null,"ANCASH HUARI HUACCHIS",0,"ANCASH","HUARI","HUACCHIS","C021006",null,0,"LIMA","308. EDUCACION HUAROCHIRI","UGEL 15 HUAROCHIRI"]
[null,null,null,null,null,"",null,null,0,"PIURA","AYABACA",null,"ANCASH HUARI HUACHIS",0,"ANCASH","HUARI","HUACHIS","C021007",null,0,"LIMA","309. EDUCACION BARRANCA","UGEL 16 BARRANCA"]
[null,"Nombre del proyecto",null,{"$f":"IF(MOD4_6!K41=\"\",\"\",MOD4_6!K41)","v":""},null,"",null,null,0,"PIURA","HUANCABAMBA",null,"ANCASH HUARI HUANTAR",0,"ANCASH","HUARI","HUANTAR","C021008",null,0,"CALLAO","300. EDUCACION CALLAO","DRE CALLAO"]
[null,"Cambio climático","Otro proyecto 3",{"$f":"IF(MOD4_6!AA41=\"\",\"\",MOD4_6!AA41)","v":""},null,"",null,null,0,"PIURA","MORROPON",null,"ANCASH HUARI HUARI",0,"ANCASH","HUARI","HUARI","C021001",null,0,"CALLAO","302. EDUCACION VENTANILLA","UGEL VENTANILLA"]
[null,"Ecoeficiencia","Otro proyecto 3",{"$f":"IF(MOD4_6!AE41=\"\",\"\",MOD4_6!AE41)","v":""},null,{"$f":"IF(D159=\"SI\",E159,\"\")","v":""},null,null,0,"PIURA","PAITA",null,"ANCASH HUARI MASIN",0,"ANCASH","HUARI","MASIN","C021009",null,0,"LORETO","306. EDUCACION DATEM DEL MARANON","UGEL ALTO AMAZONAS-SAN LORENZO"]
[null,"Salud","Otro proyecto 3",{"$f":"IF(MOD4_6!AI41=\"\",\"\",MOD4_6!AI41)","v":""},null,"",null,null,0,"PIURA","PIURA",null,"ANCASH HUARI PAUCAS",0,"ANCASH","HUARI","PAUCAS","C021010",null,0,"LORETO","301. EDUCACION ALTO AMAZONAS","UGEL ALTO AMAZONAS-YURIMAGUAS"]
[null,"Gestión de riesgo","Otro proyecto 3",{"$f":"IF(MOD4_6!AM41=\"\",\"\",MOD4_6!AM41)","v":""},null,"",null,null,0,"PIURA","SECHURA",null,"ANCASH HUARI PONTO",0,"ANCASH","HUARI","PONTO","C021011",null,0,"LORETO","305. EDUCACION NAUTA","UGEL LORETO - NAUTA"]
[null,null,null,null,null,"",null,null,0,"PIURA","SULLANA",null,"ANCASH HUARI RAHUAPAMPA",0,"ANCASH","HUARI","RAHUAPAMPA","C021012",null,0,"LORETO","300. EDUCACION LORETO","UGEL MAYNAS"]
[null,null,null,null,null,"",null,null,0,"PIURA","TALARA",null,"ANCASH HUARI RAPAYAN",0,"ANCASH","HUARI","RAPAYAN","C021013",null,0,"LORETO","300. EDUCACION LORETO","UGEL PUTUMAYO"]
[null,null,"VALIDACIONPEIA",{"$f":"COUNTIF(D111:D118,\"SI\")*4=COUNTIF(D166:D205,\"SI\")+COUNTIF(D166:D205,\"NO\")","v":true},null,"",null,null,0,"PUNO","AZANGARO",null,"ANCASH HUARI SAN MARCOS",0,"ANCASH","HUARI","SAN MARCOS","C021014",null,0,"LORETO","303. EDUCACION MARISCAL RAMON CASTILLA","UGEL RAMON CASTILLA-CABALLOCOCHA"]
[null,null,"VALIDAALGUNPEIA",{"$f":"COUNTIF(D111:D118,\"SI\")=0","v":true},null,"",null,null,0,"PUNO","CARABAYA",null,"ANCASH HUARI SAN PEDRO DE CHANA",0,"ANCASH","HUARI","SAN PEDRO DE CHANA","C021015",null,0,"LORETO","304. EDUCACION REQUENA","UGEL REQUENA"]
[6,"Espacio de Vida – EsVi","P01A",{"$f":"IF(MOD4_6_1!H$21=\"\",\"\",MOD4_6_1!H$21)","v":""},"PAT.","",null,null,0,"PUNO","CHUCUITO",null,"ANCASH HUARI UCO",0,"ANCASH","HUARI","UCO","C021016",null,0,"LORETO","302. EDUCACION CONTAMANA","UGEL UCAYALI-CONTAMANA"]
[6,"Espacio de Vida – EsVi","P01B",{"$f":"IF(MOD4_6_1!O$21=\"\",\"\",MOD4_6_1!O$21)","v":""},"Plan de Trabajo del PEAI. PCI.","",null,null,0,"PUNO","EL COLLAO",null,"ANCASH HUARMEY COCHAPETI",0,"ANCASH","HUARMEY","COCHAPETI","C021102",null,0,"MADRE DE DIOS","300. EDUCACION MADRE DE DIOS","UGEL MANU"]
[6,"Espacio de Vida – EsVi","P01C",{"$f":"IF(MOD4_6_1!V$21=\"\",\"\",MOD4_6_1!V$21)","v":""},"PAT.","",null,null,0,"PUNO","HUANCANE",null,"ANCASH HUARMEY CULEBRAS",0,"ANCASH","HUARMEY","CULEBRAS","C021103",null,0,"MADRE DE DIOS","300. EDUCACION MADRE DE DIOS","UGEL TAHUAMANU"]
[6,"Espacio de Vida – EsVi","P01D",{"$f":"IF(MOD4_6_1!AC$21=\"\",\"\",MOD4_6_1!AC$21)","v":""},"Documentos administrativos: Cartas, Oficios, Memo. Actas, Convenios, Acuerdos.","",null,null,0,"PUNO","LAMPA",null,"ANCASH HUARMEY HUARMEY",0,"ANCASH","HUARMEY","HUARMEY","C021101",null,0,"MADRE DE DIOS","300. EDUCACION MADRE DE DIOS","UGEL TAMBOPATA"]
[6,null,"P01E",{"$f":"IF(MOD4_6_1!AP$13=\"\",\"\",MOD4_6_1!AP$13)","v":""},null,"",null,null,0,"PUNO","MELGAR",null,"ANCASH HUARMEY HUAYAN",0,"ANCASH","HUARMEY","HUAYAN","C021104",null,0,"MOQUEGUA","303. EDUCACION SANCHEZ CERRO","UGEL GENERAL SANCHEZ CERRO"]
[6,"Manejo de Residuos Sólidos – MARES","P02A",{"$f":"IF(MOD4_6_2!H$21=\"\",\"\",MOD4_6_2!H$21)","v":""},"PAT.","",null,null,0,"PUNO","MOHO",null,"ANCASH HUARMEY MALVAS",0,"ANCASH","HUARMEY","MALVAS","C021105",null,0,"MOQUEGUA","301. EDUCACION ILO","UGEL ILO"]
[6,"Manejo de Residuos Sólidos – MARES","P02B",{"$f":"IF(MOD4_6_2!O$21=\"\",\"\",MOD4_6_2!O$21)","v":""},"Plan de Trabajo del PEAI. PCI.","",null,null,0,"PUNO","PUNO",null,"ANCASH HUAYLAS CARAZ",0,"ANCASH","HUAYLAS","CARAZ","C021201",null,0,"MOQUEGUA","302. EDUCACION MARISCAL NIETO","UGEL MARISCAL NIETO"]
[6,"Manejo de Residuos Sólidos – MARES","P02C",{"$f":"IF(MOD4_6_2!V$21=\"\",\"\",MOD4_6_2!V$21)","v":""},"PAT.","",null,null,0,"PUNO","SAN ANTONIO DE PUTINA",null,"ANCASH HUAYLAS HUALLANCA",0,"ANCASH","HUAYLAS","HUALLANCA","C021202",null,0,"PASCO","302. EDUCACION DANIEL A. CARRION","UGEL DANIEL ALCIDES CARRION"]
[6,"Manejo de Residuos Sólidos – MARES","P02D",{"$f":"IF(MOD4_6_2!AC$21=\"\",\"\",MOD4_6_2!AC$21)","v":""},"Documentos administrativos: Cartas, Oficios, Memo. Actas, Convenios, Acuerdos.","",null,null,0,"PUNO","SAN ROMAN",null,"ANCASH HUAYLAS HUATA",0,"ANCASH","HUAYLAS","HUATA","C021203",null,0,"PASCO","301. EDUCACION OXAPAMPA","UGEL OXAPAMPA"]
[6,null,"P02E",{"$f":"IF(MOD4_6_2!AP$13=\"\",\"\",MOD4_6_2!AP$13)","v":""},null,"",null,null,0,"PUNO","SANDIA",null,"ANCASH HUAYLAS HUAYLAS",0,"ANCASH","HUAYLAS","HUAYLAS","C021204",null,0,"PASCO","303. UGEL PASCO","UGEL PASCO"]
[6,"Vida y Verde – VIVE","P03A",{"$f":"IF(MOD4_6_3!H$21=\"\",\"\",MOD4_6_3!H$21)","v":""},"PAT.","",null,null,0,"PUNO","YUNGUYO",null,"ANCASH HUAYLAS MATO",0,"ANCASH","HUAYLAS","MATO","C021205",null,0,"PIURA","308. EDUCACION UGEL AYABACA","UGEL AYABACA"]
[6,"Vida y Verde – VIVE","P03B",{"$f":"IF(MOD4_6_3!O$21=\"\",\"\",MOD4_6_3!O$21)","v":""},"Plan de Trabajo del PEAI. PCI.","",null,null,0,"SAN MARTIN","BELLAVISTA",null,"ANCASH HUAYLAS PAMPAROMAS",0,"ANCASH","HUAYLAS","PAMPAROMAS","C021206",null,0,"PIURA","303. EDUCACION ALTO PIURA","UGEL CHULUCANAS"]
[6,"Vida y Verde – VIVE","P03C",{"$f":"IF(MOD4_6_3!V$21=\"\",\"\",MOD4_6_3!V$21)","v":""},"PAT.","",null,null,0,"SAN MARTIN","EL DORADO",null,"ANCASH HUAYLAS PUEBLO LIBRE",0,"ANCASH","HUAYLAS","PUEBLO LIBRE","C021207",null,0,"PIURA","309. UNIDAD DE GESTION EDUCATIVA LOCAL HUANCABAMBA","UGEL HUANCABAMBA"]
[6,"Vida y Verde – VIVE","P03D",{"$f":"IF(MOD4_6_3!AC$21=\"\",\"\",MOD4_6_3!AC$21)","v":""},"Documentos administrativos: Cartas, Oficios, Memo. Actas, Convenios, Acuerdos.","",null,null,0,"SAN MARTIN","HUALLAGA",null,"ANCASH HUAYLAS SANTA CRUZ",0,"ANCASH","HUAYLAS","SANTA CRUZ","C021208",null,0,"PIURA","310. UNIDAD DE GESTION EDUCATIVA LOCAL HUARMACA","UGEL HUARMACA"]
[6,null,"P03E",{"$f":"IF(MOD4_6_3!AP$13=\"\",\"\",MOD4_6_3!AP$13)","v":""},null,"",null,null,0,"SAN MARTIN","LAMAS",null,"ANCASH HUAYLAS SANTO TORIBIO",0,"ANCASH","HUAYLAS","SANTO TORIBIO","C021209",null,0,"PIURA","300. EDUCACION PIURA","UGEL LA UNION"]
[6,"GLOBE Perú","P04A",{"$f":"IF(MOD4_6_4!H$21=\"\",\"\",MOD4_6_4!H$21)","v":""},"PAT.","",null,null,0,"SAN MARTIN","MARISCAL CACERES",null,"ANCASH HUAYLAS YURACMARCA",0,"ANCASH","HUAYLAS","YURACMARCA","C021210",null,0,"PIURA","307. EDUCACION UGEL MORROPON","UGEL MORROPON"]
[6,"GLOBE Perú","P04B",{"$f":"IF(MOD4_6_4!O$21=\"\",\"\",MOD4_6_4!O$21)","v":""},"Plan de Trabajo del PEAI. PCI.","",null,null,0,"SAN MARTIN","MOYOBAMBA",null,"ANCASH MARISCAL LUZURIAGA CASCA",0,"ANCASH","MARISCAL LUZURIAGA","CASCA","C021302",null,0,"PIURA","305. EDUCACION UGEL DE PAITA","UGEL PAITA"]
[6,"GLOBE Perú","P04C",{"$f":"IF(MOD4_6_4!V$21=\"\",\"\",MOD4_6_4!V$21)","v":""},"PAT.","",null,null,0,"SAN MARTIN","PICOTA",null,"ANCASH MARISCAL LUZURIAGA ELEAZAR GUZMAN BARRON",0,"ANCASH","MARISCAL LUZURIAGA","ELEAZAR GUZMAN BARRON","C021303",null,0,"PIURA","300. EDUCACION PIURA","UGEL PIURA"]
[6,"GLOBE Perú","P04D",{"$f":"IF(MOD4_6_4!AC$21=\"\",\"\",MOD4_6_4!AC$21)","v":""},"Documentos administrativos: Cartas, Oficios, Memo. Actas, Convenios, Acuerdos.","",null,null,0,"SAN MARTIN","RIOJA",null,"ANCASH MARISCAL LUZURIAGA FIDEL OLIVAS ESCUDERO",0,"ANCASH","MARISCAL LUZURIAGA","FIDEL OLIVAS ESCUDERO","C021304",null,0,"PIURA","300. EDUCACION PIURA","UGEL SECHURA"]
[6,null,"P04E",{"$f":"IF(MOD4_6_4!AP$13=\"\",\"\",MOD4_6_4!AP$13)","v":""},null,"",null,null,0,"SAN MARTIN","SAN MARTIN",null,"ANCASH MARISCAL LUZURIAGA LLAMA",0,"ANCASH","MARISCAL LUZURIAGA","LLAMA","C021305",null,0,"PIURA","302. EDUCACION LUCIANO CASTILLO COLONNA","UGEL SULLANA"]
[6,"Mi Huella – Mido y reduzco mi huella de carbono","P05A",{"$f":"IF(MOD4_6_5!H$21=\"\",\"\",MOD4_6_5!H$21)","v":""},"PAT.","",null,null,0,"SAN MARTIN","TOCACHE",null,"ANCASH MARISCAL LUZURIAGA LLUMPA",0,"ANCASH","MARISCAL LUZURIAGA","LLUMPA","C021306",null,0,"PIURA","306. EDUCACION UGEL DE TALARA","UGEL TALARA"]
[6,"Mi Huella – Mido y reduzco mi huella de carbono","P05B",{"$f":"IF(MOD4_6_5!O$21=\"\",\"\",MOD4_6_5!O$21)","v":""},"Plan de Trabajo del PEAI. PCI.","",null,null,0,"TACNA","CANDARAVE",null,"ANCASH MARISCAL LUZURIAGA LUCMA",0,"ANCASH","MARISCAL LUZURIAGA","LUCMA","C021307",null,0,"PIURA","300. EDUCACION PIURA","UGEL TAMBOGRANDE"]
[6,"Mi Huella – Mido y reduzco mi huella de carbono","P05C",{"$f":"IF(MOD4_6_5!V$21=\"\",\"\",MOD4_6_5!V$21)","v":""},"PAT.","",null,null,0,"TACNA","JORGE BASADRE",null,"ANCASH MARISCAL LUZURIAGA MUSGA",0,"ANCASH","MARISCAL LUZURIAGA","MUSGA","C021308",null,0,"PUNO","303. EDUCACION AZANGARO","UGEL AZANGARO"]
[6,"Mi Huella – Mido y reduzco mi huella de carbono","P05D",{"$f":"IF(MOD4_6_5!AC$21=\"\",\"\",MOD4_6_5!AC$21)","v":""},"Documentos administrativos: Cartas, Oficios, Memo. Actas, Convenios, Acuerdos.","",null,null,0,"TACNA","TACNA",null,"ANCASH MARISCAL LUZURIAGA PISCOBAMBA",0,"ANCASH","MARISCAL LUZURIAGA","PISCOBAMBA","C021301",null,0,"PUNO","309. EDUCACION CARABAYA MACUSANI","UGEL CARABAYA"]
[6,null,"P05E",{"$f":"IF(MOD4_6_5!AP$13=\"\",\"\",MOD4_6_5!AP$13)","v":""},null,"",null,null,0,"TACNA","TARATA",null,"ANCASH OCROS ACAS",0,"ANCASH","OCROS","ACAS","C021402",null,0,"PUNO","307. EDUCACION CHUCUITO JULI","UGEL CHUCUITO"]
[6,"Otro proyecto 1","P06A",{"$f":"IF(MOD4_6_6!H$21=\"\",\"\",MOD4_6_6!H$21)","v":""},"PAT.","",null,null,0,"TUMBES","CONTRALMIRANTE VILLAR",null,"ANCASH OCROS CAJAMARQUILLA",0,"ANCASH","OCROS","CAJAMARQUILLA","C021403",null,0,"PUNO","314. EDUCACION CRUCERO","UGEL CRUCERO"]
[6,"Otro proyecto 1","P06B",{"$f":"IF(MOD4_6_6!O$21=\"\",\"\",MOD4_6_6!O$21)","v":""},"Plan de Trabajo del PEAI. PCI.","",null,null,0,"TUMBES","TUMBES",null,"ANCASH OCROS CARHUAPAMPA",0,"ANCASH","OCROS","CARHUAPAMPA","C021404",null,0,"PUNO","306. EDUCACION COLLAO","UGEL EL COLLAO"]
[6,"Otro proyecto 1","P06C",{"$f":"IF(MOD4_6_6!V$21=\"\",\"\",MOD4_6_6!V$21)","v":""},"PAT.","",null,null,0,"TUMBES","ZARUMILLA",null,"ANCASH OCROS COCHAS",0,"ANCASH","OCROS","COCHAS","C021405",null,0,"PUNO","304. EDUCACION HUANCANE","UGEL HUANCANE"]
[6,"Otro proyecto 1","P06D",{"$f":"IF(MOD4_6_6!AC$21=\"\",\"\",MOD4_6_6!AC$21)","v":""},"Documentos administrativos: Cartas, Oficios, Memo. Actas, Convenios, Acuerdos.","",null,null,0,"UCAYALI","ATALAYA",null,"ANCASH OCROS CONGAS",0,"ANCASH","OCROS","CONGAS","C021406",null,0,"PUNO","312. EDUCACION LAMPA","UGEL LAMPA"]
[6,null,"P06E",{"$f":"IF(MOD4_6_6!AP$13=\"\",\"\",MOD4_6_6!AP$13)","v":""},null,"",null,null,{"$f":"IF($D$9=J195,I194+1,0)","v":0},"UCAYALI","CORONEL PORTILLO",null,{"$f":"O195&\" \"&P195&\" \"&Q195","v":"ANCASH OCROS LLIPA"},{"$f":"IF(AND($D$9=O195,$D$10=P195),N194+1,0)","v":0},"ANCASH","OCROS","LLIPA","C021407",null,{"$f":"IF($D$9=U195,T194+1,0)","v":0},"PUNO","302. EDUCACION MELGAR","UGEL MELGAR"]
[6,"Otro proyecto 2","P07A",{"$f":"IF(MOD4_6_7!H$21=\"\",\"\",MOD4_6_7!H$21)","v":""},"PAT.","",null,null,{"$f":"IF($D$9=J196,I195+1,0)","v":0},"UCAYALI","PADRE ABAD",null,"ANCASH OCROS OCROS",0,"ANCASH","OCROS","OCROS","C021401",null,0,"PUNO","313. EDUCACION MOHO","UGEL MOHO"]
[6,"Otro proyecto 2","P07B",{"$f":"IF(MOD4_6_7!O$21=\"\",\"\",MOD4_6_7!O$21)","v":""},"Plan de Trabajo del PEAI. PCI.","",null,null,{"$f":"IF($D$9=J197,I196+1,0)","v":0},"UCAYALI","PURUS",null,"ANCASH OCROS SAN CRISTOBAL DE RAJAN",0,"ANCASH","OCROS","SAN CRISTOBAL DE RAJAN","C021408",null,0,"PUNO","311. UGEL PUNO","UGEL PUNO"]
[6,"Otro proyecto 2","P07C",{"$f":"IF(MOD4_6_7!V$21=\"\",\"\",MOD4_6_7!V$21)","v":""},"PAT.","",null,null,null,null,null,null,"ANCASH OCROS SAN PEDRO",0,"ANCASH","OCROS","SAN PEDRO","C021409",null,0,"PUNO","305. EDUCACION PUTINA","UGEL SAN ANTONIO DE PUTINA"]
[6,"Otro proyecto 2","P07D",{"$f":"IF(MOD4_6_7!AC$21=\"\",\"\",MOD4_6_7!AC$21)","v":""},"Documentos administrativos: Cartas, Oficios, Memo. Actas, Convenios, Acuerdos.","",null,null,null,null,null,null,"ANCASH OCROS SANTIAGO DE CHILCAS",0,"ANCASH","OCROS","SANTIAGO DE CHILCAS","C021410",null,0,"PUNO","301. EDUCACION SAN ROMAN","UGEL SAN ROMAN"]
[6,null,"P07E",{"$f":"IF(MOD4_6_7!AP$13=\"\",\"\",MOD4_6_7!AP$13)","v":""},null,"",null,null,null,null,null,null,"ANCASH PALLASCA BOLOGNESI",0,"ANCASH","PALLASCA","BOLOGNESI","C021502",null,0,"PUNO","310. EDUCACION SANDIA","UGEL SANDIA"]
[6,"Otro proyecto 3","P08A",{"$f":"IF(MOD4_6_8!H$21=\"\",\"\",MOD4_6_8!H$21)","v":""},"PAT.","",null,null,null,null,null,null,"ANCASH PALLASCA CABANA",0,"ANCASH","PALLASCA","CABANA","C021501",null,0,"PUNO","308. EDUCACION YUNGUYO","UGEL YUNGUYO"]
[6,"Otro proyecto 3","P08B",{"$f":"IF(MOD4_6_8!O$21=\"\",\"\",MOD4_6_8!O$21)","v":""},"Plan de Trabajo del PEAI. PCI.","",null,null,null,null,null,null,"ANCASH PALLASCA CONCHUCOS",0,"ANCASH","PALLASCA","CONCHUCOS","C021503",null,0,"SAN MARTIN","307. EDUCACION BELLAVISTA","UGEL BELLAVISTA"]
[6,"Otro proyecto 3","P08C",{"$f":"IF(MOD4_6_8!V$21=\"\",\"\",MOD4_6_8!V$21)","v":""},"PAT.","",null,null,null,null,null,null,"ANCASH PALLASCA HUACASCHUQUE",0,"ANCASH","PALLASCA","HUACASCHUQUE","C021504",null,0,"SAN MARTIN","301. EDUCACION BAJO MAYO","UGEL EL DORADO"]
[6,"Otro proyecto 3","P08D",{"$f":"IF(MOD4_6_8!AC$21=\"\",\"\",MOD4_6_8!AC$21)","v":""},"Documentos administrativos: Cartas, Oficios, Memo. Actas, Convenios, Acuerdos.","",null,null,null,null,null,null,"ANCASH PALLASCA HUANDOVAL",0,"ANCASH","PALLASCA","HUANDOVAL","C021505",null,0,"SAN MARTIN","302. EDUCACION HUALLAGA CENTRAL","UGEL HUALLAGA"]
[6,null,"P08E",{"$f":"IF(MOD4_6_8!AP$13=\"\",\"\",MOD4_6_8!AP$13)","v":""},null,"",null,null,null,null,null,null,"ANCASH PALLASCA LACABAMBA",0,"ANCASH","PALLASCA","LACABAMBA","C021506",null,0,"SAN MARTIN","305. EDUCACION LAMAS","UGEL LAMAS"]
[null,null,null,null,null,null,null,null,null,null,null,null,"ANCASH PALLASCA LLAPO",0,"ANCASH","PALLASCA","LLAPO","C021507",null,0,"SAN MARTIN","302. EDUCACION HUALLAGA CENTRAL","UGEL MARISCAL CACERES"]
[null,"GESTION ESCOLAR","PORCENTAJE",{"$f":"'MOD7'!P31","v":0},null,null,null,null,null,null,null,null,"ANCASH PALLASCA PALLASCA",0,"ANCASH","PALLASCA","PALLASCA","C021508",null,0,"SAN MARTIN","300. EDUCACION SAN MARTIN","UGEL MOYOBAMBA"]
[null,"EDUCACION PARA EL CAMBIO CLIMATICO","PORCENTAJE",{"$f":"'MOD7'!AG31","v":0},null,null,null,null,null,null,null,null,"ANCASH PALLASCA PAMPAS",0,"ANCASH","PALLASCA","PAMPAS","C021509",null,0,"SAN MARTIN","301. EDUCACION BAJO MAYO","UGEL PICOTA"]
[null,"EDUCACION EN ECOEFICIENCIA","PORCENTAJE",{"$f":"'MOD7'!P36","v":0},null,null,null,null,null,null,null,null,"ANCASH PALLASCA SANTA ROSA",0,"ANCASH","PALLASCA","SANTA ROSA","C021510",null,0,"SAN MARTIN","306. EDUCACION RIOJA","UGEL RIOJA"]
[null,"EDUCACION EN SALUD","PORCENTAJE",{"$f":"'MOD7'!AG36","v":0},null,null,null,null,null,null,null,null,"ANCASH PALLASCA TAUCA",0,"ANCASH","PALLASCA","TAUCA","C021511",null,0,"SAN MARTIN","301. EDUCACION BAJO MAYO","UGEL SAN MARTIN"]
[null,"GESTION DEL RIESGO DE DESASTRES","PORCENTAJE",{"$f":"'MOD7'!P41","v":0},null,null,null,null,null,null,null,null,"ANCASH POMABAMBA HUAYLLAN",0,"ANCASH","POMABAMBA","HUAYLLAN","C021602",null,0,"SAN MARTIN","303. EDUCACION ALTO HUALLAGA","UGEL TOCACHE"]
[null,"PROYECTO EJECUTADO EN EL 2016","PORCENTAJE",{"$f":"'MOD7'!AG41","v":0},null,null,null,null,null,null,null,null,"ANCASH POMABAMBA PAROBAMBA",0,"ANCASH","POMABAMBA","PAROBAMBA","C021603",null,0,"TACNA","300. EDUCACION TACNA","UGEL CANDARAVE"]
[null,"FINAL","PORCENTAJE",{"$f":"'MOD7'!P46","v":0},null,null,null,null,null,null,null,null,"ANCASH POMABAMBA POMABAMBA",0,"ANCASH","POMABAMBA","POMABAMBA","C021601",null,0,"TACNA","300. EDUCACION TACNA","UGEL JORGE BASADRE"]
[null,null,null,null,null,null,null,null,null,null,null,null,"ANCASH POMABAMBA QUINUABAMBA",0,"ANCASH","POMABAMBA","QUINUABAMBA","C021604",null,0,"TACNA","301. UGEL TACNA","UGEL TACNA"]
[null,null,null,null,null,null,null,null,null,null,null,null,"ANCASH RECUAY CATAC",0,"ANCASH","RECUAY","CATAC","C021702",null,0,"TACNA","300. EDUCACION TACNA","UGEL TARATA"]
[null,null,null,null,null,null,null,null,null,null,null,null,"ANCASH RECUAY COTAPARACO",0,"ANCASH","RECUAY","COTAPARACO","C021703",null,0,"TUMBES","302. EDUCACION UGEL CONTRALMIRANTE VILLAR ZORRITOS","UGEL CONTRALMIRANTE VILLAR"]
[null,null,null,null,null,null,null,null,null,null,null,null,"ANCASH RECUAY HUAYLLAPAMPA",0,"ANCASH","RECUAY","HUAYLLAPAMPA","C021704",null,0,"TUMBES","301. EDUCACION UGEL TUMBES","UGEL TUMBES"]
[null,null,null,null,null,null,null,null,null,null,null,null,"ANCASH RECUAY LLACLLIN",0,"ANCASH","RECUAY","LLACLLIN","C021705",null,0,"TUMBES","303. EDUCACION UGEL ZARUMILLA","UGEL ZARUMILLA"]
[null,null,null,null,null,null,null,null,null,null,null,null,"ANCASH RECUAY MARCA",0,"ANCASH","RECUAY","MARCA","C021706",null,0,"UCAYALI","302. EDUCACION ATALAYA","UGEL ATALAYA"]
[null,null,null,null,null,null,null,null,null,null,null,null,"ANCASH RECUAY PAMPAS CHICO",0,"ANCASH","RECUAY","PAMPAS CHICO","C021707",null,0,"UCAYALI","303. EDUCACION CORONEL PORTILLO","UGEL CORONEL PORTILLO"]
[null,null,null,null,null,null,null,null,null,null,null,null,"ANCASH RECUAY PARARIN",0,"ANCASH","RECUAY","PARARIN","C021708",null,0,"UCAYALI","304. EDUCACION PADRE ABAD","UGEL PADRE ABAD"]
[null,null,null,null,null,null,null,null,null,null,null,null,"ANCASH RECUAY RECUAY",0,"ANCASH","RECUAY","RECUAY","C021701",null,0,"UCAYALI","301. EDUCACION PURUS","UGEL PURUS"]
[null,null,null,null,null,null,null,null,null,null,null,null,"ANCASH RECUAY TAPACOCHA",0,"ANCASH","RECUAY","TAPACOCHA","C021709"]
[null,null,null,null,null,null,null,null,null,null,null,null,"ANCASH RECUAY TICAPAMPA",0,"ANCASH","RECUAY","TICAPAMPA","C021710"]
[null,null,null,null,null,null,null,null,null,null,null,null,"ANCASH SANTA CACERES DEL PERU",0,"ANCASH","SANTA","CACERES DEL PERU","C021802"]
[null,null,null,null,null,null,null,null,null,null,null,null,"ANCASH SANTA CHIMBOTE",0,"ANCASH","SANTA","CHIMBOTE","C021801"]
[null,null,null,null,null,null,null,null,null,null,null,null,"ANCASH SANTA COISHCO",0,"ANCASH","SANTA","COISHCO","C021803"]
[null,null,null,null,null,null,null,null,null,null,null,null,"ANCASH SANTA MACATE",0,"ANCASH","SANTA","MACATE","C021804"]
[null,null,null,null,null,null,null,null,null,null,null,null,"ANCASH SANTA MORO",0,"ANCASH","SANTA","MORO","C021805"]
[null,null,null,null,null,null,null,null,null,null,null,null,"ANCASH SANTA NEPEÑA",0,"ANCASH","SANTA","NEPEÑA","C021806"]
[null,null,null,null,null,null,null,null,null,null,null,null,"ANCASH SANTA NUEVO CHIMBOTE",0,"ANCASH","SANTA","NUEVO CHIMBOTE","C021809"]
[null,null,null,null,null,null,null,null,null,null,null,null,"ANCASH SANTA SAMANCO",0,"ANCASH","SANTA","SAMANCO","C021807"]
[null,null,null,null,null,null,null,null,null,null,null,null,"ANCASH SANTA SANTA",0,"ANCASH","SANTA","SANTA","C021808"]
[null,null,null,null,null,null,null,null,null,null,null,null,"ANCASH SIHUAS ACOBAMBA",0,"ANCASH","SIHUAS","ACOBAMBA","C021902"]
[null,null,null,null,null,null,null,null,null,null,null,null,"ANCASH SIHUAS ALFONSO UGARTE",0,"ANCASH","SIHUAS","ALFONSO UGARTE","C021903"]
[null,null,null,null,null,null,null,null,null,null,null,null,"ANCASH SIHUAS CASHAPAMPA",0,"ANCASH","SIHUAS","CASHAPAMPA","C021904"]
[null,null,null,null,null,null,null,null,null,null,null,null,"ANCASH SIHUAS CHINGALPO",0,"ANCASH","SIHUAS","CHINGALPO","C021905"]
[null,null,null,null,null,null,null,null,null,null,null,null,"ANCASH SIHUAS HUAYLLABAMBA",0,"ANCASH","SIHUAS","HUAYLLABAMBA","C021906"]
[null,null,null,null,null,null,null,null,null,null,null,null,"ANCASH SIHUAS QUICHES",0,"ANCASH","SIHUAS","QUICHES","C021907"]
[null,null,null,null,null,null,null,null,null,null,null,null,"ANCASH SIHUAS RAGASH",0,"ANCASH","SIHUAS","RAGASH","C021908"]
[null,null,null,null,null,null,null,null,null,null,null,null,"ANCASH SIHUAS SAN JUAN",0,"ANCASH","SIHUAS","SAN JUAN","C021909"]
[null,null,null,null,null,null,null,null,null,null,null,null,"ANCASH SIHUAS SICSIBAMBA",0,"ANCASH","SIHUAS","SICSIBAMBA","C021910"]
[null,null,null,null,null,null,null,null,null,null,null,null,"ANCASH SIHUAS SIHUAS",0,"ANCASH","SIHUAS","SIHUAS","C021901"]
[null,null,null,null,null,null,null,null,null,null,null,null,"ANCASH YUNGAY CASCAPARA",0,"ANCASH","YUNGAY","CASCAPARA","C022002"]
[null,null,null,null,null,null,null,null,null,null,null,null,"ANCASH YUNGAY MANCOS",0,"ANCASH","YUNGAY","MANCOS","C022003"]
[null,null,null,null,null,null,null,null,null,null,null,null,"ANCASH YUNGAY MATACOTO",0,"ANCASH","YUNGAY","MATACOTO","C022004"]
[null,null,null,null,null,null,null,null,null,null,null,null,"ANCASH YUNGAY QUILLO",0,"ANCASH","YUNGAY","QUILLO","C022005"]
[null,null,null,null,null,null,null,null,null,null,null,null,"ANCASH YUNGAY RANRAHIRCA",0,"ANCASH","YUNGAY","RANRAHIRCA","C022006"]
[null,null,null,null,null,null,null,null,null,null,null,null,"ANCASH YUNGAY SHUPLUY",0,"ANCASH","YUNGAY","SHUPLUY","C022007"]
[null,null,null,null,null,null,null,null,null,null,null,null,"ANCASH YUNGAY YANAMA",0,"ANCASH","YUNGAY","YANAMA","C022008"]
[null,null,null,null,null,null,null,null,null,null,null,null,"ANCASH YUNGAY YUNGAY",0,"ANCASH","YUNGAY","YUNGAY","C022001"]
[null,null,null,null,null,null,null,null,null,null,null,null,"APURIMAC ABANCAY ABANCAY",0,"APURIMAC","ABANCAY","ABANCAY","C030101"]
[null,null,null,null,null,null,null,null,null,null,null,null,"APURIMAC ABANCAY CHACOCHE",0,"APURIMAC","ABANCAY","CHACOCHE","C030102"]
[null,null,null,null,null,null,null,null,null,null,null,null,"APURIMAC ABANCAY CIRCA",0,"APURIMAC","ABANCAY","CIRCA","C030103"]
[null,null,null,null,null,null,null,null,null,null,null,null,"APURIMAC ABANCAY CURAHUASI",0,"APURIMAC","ABANCAY","CURAHUASI","C030104"]
[null,null,null,null,null,null,null,null,null,null,null,null,"APURIMAC ABANCAY HUANIPACA",0,"APURIMAC","ABANCAY","HUANIPACA","C030105"]
[null,null,null,null,null,null,null,null,null,null,null,null,"APURIMAC ABANCAY LAMBRAMA",0,"APURIMAC","ABANCAY","LAMBRAMA","C030106"]
[null,null,null,null,null,null,null,null,null,null,null,null,"APURIMAC ABANCAY PICHIRHUA",0,"APURIMAC","ABANCAY","PICHIRHUA","C030107"]
[null,null,null,null,null,null,null,null,null,null,null,null,{"$f":"O259&\" \"&P259&\" \"&Q259","v":"APURIMAC ABANCAY SAN PEDRO DE CACHORA"},{"$f":"IF(AND($D$9=O259,$D$10=P259),N258+1,0)","v":0},"APURIMAC","ABANCAY","SAN PEDRO DE CACHORA","C030108"]
[null,null,null,null,null,null,null,null,null,null,null,null,"APURIMAC ABANCAY TAMBURCO",0,"APURIMAC","ABANCAY","TAMBURCO","C030109"]
[null,null,null,null,null,null,null,null,null,null,null,null,"APURIMAC ANDAHUAYLAS ANDAHUAYLAS",0,"APURIMAC","ANDAHUAYLAS","ANDAHUAYLAS","C030201"]
[null,null,null,null,null,null,null,null,null,null,null,null,"APURIMAC ANDAHUAYLAS ANDARAPA",0,"APURIMAC","ANDAHUAYLAS","ANDARAPA","C030202"]
[null,null,null,null,null,null,null,null,null,null,null,null,"APURIMAC ANDAHUAYLAS CHIARA",0,"APURIMAC","ANDAHUAYLAS","CHIARA","C030203"]
[null,null,null,null,null,null,null,null,null,null,null,null,"APURIMAC ANDAHUAYLAS HUANCARAMA",0,"APURIMAC","ANDAHUAYLAS","HUANCARAMA","C030204"]
[null,null,null,null,null,null,null,null,null,null,null,null,"APURIMAC ANDAHUAYLAS HUANCARAY",0,"APURIMAC","ANDAHUAYLAS","HUANCARAY","C030205"]
[null,null,null,null,null,null,null,null,null,null,null,null,"APURIMAC ANDAHUAYLAS HUAYANA",0,"APURIMAC","ANDAHUAYLAS","HUAYANA","C030206"]
[null,null,null,null,null,null,null,null,null,null,null,null,"APURIMAC ANDAHUAYLAS JOSE MARIA ARGUEDAS",0,"APURIMAC","ANDAHUAYLAS","JOSE MARIA ARGUEDAS","C030220"]
[null,null,null,null,null,null,null,null,null,null,null,null,"APURIMAC ANDAHUAYLAS KAQUIABAMBA",0,"APURIMAC","ANDAHUAYLAS","KAQUIABAMBA","C030219"]
[null,null,null,null,null,null,null,null,null,null,null,null,"APURIMAC ANDAHUAYLAS KISHUARA",0,"APURIMAC","ANDAHUAYLAS","KISHUARA","C030207"]
[null,null,null,null,null,null,null,null,null,null,null,null,"APURIMAC ANDAHUAYLAS PACOBAMBA",0,"APURIMAC","ANDAHUAYLAS","PACOBAMBA","C030208"]
[null,null,null,null,null,null,null,null,null,null,null,null,"APURIMAC ANDAHUAYLAS PACUCHA",0,"APURIMAC","ANDAHUAYLAS","PACUCHA","C030209"]
[null,null,null,null,null,null,null,null,null,null,null,null,"APURIMAC ANDAHUAYLAS PAMPACHIRI",0,"APURIMAC","ANDAHUAYLAS","PAMPACHIRI","C030210"]
[null,null,null,null,null,null,null,null,null,null,null,null,"APURIMAC ANDAHUAYLAS POMACOCHA",0,"APURIMAC","ANDAHUAYLAS","POMACOCHA","C030211"]
[null,null,null,null,null,null,null,null,null,null,null,null,"APURIMAC ANDAHUAYLAS SAN ANTONIO DE CACHI",0,"APURIMAC","ANDAHUAYLAS","SAN ANTONIO DE CACHI","C030212"]
[null,null,null,null,null,null,null,null,null,null,null,null,"APURIMAC ANDAHUAYLAS SAN JERONIMO",0,"APURIMAC","ANDAHUAYLAS","SAN JERONIMO","C030213"]
[null,null,null,null,null,null,null,null,null,null,null,null,"APURIMAC ANDAHUAYLAS SAN MIGUEL DE CHACCRAMPA",0,"APURIMAC","ANDAHUAYLAS","SAN MIGUEL DE CHACCRAMPA","C030214"]
[null,null,null,null,null,null,null,null,null,null,null,null,"APURIMAC ANDAHUAYLAS SANTA MARIA DE CHICMO",0,"APURIMAC","ANDAHUAYLAS","SANTA MARIA DE CHICMO","C030215"]
[null,null,null,null,null,null,null,null,null,null,null,null,"APURIMAC ANDAHUAYLAS TALAVERA",0,"APURIMAC","ANDAHUAYLAS","TALAVERA","C030216"]
[null,null,null,null,null,null,null,null,null,null,null,null,"APURIMAC ANDAHUAYLAS TUMAY HUARACA",0,"APURIMAC","ANDAHUAYLAS","TUMAY HUARACA","C030217"]
[null,null,null,null,null,null,null,null,null,null,null,null,"APURIMAC ANDAHUAYLAS TURPO",0,"APURIMAC","ANDAHUAYLAS","TURPO","C030218"]
[null,null,null,null,null,null,null,null,null,null,null,null,"APURIMAC ANTABAMBA ANTABAMBA",0,"APURIMAC","ANTABAMBA","ANTABAMBA","C030301"]
[null,null,null,null,null,null,null,null,null,null,null,null,"APURIMAC ANTABAMBA EL ORO",0,"APURIMAC","ANTABAMBA","EL ORO","C030302"]
[null,null,null,null,null,null,null,null,null,null,null,null,"APURIMAC ANTABAMBA HUAQUIRCA",0,"APURIMAC","ANTABAMBA","HUAQUIRCA","C030303"]
[null,null,null,null,null,null,null,null,null,null,null,null,"APURIMAC ANTABAMBA JUAN ESPINOZA MEDRANO",0,"APURIMAC","ANTABAMBA","JUAN ESPINOZA MEDRANO","C030304"]
[null,null,null,null,null,null,null,null,null,null,null,null,"APURIMAC ANTABAMBA OROPESA",0,"APURIMAC","ANTABAMBA","OROPESA","C030305"]
[null,null,null,null,null,null,null,null,null,null,null,null,"APURIMAC ANTABAMBA PACHACONAS",0,"APURIMAC","ANTABAMBA","PACHACONAS","C030306"]
[null,null,null,null,null,null,null,null,null,null,null,null,"APURIMAC ANTABAMBA SABAINO",0,"APURIMAC","ANTABAMBA","SABAINO","C030307"]
[null,null,null,null,null,null,null,null,null,null,null,null,"APURIMAC AYMARAES CAPAYA",0,"APURIMAC","AYMARAES","CAPAYA","C030402"]
[null,null,null,null,null,null,null,null,null,null,null,null,"APURIMAC AYMARAES CARAYBAMBA",0,"APURIMAC","AYMARAES","CARAYBAMBA","C030403"]
[null,null,null,null,null,null,null,null,null,null,null,null,"APURIMAC AYMARAES CHALHUANCA",0,"APURIMAC","AYMARAES","CHALHUANCA","C030401"]
[null,null,null,null,null,null,null,null,null,null,null,null,"APURIMAC AYMARAES CHAPIMARCA",0,"APURIMAC","AYMARAES","CHAPIMARCA","C030404"]
[null,null,null,null,null,null,null,null,null,null,null,null,"APURIMAC AYMARAES COLCABAMBA",0,"APURIMAC","AYMARAES","COLCABAMBA","C030405"]
[null,null,null,null,null,null,null,null,null,null,null,null,"APURIMAC AYMARAES COTARUSE",0,"APURIMAC","AYMARAES","COTARUSE","C030406"]
[null,null,null,null,null,null,null,null,null,null,null,null,"APURIMAC AYMARAES HUAYLLO",0,"APURIMAC","AYMARAES","HUAYLLO","C030407"]
[null,null,null,null,null,null,null,null,null,null,null,null,"APURIMAC AYMARAES JUSTO APU SAHUARAURA",0,"APURIMAC","AYMARAES","JUSTO APU SAHUARAURA","C030408"]
[null,null,null,null,null,null,null,null,null,null,null,null,"APURIMAC AYMARAES LUCRE",0,"APURIMAC","AYMARAES","LUCRE","C030409"]
[null,null,null,null,null,null,null,null,null,null,null,null,"APURIMAC AYMARAES POCOHUANCA",0,"APURIMAC","AYMARAES","POCOHUANCA","C030410"]
[null,null,null,null,null,null,null,null,null,null,null,null,"APURIMAC AYMARAES SAN JUAN DE CHACÑA",0,"APURIMAC","AYMARAES","SAN JUAN DE CHACÑA","C030411"]
[null,null,null,null,null,null,null,null,null,null,null,null,"APURIMAC AYMARAES SAÑAYCA",0,"APURIMAC","AYMARAES","SAÑAYCA","C030411"]
[null,null,null,null,null,null,null,null,null,null,null,null,"APURIMAC AYMARAES SORAYA",0,"APURIMAC","AYMARAES","SORAYA","C030413"]
[null,null,null,null,null,null,null,null,null,null,null,null,"APURIMAC AYMARAES TAPAIRIHUA",0,"APURIMAC","AYMARAES","TAPAIRIHUA","C030414"]
[null,null,null,null,null,null,null,null,null,null,null,null,"APURIMAC AYMARAES TINTAY",0,"APURIMAC","AYMARAES","TINTAY","C030415"]
[null,null,null,null,null,null,null,null,null,null,null,null,"APURIMAC AYMARAES TORAYA",0,"APURIMAC","AYMARAES","TORAYA","C030416"]
[null,null,null,null,null,null,null,null,null,null,null,null,"APURIMAC AYMARAES YANACA",0,"APURIMAC","AYMARAES","YANACA","C030417"]
[null,null,null,null,null,null,null,null,null,null,null,null,"APURIMAC CHINCHEROS ANCO_HUALLO",0,"APURIMAC","CHINCHEROS","ANCO_HUALLO","C030602"]
[null,null,null,null,null,null,null,null,null,null,null,null,"APURIMAC CHINCHEROS CHINCHEROS",0,"APURIMAC","CHINCHEROS","CHINCHEROS","C030601"]
[null,null,null,null,null,null,null,null,null,null,null,null,"APURIMAC CHINCHEROS COCHARCAS",0,"APURIMAC","CHINCHEROS","COCHARCAS","C030603"]
[null,null,null,null,null,null,null,null,null,null,null,null,"APURIMAC CHINCHEROS EL PORVENIR",0,"APURIMAC","CHINCHEROS","EL PORVENIR","C030610"]
[null,null,null,null,null,null,null,null,null,null,null,null,"APURIMAC CHINCHEROS HUACCANA",0,"APURIMAC","CHINCHEROS","HUACCANA","C030604"]
[null,null,null,null,null,null,null,null,null,null,null,null,"APURIMAC CHINCHEROS OCOBAMBA",0,"APURIMAC","CHINCHEROS","OCOBAMBA","C030605"]
[null,null,null,null,null,null,null,null,null,null,null,null,"APURIMAC CHINCHEROS ONGOY",0,"APURIMAC","CHINCHEROS","ONGOY","C030606"]
[null,null,null,null,null,null,null,null,null,null,null,null,"APURIMAC CHINCHEROS RANRACANCHA",0,"APURIMAC","CHINCHEROS","RANRACANCHA","C030608"]
[null,null,null,null,null,null,null,null,null,null,null,null,"APURIMAC CHINCHEROS ROCCHACC",0,"APURIMAC","CHINCHEROS","ROCCHACC","C030609"]
[null,null,null,null,null,null,null,null,null,null,null,null,"APURIMAC CHINCHEROS URANMARCA",0,"APURIMAC","CHINCHEROS","URANMARCA","C030607"]
[null,null,null,null,null,null,null,null,null,null,null,null,"APURIMAC COTABAMBAS CHALLHUAHUACHO",0,"APURIMAC","COTABAMBAS","CHALLHUAHUACHO","C030506"]
[null,null,null,null,null,null,null,null,null,null,null,null,"APURIMAC COTABAMBAS COTABAMBAS",0,"APURIMAC","COTABAMBAS","COTABAMBAS","C030502"]
[null,null,null,null,null,null,null,null,null,null,null,null,"APURIMAC COTABAMBAS COYLLURQUI",0,"APURIMAC","COTABAMBAS","COYLLURQUI","C030503"]
[null,null,null,null,null,null,null,null,null,null,null,null,"APURIMAC COTABAMBAS HAQUIRA",0,"APURIMAC","COTABAMBAS","HAQUIRA","C030504"]
[null,null,null,null,null,null,null,null,null,null,null,null,"APURIMAC COTABAMBAS MARA",0,"APURIMAC","COTABAMBAS","MARA","C030505"]
[null,null,null,null,null,null,null,null,null,null,null,null,"APURIMAC COTABAMBAS TAMBOBAMBA",0,"APURIMAC","COTABAMBAS","TAMBOBAMBA","C030501"]
[null,null,null,null,null,null,null,null,null,null,null,null,"APURIMAC GRAU CHUQUIBAMBILLA",0,"APURIMAC","GRAU","CHUQUIBAMBILLA","C030701"]
[null,null,null,null,null,null,null,null,null,null,null,null,"APURIMAC GRAU CURASCO",0,"APURIMAC","GRAU","CURASCO","C030714"]
[null,null,null,null,null,null,null,null,null,null,null,null,{"$f":"O323&\" \"&P323&\" \"&Q323","v":"APURIMAC GRAU CURPAHUASI"},{"$f":"IF(AND($D$9=O323,$D$10=P323),N322+1,0)","v":0},"APURIMAC","GRAU","CURPAHUASI","C030702"]
[null,null,null,null,null,null,null,null,null,null,null,null,"APURIMAC GRAU GAMARRA",0,"APURIMAC","GRAU","GAMARRA","C030703"]
[null,null,null,null,null,null,null,null,null,null,null,null,"APURIMAC GRAU HUAYLLATI",0,"APURIMAC","GRAU","HUAYLLATI","C030704"]
[null,null,null,null,null,null,null,null,null,null,null,null,"APURIMAC GRAU MAMARA",0,"APURIMAC","GRAU","MAMARA","C030705"]
[null,null,null,null,null,null,null,null,null,null,null,null,"APURIMAC GRAU MICAELA BASTIDAS",0,"APURIMAC","GRAU","MICAELA BASTIDAS","C030706"]
[null,null,null,null,null,null,null,null,null,null,null,null,"APURIMAC GRAU PATAYPAMPA",0,"APURIMAC","GRAU","PATAYPAMPA","C030707"]
[null,null,null,null,null,null,null,null,null,null,null,null,"APURIMAC GRAU PROGRESO",0,"APURIMAC","GRAU","PROGRESO","C030708"]
[null,null,null,null,null,null,null,null,null,null,null,null,"APURIMAC GRAU SAN ANTONIO",0,"APURIMAC","GRAU","SAN ANTONIO","C030709"]
[null,null,null,null,null,null,null,null,null,null,null,null,"APURIMAC GRAU SANTA ROSA",0,"APURIMAC","GRAU","SANTA ROSA","C030710"]
[null,null,null,null,null,null,null,null,null,null,null,null,"APURIMAC GRAU TURPAY",0,"APURIMAC","GRAU","TURPAY","C030711"]
[null,null,null,null,null,null,null,null,null,null,null,null,"APURIMAC GRAU VILCABAMBA",0,"APURIMAC","GRAU","VILCABAMBA","C030712"]
[null,null,null,null,null,null,null,null,null,null,null,null,"APURIMAC GRAU VIRUNDO",0,"APURIMAC","GRAU","VIRUNDO","C030713"]
[null,null,null,null,null,null,null,null,null,null,null,null,"AREQUIPA AREQUIPA ALTO SELVA ALEGRE",0,"AREQUIPA","AREQUIPA","ALTO SELVA ALEGRE","C040102"]
[null,null,null,null,null,null,null,null,null,null,null,null,"AREQUIPA AREQUIPA AREQUIPA",0,"AREQUIPA","AREQUIPA","AREQUIPA","C040101"]
[null,null,null,null,null,null,null,null,null,null,null,null,"AREQUIPA AREQUIPA CAYMA",0,"AREQUIPA","AREQUIPA","CAYMA","C040103"]
[null,null,null,null,null,null,null,null,null,null,null,null,"AREQUIPA AREQUIPA CERRO COLORADO",0,"AREQUIPA","AREQUIPA","CERRO COLORADO","C040104"]
[null,null,null,null,null,null,null,null,null,null,null,null,"AREQUIPA AREQUIPA CHARACATO",0,"AREQUIPA","AREQUIPA","CHARACATO","C040105"]
[null,null,null,null,null,null,null,null,null,null,null,null,"AREQUIPA AREQUIPA CHIGUATA",0,"AREQUIPA","AREQUIPA","CHIGUATA","C040106"]
[null,null,null,null,null,null,null,null,null,null,null,null,"AREQUIPA AREQUIPA JACOBO HUNTER",0,"AREQUIPA","AREQUIPA","JACOBO HUNTER","C040107"]
[null,null,null,null,null,null,null,null,null,null,null,null,"AREQUIPA AREQUIPA JOSE LUIS BUSTAMANTE Y RIVERO",0,"AREQUIPA","AREQUIPA","JOSE LUIS BUSTAMANTE Y RIVERO","C040129"]
[null,null,null,null,null,null,null,null,null,null,null,null,"AREQUIPA AREQUIPA LA JOYA",0,"AREQUIPA","AREQUIPA","LA JOYA","C040108"]
[null,null,null,null,null,null,null,null,null,null,null,null,"AREQUIPA AREQUIPA MARIANO MELGAR",0,"AREQUIPA","AREQUIPA","MARIANO MELGAR","C040109"]
[null,null,null,null,null,null,null,null,null,null,null,null,"AREQUIPA AREQUIPA MIRAFLORES",0,"AREQUIPA","AREQUIPA","MIRAFLORES","C040110"]
[null,null,null,null,null,null,null,null,null,null,null,null,"AREQUIPA AREQUIPA MOLLEBAYA",0,"AREQUIPA","AREQUIPA","MOLLEBAYA","C040111"]
[null,null,null,null,null,null,null,null,null,null,null,null,"AREQUIPA AREQUIPA PAUCARPATA",0,"AREQUIPA","AREQUIPA","PAUCARPATA","C040112"]
[null,null,null,null,null,null,null,null,null,null,null,null,"AREQUIPA AREQUIPA POCSI",0,"AREQUIPA","AREQUIPA","POCSI","C040113"]
[null,null,null,null,null,null,null,null,null,null,null,null,"AREQUIPA AREQUIPA POLOBAYA",0,"AREQUIPA","AREQUIPA","POLOBAYA","C040114"]
[null,null,null,null,null,null,null,null,null,null,null,null,"AREQUIPA AREQUIPA QUEQUEÑA",0,"AREQUIPA","AREQUIPA","QUEQUEÑA","C040115"]
[null,null,null,null,null,null,null,null,null,null,null,null,"AREQUIPA AREQUIPA SABANDIA",0,"AREQUIPA","AREQUIPA","SABANDIA","C040116"]
[null,null,null,null,null,null,null,null,null,null,null,null,"AREQUIPA AREQUIPA SACHACA",0,"AREQUIPA","AREQUIPA","SACHACA","C040117"]
[null,null,null,null,null,null,null,null,null,null,null,null,"AREQUIPA AREQUIPA SAN JUAN DE SIGUAS",0,"AREQUIPA","AREQUIPA","SAN JUAN DE SIGUAS","C040118"]
[null,null,null,null,null,null,null,null,null,null,null,null,"AREQUIPA AREQUIPA SAN JUAN DE TARUCANI",0,"AREQUIPA","AREQUIPA","SAN JUAN DE TARUCANI","C040119"]
[null,null,null,null,null,null,null,null,null,null,null,null,"AREQUIPA AREQUIPA SANTA ISABEL DE SIGUAS",0,"AREQUIPA","AREQUIPA","SANTA ISABEL DE SIGUAS","C040120"]
[null,null,null,null,null,null,null,null,null,null,null,null,"AREQUIPA AREQUIPA SANTA RITA DE SIGUAS",0,"AREQUIPA","AREQUIPA","SANTA RITA DE SIGUAS","C040121"]
[null,null,null,null,null,null,null,null,null,null,null,null,"AREQUIPA AREQUIPA SOCABAYA",0,"AREQUIPA","AREQUIPA","SOCABAYA","C040122"]
[null,null,null,null,null,null,null,null,null,null,null,null,"AREQUIPA AREQUIPA TIABAYA",0,"AREQUIPA","AREQUIPA","TIABAYA","C040123"]
[null,null,null,null,null,null,null,null,null,null,null,null,"AREQUIPA AREQUIPA UCHUMAYO",0,"AREQUIPA","AREQUIPA","UCHUMAYO","C040124"]
[null,null,null,null,null,null,null,null,null,null,null,null,"AREQUIPA AREQUIPA VITOR",0,"AREQUIPA","AREQUIPA","VITOR","C040125"]
[null,null,null,null,null,null,null,null,null,null,null,null,"AREQUIPA AREQUIPA YANAHUARA",0,"AREQUIPA","AREQUIPA","YANAHUARA","C040126"]
[null,null,null,null,null,null,null,null,null,null,null,null,"AREQUIPA AREQUIPA YARABAMBA",0,"AREQUIPA","AREQUIPA","YARABAMBA","C040127"]
[null,null,null,null,null,null,null,null,null,null,null,null,"AREQUIPA AREQUIPA YURA",0,"AREQUIPA","AREQUIPA","YURA","C040128"]
[null,null,null,null,null,null,null,null,null,null,null,null,"AREQUIPA CAMANA CAMANA",0,"AREQUIPA","CAMANA","CAMANA","C040201"]
[null,null,null,null,null,null,null,null,null,null,null,null,"AREQUIPA CAMANA JOSE MARIA QUIMPER",0,"AREQUIPA","CAMANA","JOSE MARIA QUIMPER","C040202"]
[null,null,null,null,null,null,null,null,null,null,null,null,"AREQUIPA CAMANA MARIANO NICOLAS VALCARCEL",0,"AREQUIPA","CAMANA","MARIANO NICOLAS VALCARCEL","C040203"]
[null,null,null,null,null,null,null,null,null,null,null,null,"AREQUIPA CAMANA MARISCAL CACERES",0,"AREQUIPA","CAMANA","MARISCAL CACERES","C040204"]
[null,null,null,null,null,null,null,null,null,null,null,null,"AREQUIPA CAMANA NICOLAS DE PIEROLA",0,"AREQUIPA","CAMANA","NICOLAS DE PIEROLA","C040205"]
[null,null,null,null,null,null,null,null,null,null,null,null,"AREQUIPA CAMANA OCOÑA",0,"AREQUIPA","CAMANA","OCOÑA","C040206"]
[null,null,null,null,null,null,null,null,null,null,null,null,"AREQUIPA CAMANA QUILCA",0,"AREQUIPA","CAMANA","QUILCA","C040207"]
[null,null,null,null,null,null,null,null,null,null,null,null,"AREQUIPA CAMANA SAMUEL PASTOR",0,"AREQUIPA","CAMANA","SAMUEL PASTOR","C040208"]
[null,null,null,null,null,null,null,null,null,null,null,null,"AREQUIPA CARAVELI ACARI",0,"AREQUIPA","CARAVELI","ACARI","C040302"]
[null,null,null,null,null,null,null,null,null,null,null,null,"AREQUIPA CARAVELI ATICO",0,"AREQUIPA","CARAVELI","ATICO","C040303"]
[null,null,null,null,null,null,null,null,null,null,null,null,"AREQUIPA CARAVELI ATIQUIPA",0,"AREQUIPA","CARAVELI","ATIQUIPA","C040304"]
[null,null,null,null,null,null,null,null,null,null,null,null,"AREQUIPA CARAVELI BELLA UNION",0,"AREQUIPA","CARAVELI","BELLA UNION","C040305"]
[null,null,null,null,null,null,null,null,null,null,null,null,"AREQUIPA CARAVELI CAHUACHO",0,"AREQUIPA","CARAVELI","CAHUACHO","C040306"]
[null,null,null,null,null,null,null,null,null,null,null,null,"AREQUIPA CARAVELI CARAVELI",0,"AREQUIPA","CARAVELI","CARAVELI","C040301"]
[null,null,null,null,null,null,null,null,null,null,null,null,"AREQUIPA CARAVELI CHALA",0,"AREQUIPA","CARAVELI","CHALA","C040307"]
[null,null,null,null,null,null,null,null,null,null,null,null,"AREQUIPA CARAVELI CHAPARRA",0,"AREQUIPA","CARAVELI","CHAPARRA","C040308"]
[null,null,null,null,null,null,null,null,null,null,null,null,"AREQUIPA CARAVELI HUANUHUANU",0,"AREQUIPA","CARAVELI","HUANUHUANU","C040309"]
[null,null,null,null,null,null,null,null,null,null,null,null,"AREQUIPA CARAVELI JAQUI",0,"AREQUIPA","CARAVELI","JAQUI","C040310"]
[null,null,null,null,null,null,null,null,null,null,null,null,"AREQUIPA CARAVELI LOMAS",0,"AREQUIPA","CARAVELI","LOMAS","C040311"]
[null,null,null,null,null,null,null,null,null,null,null,null,"AREQUIPA CARAVELI QUICACHA",0,"AREQUIPA","CARAVELI","QUICACHA","C040312"]
[null,null,null,null,null,null,null,null,null,null,null,null,"AREQUIPA CARAVELI YAUCA",0,"AREQUIPA","CARAVELI","YAUCA","C040313"]
[null,null,null,null,null,null,null,null,null,null,null,null,"AREQUIPA CASTILLA ANDAGUA",0,"AREQUIPA","CASTILLA","ANDAGUA","C040402"]
[null,null,null,null,null,null,null,null,null,null,null,null,"AREQUIPA CASTILLA APLAO",0,"AREQUIPA","CASTILLA","APLAO","C040401"]
[null,null,null,null,null,null,null,null,null,null,null,null,{"$f":"O387&\" \"&P387&\" \"&Q387","v":"AREQUIPA CASTILLA AYO"},{"$f":"IF(AND($D$9=O387,$D$10=P387),N386+1,0)","v":0},"AREQUIPA","CASTILLA","AYO","C040403"]
[null,null,null,null,null,null,null,null,null,null,null,null,"AREQUIPA CASTILLA CHACHAS",0,"AREQUIPA","CASTILLA","CHACHAS","C040404"]
[null,null,null,null,null,null,null,null,null,null,null,null,"AREQUIPA CASTILLA CHILCAYMARCA",0,"AREQUIPA","CASTILLA","CHILCAYMARCA","C040405"]
[null,null,null,null,null,null,null,null,null,null,null,null,"AREQUIPA CASTILLA CHOCO",0,"AREQUIPA","CASTILLA","CHOCO","C040406"]
[null,null,null,null,null,null,null,null,null,null,null,null,"AREQUIPA CASTILLA HUANCARQUI",0,"AREQUIPA","CASTILLA","HUANCARQUI","C040407"]
[null,null,null,null,null,null,null,null,null,null,null,null,"AREQUIPA CASTILLA MACHAGUAY",0,"AREQUIPA","CASTILLA","MACHAGUAY","C040408"]
[null,null,null,null,null,null,null,null,null,null,null,null,"AREQUIPA CASTILLA ORCOPAMPA",0,"AREQUIPA","CASTILLA","ORCOPAMPA","C040409"]
[null,null,null,null,null,null,null,null,null,null,null,null,"AREQUIPA CASTILLA PAMPACOLCA",0,"AREQUIPA","CASTILLA","PAMPACOLCA","C040410"]
[null,null,null,null,null,null,null,null,null,null,null,null,"AREQUIPA CASTILLA TIPAN",0,"AREQUIPA","CASTILLA","TIPAN","C040411"]
[null,null,null,null,null,null,null,null,null,null,null,null,"AREQUIPA CASTILLA UÑON",0,"AREQUIPA","CASTILLA","UÑON","C040412"]
[null,null,null,null,null,null,null,null,null,null,null,null,"AREQUIPA CASTILLA URACA",0,"AREQUIPA","CASTILLA","URACA","C040413"]
[null,null,null,null,null,null,null,null,null,null,null,null,"AREQUIPA CASTILLA VIRACO",0,"AREQUIPA","CASTILLA","VIRACO","C040414"]
[null,null,null,null,null,null,null,null,null,null,null,null,"AREQUIPA CAYLLOMA ACHOMA",0,"AREQUIPA","CAYLLOMA","ACHOMA","C040502"]
[null,null,null,null,null,null,null,null,null,null,null,null,"AREQUIPA CAYLLOMA CABANACONDE",0,"AREQUIPA","CAYLLOMA","CABANACONDE","C040503"]
[null,null,null,null,null,null,null,null,null,null,null,null,"AREQUIPA CAYLLOMA CALLALLI",0,"AREQUIPA","CAYLLOMA","CALLALLI","C040504"]
[null,null,null,null,null,null,null,null,null,null,null,null,"AREQUIPA CAYLLOMA CAYLLOMA",0,"AREQUIPA","CAYLLOMA","CAYLLOMA","C040505"]
[null,null,null,null,null,null,null,null,null,null,null,null,"AREQUIPA CAYLLOMA CHIVAY",0,"AREQUIPA","CAYLLOMA","CHIVAY","C040501"]
[null,null,null,null,null,null,null,null,null,null,null,null,"AREQUIPA CAYLLOMA COPORAQUE",0,"AREQUIPA","CAYLLOMA","COPORAQUE","C040506"]
[null,null,null,null,null,null,null,null,null,null,null,null,"AREQUIPA CAYLLOMA HUAMBO",0,"AREQUIPA","CAYLLOMA","HUAMBO","C040507"]
[null,null,null,null,null,null,null,null,null,null,null,null,"AREQUIPA CAYLLOMA HUANCA",0,"AREQUIPA","CAYLLOMA","HUANCA","C040508"]
[null,null,null,null,null,null,null,null,null,null,null,null,"AREQUIPA CAYLLOMA ICHUPAMPA",0,"AREQUIPA","CAYLLOMA","ICHUPAMPA","C040509"]
[null,null,null,null,null,null,null,null,null,null,null,null,"AREQUIPA CAYLLOMA LARI",0,"AREQUIPA","CAYLLOMA","LARI","C040510"]
[null,null,null,null,null,null,null,null,null,null,null,null,"AREQUIPA CAYLLOMA LLUTA",0,"AREQUIPA","CAYLLOMA","LLUTA","C040511"]
[null,null,null,null,null,null,null,null,null,null,null,null,"AREQUIPA CAYLLOMA MACA",0,"AREQUIPA","CAYLLOMA","MACA","C040512"]
[null,null,null,null,null,null,null,null,null,null,null,null,"AREQUIPA CAYLLOMA MADRIGAL",0,"AREQUIPA","CAYLLOMA","MADRIGAL","C040513"]
[null,null,null,null,null,null,null,null,null,null,null,null,"AREQUIPA CAYLLOMA MAJES",0,"AREQUIPA","CAYLLOMA","MAJES","C040520"]
[null,null,null,null,null,null,null,null,null,null,null,null,"AREQUIPA CAYLLOMA SAN ANTONIO DE CHUCA",0,"AREQUIPA","CAYLLOMA","SAN ANTONIO DE CHUCA","C040514"]
[null,null,null,null,null,null,null,null,null,null,null,null,"AREQUIPA CAYLLOMA SIBAYO",0,"AREQUIPA","CAYLLOMA","SIBAYO","C040515"]
[null,null,null,null,null,null,null,null,null,null,null,null,"AREQUIPA CAYLLOMA TAPAY",0,"AREQUIPA","CAYLLOMA","TAPAY","C040516"]
[null,null,null,null,null,null,null,null,null,null,null,null,"AREQUIPA CAYLLOMA TISCO",0,"AREQUIPA","CAYLLOMA","TISCO","C040517"]
[null,null,null,null,null,null,null,null,null,null,null,null,"AREQUIPA CAYLLOMA TUTI",0,"AREQUIPA","CAYLLOMA","TUTI","C040518"]
[null,null,null,null,null,null,null,null,null,null,null,null,"AREQUIPA CAYLLOMA YANQUE",0,"AREQUIPA","CAYLLOMA","YANQUE","C040519"]
[null,null,null,null,null,null,null,null,null,null,null,null,"AREQUIPA CONDESUYOS ANDARAY",0,"AREQUIPA","CONDESUYOS","ANDARAY","C040602"]
[null,null,null,null,null,null,null,null,null,null,null,null,"AREQUIPA CONDESUYOS CAYARANI",0,"AREQUIPA","CONDESUYOS","CAYARANI","C040603"]
[null,null,null,null,null,null,null,null,null,null,null,null,"AREQUIPA CONDESUYOS CHICHAS",0,"AREQUIPA","CONDESUYOS","CHICHAS","C040604"]
[null,null,null,null,null,null,null,null,null,null,null,null,"AREQUIPA CONDESUYOS CHUQUIBAMBA",0,"AREQUIPA","CONDESUYOS","CHUQUIBAMBA","C040601"]
[null,null,null,null,null,null,null,null,null,null,null,null,"AREQUIPA CONDESUYOS IRAY",0,"AREQUIPA","CONDESUYOS","IRAY","C040605"]
[null,null,null,null,null,null,null,null,null,null,null,null,"AREQUIPA CONDESUYOS RIO GRANDE",0,"AREQUIPA","CONDESUYOS","RIO GRANDE","C040606"]
[null,null,null,null,null,null,null,null,null,null,null,null,"AREQUIPA CONDESUYOS SALAMANCA",0,"AREQUIPA","CONDESUYOS","SALAMANCA","C040607"]
[null,null,null,null,null,null,null,null,null,null,null,null,"AREQUIPA CONDESUYOS YANAQUIHUA",0,"AREQUIPA","CONDESUYOS","YANAQUIHUA","C040608"]
[null,null,null,null,null,null,null,null,null,null,null,null,"AREQUIPA ISLAY COCACHACRA",0,"AREQUIPA","ISLAY","COCACHACRA","C040702"]
[null,null,null,null,null,null,null,null,null,null,null,null,"AREQUIPA ISLAY DEAN VALDIVIA",0,"AREQUIPA","ISLAY","DEAN VALDIVIA","C040703"]
[null,null,null,null,null,null,null,null,null,null,null,null,"AREQUIPA ISLAY ISLAY",0,"AREQUIPA","ISLAY","ISLAY","C040704"]
[null,null,null,null,null,null,null,null,null,null,null,null,"AREQUIPA ISLAY MEJIA",0,"AREQUIPA","ISLAY","MEJIA","C040705"]
[null,null,null,null,null,null,null,null,null,null,null,null,"AREQUIPA ISLAY MOLLENDO",0,"AREQUIPA","ISLAY","MOLLENDO","C040701"]
[null,null,null,null,null,null,null,null,null,null,null,null,"AREQUIPA ISLAY PUNTA DE BOMBON",0,"AREQUIPA","ISLAY","PUNTA DE BOMBON","C040706"]
[null,null,null,null,null,null,null,null,null,null,null,null,"AREQUIPA LA UNION ALCA",0,"AREQUIPA","LA UNION","ALCA","C040802"]
[null,null,null,null,null,null,null,null,null,null,null,null,"AREQUIPA LA UNION CHARCANA",0,"AREQUIPA","LA UNION","CHARCANA","C040803"]
[null,null,null,null,null,null,null,null,null,null,null,null,"AREQUIPA LA UNION COTAHUASI",0,"AREQUIPA","LA UNION","COTAHUASI","C040801"]
[null,null,null,null,null,null,null,null,null,null,null,null,"AREQUIPA LA UNION HUAYNACOTAS",0,"AREQUIPA","LA UNION","HUAYNACOTAS","C040804"]
[null,null,null,null,null,null,null,null,null,null,null,null,"AREQUIPA LA UNION PAMPAMARCA",0,"AREQUIPA","LA UNION","PAMPAMARCA","C040805"]
[null,null,null,null,null,null,null,null,null,null,null,null,"AREQUIPA LA UNION PUYCA",0,"AREQUIPA","LA UNION","PUYCA","C040806"]
[null,null,null,null,null,null,null,null,null,null,null,null,"AREQUIPA LA UNION QUECHUALLA",0,"AREQUIPA","LA UNION","QUECHUALLA","C040807"]
[null,null,null,null,null,null,null,null,null,null,null,null,"AREQUIPA LA UNION SAYLA",0,"AREQUIPA","LA UNION","SAYLA","C040808"]
[null,null,null,null,null,null,null,null,null,null,null,null,"AREQUIPA LA UNION TAURIA",0,"AREQUIPA","LA UNION","TAURIA","C040809"]
[null,null,null,null,null,null,null,null,null,null,null,null,"AREQUIPA LA UNION TOMEPAMPA",0,"AREQUIPA","LA UNION","TOMEPAMPA","C040810"]
[null,null,null,null,null,null,null,null,null,null,null,null,"AREQUIPA LA UNION TORO",0,"AREQUIPA","LA UNION","TORO","C040811"]
[null,null,null,null,null,null,null,null,null,null,null,null,"AYACUCHO CANGALLO CANGALLO",0,"AYACUCHO","CANGALLO","CANGALLO","C050201"]
[null,null,null,null,null,null,null,null,null,null,null,null,"AYACUCHO CANGALLO CHUSCHI",0,"AYACUCHO","CANGALLO","CHUSCHI","C050202"]
[null,null,null,null,null,null,null,null,null,null,null,null,"AYACUCHO CANGALLO LOS MOROCHUCOS",0,"AYACUCHO","CANGALLO","LOS MOROCHUCOS","C050203"]
[null,null,null,null,null,null,null,null,null,null,null,null,"AYACUCHO CANGALLO MARIA PARADO DE BELLIDO",0,"AYACUCHO","CANGALLO","MARIA PARADO DE BELLIDO","C050204"]
[null,null,null,null,null,null,null,null,null,null,null,null,"AYACUCHO CANGALLO PARAS",0,"AYACUCHO","CANGALLO","PARAS","C050205"]
[null,null,null,null,null,null,null,null,null,null,null,null,"AYACUCHO CANGALLO TOTOS",0,"AYACUCHO","CANGALLO","TOTOS","C050206"]
[null,null,null,null,null,null,null,null,null,null,null,null,"AYACUCHO HUAMANGA ACOCRO",0,"AYACUCHO","HUAMANGA","ACOCRO","C050102"]
[null,null,null,null,null,null,null,null,null,null,null,null,{"$f":"O451&\" \"&P451&\" \"&Q451","v":"AYACUCHO HUAMANGA ACOS VINCHOS"},{"$f":"IF(AND($D$9=O451,$D$10=P451),N450+1,0)","v":0},"AYACUCHO","HUAMANGA","ACOS VINCHOS","C050103"]
[null,null,null,null,null,null,null,null,null,null,null,null,"AYACUCHO HUAMANGA ANDRÉS AVELINO CÁCERES DORREGARAY",0,"AYACUCHO","HUAMANGA","ANDRÉS AVELINO CÁCERES DORREGARAY","C050116"]
[null,null,null,null,null,null,null,null,null,null,null,null,"AYACUCHO HUAMANGA AYACUCHO",0,"AYACUCHO","HUAMANGA","AYACUCHO","C050101"]
[null,null,null,null,null,null,null,null,null,null,null,null,"AYACUCHO HUAMANGA CARMEN ALTO",0,"AYACUCHO","HUAMANGA","CARMEN ALTO","C050104"]
[null,null,null,null,null,null,null,null,null,null,null,null,"AYACUCHO HUAMANGA CHIARA",0,"AYACUCHO","HUAMANGA","CHIARA","C050105"]
[null,null,null,null,null,null,null,null,null,null,null,null,"AYACUCHO HUAMANGA JESUS NAZARENO",0,"AYACUCHO","HUAMANGA","JESUS NAZARENO","C050115"]
[null,null,null,null,null,null,null,null,null,null,null,null,"AYACUCHO HUAMANGA OCROS",0,"AYACUCHO","HUAMANGA","OCROS","C050106"]
[null,null,null,null,null,null,null,null,null,null,null,null,"AYACUCHO HUAMANGA PACAYCASA",0,"AYACUCHO","HUAMANGA","PACAYCASA","C050107"]
[null,null,null,null,null,null,null,null,null,null,null,null,"AYACUCHO HUAMANGA QUINUA",0,"AYACUCHO","HUAMANGA","QUINUA","C050108"]
[null,null,null,null,null,null,null,null,null,null,null,null,"AYACUCHO HUAMANGA SAN JOSE DE TICLLAS",0,"AYACUCHO","HUAMANGA","SAN JOSE DE TICLLAS","C050109"]
[null,null,null,null,null,null,null,null,null,null,null,null,"AYACUCHO HUAMANGA SAN JUAN BAUTISTA",0,"AYACUCHO","HUAMANGA","SAN JUAN BAUTISTA","C050110"]
[null,null,null,null,null,null,null,null,null,null,null,null,"AYACUCHO HUAMANGA SANTIAGO DE PISCHA",0,"AYACUCHO","HUAMANGA","SANTIAGO DE PISCHA","C050111"]
[null,null,null,null,null,null,null,null,null,null,null,null,"AYACUCHO HUAMANGA SOCOS",0,"AYACUCHO","HUAMANGA","SOCOS","C050112"]
[null,null,null,null,null,null,null,null,null,null,null,null,"AYACUCHO HUAMANGA TAMBILLO",0,"AYACUCHO","HUAMANGA","TAMBILLO","C050113"]
[null,null,null,null,null,null,null,null,null,null,null,null,"AYACUCHO HUAMANGA VINCHOS",0,"AYACUCHO","HUAMANGA","VINCHOS","C050114"]
[null,null,null,null,null,null,null,null,null,null,null,null,"AYACUCHO HUANCA SANCOS CARAPO",0,"AYACUCHO","HUANCA SANCOS","CARAPO","C050302"]
[null,null,null,null,null,null,null,null,null,null,null,null,"AYACUCHO HUANCA SANCOS SACSAMARCA",0,"AYACUCHO","HUANCA SANCOS","SACSAMARCA","C050303"]
[null,null,null,null,null,null,null,null,null,null,null,null,"AYACUCHO HUANCA SANCOS SANCOS",0,"AYACUCHO","HUANCA SANCOS","SANCOS","C050301"]
[null,null,null,null,null,null,null,null,null,null,null,null,"AYACUCHO HUANCA SANCOS SANTIAGO DE LUCANAMARCA",0,"AYACUCHO","HUANCA SANCOS","SANTIAGO DE LUCANAMARCA","C050304"]
[null,null,null,null,null,null,null,null,null,null,null,null,"AYACUCHO HUANTA AYAHUANCO",0,"AYACUCHO","HUANTA","AYAHUANCO","C050402"]
[null,null,null,null,null,null,null,null,null,null,null,null,"AYACUCHO HUANTA CANAYRE",0,"AYACUCHO","HUANTA","CANAYRE","C050409"]
[null,null,null,null,null,null,null,null,null,null,null,null,"AYACUCHO HUANTA CHACA",0,"AYACUCHO","HUANTA","CHACA","C050412"]
[null,null,null,null,null,null,null,null,null,null,null,null,"AYACUCHO HUANTA HUAMANGUILLA",0,"AYACUCHO","HUANTA","HUAMANGUILLA","C050403"]
[null,null,null,null,null,null,null,null,null,null,null,null,"AYACUCHO HUANTA HUANTA",0,"AYACUCHO","HUANTA","HUANTA","C050401"]
[null,null,null,null,null,null,null,null,null,null,null,null,"AYACUCHO HUANTA IGUAIN",0,"AYACUCHO","HUANTA","IGUAIN","C050404"]
[null,null,null,null,null,null,null,null,null,null,null,null,"AYACUCHO HUANTA LLOCHEGUA",0,"AYACUCHO","HUANTA","LLOCHEGUA","C050408"]
[null,null,null,null,null,null,null,null,null,null,null,null,"AYACUCHO HUANTA LURICOCHA",0,"AYACUCHO","HUANTA","LURICOCHA","C050405"]
[null,null,null,null,null,null,null,null,null,null,null,null,"AYACUCHO HUANTA PUCACOLPA",0,"AYACUCHO","HUANTA","PUCACOLPA","C050411"]
[null,null,null,null,null,null,null,null,null,null,null,null,"AYACUCHO HUANTA SANTILLANA",0,"AYACUCHO","HUANTA","SANTILLANA","C050406"]
[null,null,null,null,null,null,null,null,null,null,null,null,"AYACUCHO HUANTA SIVIA",0,"AYACUCHO","HUANTA","SIVIA","C050407"]
[null,null,null,null,null,null,null,null,null,null,null,null,"AYACUCHO HUANTA UCHURACCAY",0,"AYACUCHO","HUANTA","UCHURACCAY","C050410"]
[null,null,null,null,null,null,null,null,null,null,null,null,"AYACUCHO LA MAR ANCHIHUAY",0,"AYACUCHO","LA MAR","ANCHIHUAY","C050510"]
[null,null,null,null,null,null,null,null,null,null,null,null,"AYACUCHO LA MAR ANCO",0,"AYACUCHO","LA MAR","ANCO","C050502"]
[null,null,null,null,null,null,null,null,null,null,null,null,"AYACUCHO LA MAR AYNA",0,"AYACUCHO","LA MAR","AYNA","C050503"]
[null,null,null,null,null,null,null,null,null,null,null,null,"AYACUCHO LA MAR CHILCAS",0,"AYACUCHO","LA MAR","CHILCAS","C050504"]
[null,null,null,null,null,null,null,null,null,null,null,null,"AYACUCHO LA MAR CHUNGUI",0,"AYACUCHO","LA MAR","CHUNGUI","C050505"]
[null,null,null,null,null,null,null,null,null,null,null,null,"AYACUCHO LA MAR LUIS CARRANZA",0,"AYACUCHO","LA MAR","LUIS CARRANZA","C050506"]
[null,null,null,null,null,null,null,null,null,null,null,null,"AYACUCHO LA MAR SAMUGARI",0,"AYACUCHO","LA MAR","SAMUGARI","C050509"]
[null,null,null,null,null,null,null,null,null,null,null,null,"AYACUCHO LA MAR SAN MIGUEL",0,"AYACUCHO","LA MAR","SAN MIGUEL","C050501"]
[null,null,null,null,null,null,null,null,null,null,null,null,"AYACUCHO LA MAR SANTA ROSA",0,"AYACUCHO","LA MAR","SANTA ROSA","C050507"]
[null,null,null,null,null,null,null,null,null,null,null,null,"AYACUCHO LA MAR TAMBO",0,"AYACUCHO","LA MAR","TAMBO","C050508"]
[null,null,null,null,null,null,null,null,null,null,null,null,"AYACUCHO LUCANAS AUCARA",0,"AYACUCHO","LUCANAS","AUCARA","C050602"]
[null,null,null,null,null,null,null,null,null,null,null,null,"AYACUCHO LUCANAS CABANA",0,"AYACUCHO","LUCANAS","CABANA","C050603"]
[null,null,null,null,null,null,null,null,null,null,null,null,"AYACUCHO LUCANAS CARMEN SALCEDO",0,"AYACUCHO","LUCANAS","CARMEN SALCEDO","C050604"]
[null,null,null,null,null,null,null,null,null,null,null,null,"AYACUCHO LUCANAS CHAVIÑA",0,"AYACUCHO","LUCANAS","CHAVIÑA","C050605"]
[null,null,null,null,null,null,null,null,null,null,null,null,"AYACUCHO LUCANAS CHIPAO",0,"AYACUCHO","LUCANAS","CHIPAO","C050606"]
[null,null,null,null,null,null,null,null,null,null,null,null,"AYACUCHO LUCANAS HUAC-HUAS",0,"AYACUCHO","LUCANAS","HUAC-HUAS","C050607"]
[null,null,null,null,null,null,null,null,null,null,null,null,"AYACUCHO LUCANAS LARAMATE",0,"AYACUCHO","LUCANAS","LARAMATE","C050608"]
[null,null,null,null,null,null,null,null,null,null,null,null,"AYACUCHO LUCANAS LEONCIO PRADO",0,"AYACUCHO","LUCANAS","LEONCIO PRADO","C050609"]
[null,null,null,null,null,null,null,null,null,null,null,null,"AYACUCHO LUCANAS LLAUTA",0,"AYACUCHO","LUCANAS","LLAUTA","C050610"]
[null,null,null,null,null,null,null,null,null,null,null,null,"AYACUCHO LUCANAS LUCANAS",0,"AYACUCHO","LUCANAS","LUCANAS","C050611"]
[null,null,null,null,null,null,null,null,null,null,null,null,"AYACUCHO LUCANAS OCAÑA",0,"AYACUCHO","LUCANAS","OCAÑA","C050612"]
[null,null,null,null,null,null,null,null,null,null,null,null,"AYACUCHO LUCANAS OTOCA",0,"AYACUCHO","LUCANAS","OTOCA","C050613"]
[null,null,null,null,null,null,null,null,null,null,null,null,"AYACUCHO LUCANAS PUQUIO",0,"AYACUCHO","LUCANAS","PUQUIO","C050601"]
[null,null,null,null,null,null,null,null,null,null,null,null,"AYACUCHO LUCANAS SAISA",0,"AYACUCHO","LUCANAS","SAISA","C050614"]
[null,null,null,null,null,null,null,null,null,null,null,null,"AYACUCHO LUCANAS SAN CRISTOBAL",0,"AYACUCHO","LUCANAS","SAN CRISTOBAL","C050615"]
[null,null,null,null,null,null,null,null,null,null,null,null,"AYACUCHO LUCANAS SAN JUAN",0,"AYACUCHO","LUCANAS","SAN JUAN","C050616"]
[null,null,null,null,null,null,null,null,null,null,null,null,"AYACUCHO LUCANAS SAN PEDRO",0,"AYACUCHO","LUCANAS","SAN PEDRO","C050617"]
[null,null,null,null,null,null,null,null,null,null,null,null,"AYACUCHO LUCANAS SAN PEDRO DE PALCO",0,"AYACUCHO","LUCANAS","SAN PEDRO DE PALCO","C050618"]
[null,null,null,null,null,null,null,null,null,null,null,null,"AYACUCHO LUCANAS SANCOS",0,"AYACUCHO","LUCANAS","SANCOS","C050619"]
[null,null,null,null,null,null,null,null,null,null,null,null,"AYACUCHO LUCANAS SANTA ANA DE HUAYCAHUACHO",0,"AYACUCHO","LUCANAS","SANTA ANA DE HUAYCAHUACHO","C050620"]
[null,null,null,null,null,null,null,null,null,null,null,null,"AYACUCHO LUCANAS SANTA LUCIA",0,"AYACUCHO","LUCANAS","SANTA LUCIA","C050621"]
[null,null,null,null,null,null,null,null,null,null,null,null,"AYACUCHO PARINACOCHAS CHUMPI",0,"AYACUCHO","PARINACOCHAS","CHUMPI","C050702"]
[null,null,null,null,null,null,null,null,null,null,null,null,"AYACUCHO PARINACOCHAS CORACORA",0,"AYACUCHO","PARINACOCHAS","CORACORA","C050701"]
[null,null,null,null,null,null,null,null,null,null,null,null,{"$f":"O515&\" \"&P515&\" \"&Q515","v":"AYACUCHO PARINACOCHAS CORONEL CASTAÑEDA"},{"$f":"IF(AND($D$9=O515,$D$10=P515),N514+1,0)","v":0},"AYACUCHO","PARINACOCHAS","CORONEL CASTAÑEDA","C050703"]
[null,null,null,null,null,null,null,null,null,null,null,null,"AYACUCHO PARINACOCHAS PACAPAUSA",0,"AYACUCHO","PARINACOCHAS","PACAPAUSA","C050704"]
[null,null,null,null,null,null,null,null,null,null,null,null,"AYACUCHO PARINACOCHAS PULLO",0,"AYACUCHO","PARINACOCHAS","PULLO","C050705"]
[null,null,null,null,null,null,null,null,null,null,null,null,"AYACUCHO PARINACOCHAS PUYUSCA",0,"AYACUCHO","PARINACOCHAS","PUYUSCA","C050706"]
[null,null,null,null,null,null,null,null,null,null,null,null,"AYACUCHO PARINACOCHAS SAN FRANCISCO DE RAVACAYCO",0,"AYACUCHO","PARINACOCHAS","SAN FRANCISCO DE RAVACAYCO","C050707"]
[null,null,null,null,null,null,null,null,null,null,null,null,"AYACUCHO PARINACOCHAS UPAHUACHO",0,"AYACUCHO","PARINACOCHAS","UPAHUACHO","C050708"]
[null,null,null,null,null,null,null,null,null,null,null,null,"AYACUCHO PAUCAR DEL SARA SARA COLTA",0,"AYACUCHO","PAUCAR DEL SARA SARA","COLTA","C050802"]
[null,null,null,null,null,null,null,null,null,null,null,null,"AYACUCHO PAUCAR DEL SARA SARA CORCULLA",0,"AYACUCHO","PAUCAR DEL SARA SARA","CORCULLA","C050803"]
[null,null,null,null,null,null,null,null,null,null,null,null,"AYACUCHO PAUCAR DEL SARA SARA LAMPA",0,"AYACUCHO","PAUCAR DEL SARA SARA","LAMPA","C050804"]
[null,null,null,null,null,null,null,null,null,null,null,null,"AYACUCHO PAUCAR DEL SARA SARA MARCABAMBA",0,"AYACUCHO","PAUCAR DEL SARA SARA","MARCABAMBA","C050805"]
[null,null,null,null,null,null,null,null,null,null,null,null,"AYACUCHO PAUCAR DEL SARA SARA OYOLO",0,"AYACUCHO","PAUCAR DEL SARA SARA","OYOLO","C050806"]
[null,null,null,null,null,null,null,null,null,null,null,null,"AYACUCHO PAUCAR DEL SARA SARA PARARCA",0,"AYACUCHO","PAUCAR DEL SARA SARA","PARARCA","C050807"]
[null,null,null,null,null,null,null,null,null,null,null,null,"AYACUCHO PAUCAR DEL SARA SARA PAUSA",0,"AYACUCHO","PAUCAR DEL SARA SARA","PAUSA","C050801"]
[null,null,null,null,null,null,null,null,null,null,null,null,"AYACUCHO PAUCAR DEL SARA SARA SAN JAVIER DE ALPABAMBA",0,"AYACUCHO","PAUCAR DEL SARA SARA","SAN JAVIER DE ALPABAMBA","C050808"]
[null,null,null,null,null,null,null,null,null,null,null,null,"AYACUCHO PAUCAR DEL SARA SARA SAN JOSE DE USHUA",0,"AYACUCHO","PAUCAR DEL SARA SARA","SAN JOSE DE USHUA","C050809"]
[null,null,null,null,null,null,null,null,null,null,null,null,"AYACUCHO PAUCAR DEL SARA SARA SARA SARA",0,"AYACUCHO","PAUCAR DEL SARA SARA","SARA SARA","C050810"]
[null,null,null,null,null,null,null,null,null,null,null,null,"AYACUCHO SUCRE BELEN",0,"AYACUCHO","SUCRE","BELEN","C050902"]
[null,null,null,null,null,null,null,null,null,null,null,null,"AYACUCHO SUCRE CHALCOS",0,"AYACUCHO","SUCRE","CHALCOS","C050903"]
[null,null,null,null,null,null,null,null,null,null,null,null,"AYACUCHO SUCRE CHILCAYOC",0,"AYACUCHO","SUCRE","CHILCAYOC","C050904"]
[null,null,null,null,null,null,null,null,null,null,null,null,"AYACUCHO SUCRE HUACAÑA",0,"AYACUCHO","SUCRE","HUACAÑA","C050905"]
[null,null,null,null,null,null,null,null,null,null,null,null,"AYACUCHO SUCRE MORCOLLA",0,"AYACUCHO","SUCRE","MORCOLLA","C050906"]
[null,null,null,null,null,null,null,null,null,null,null,null,"AYACUCHO SUCRE PAICO",0,"AYACUCHO","SUCRE","PAICO","C050907"]
[null,null,null,null,null,null,null,null,null,null,null,null,"AYACUCHO SUCRE QUEROBAMBA",0,"AYACUCHO","SUCRE","QUEROBAMBA","C050901"]
[null,null,null,null,null,null,null,null,null,null,null,null,"AYACUCHO SUCRE SAN PEDRO DE LARCAY",0,"AYACUCHO","SUCRE","SAN PEDRO DE LARCAY","C050908"]
[null,null,null,null,null,null,null,null,null,null,null,null,"AYACUCHO SUCRE SAN SALVADOR DE QUIJE",0,"AYACUCHO","SUCRE","SAN SALVADOR DE QUIJE","C050909"]
[null,null,null,null,null,null,null,null,null,null,null,null,"AYACUCHO SUCRE SANTIAGO DE PAUCARAY",0,"AYACUCHO","SUCRE","SANTIAGO DE PAUCARAY","C050910"]
[null,null,null,null,null,null,null,null,null,null,null,null,"AYACUCHO SUCRE SORAS",0,"AYACUCHO","SUCRE","SORAS","C050911"]
[null,null,null,null,null,null,null,null,null,null,null,null,"AYACUCHO VICTOR FAJARDO ALCAMENCA",0,"AYACUCHO","VICTOR FAJARDO","ALCAMENCA","C051002"]
[null,null,null,null,null,null,null,null,null,null,null,null,"AYACUCHO VICTOR FAJARDO APONGO",0,"AYACUCHO","VICTOR FAJARDO","APONGO","C051003"]
[null,null,null,null,null,null,null,null,null,null,null,null,"AYACUCHO VICTOR FAJARDO ASQUIPATA",0,"AYACUCHO","VICTOR FAJARDO","ASQUIPATA","C051004"]
[null,null,null,null,null,null,null,null,null,null,null,null,"AYACUCHO VICTOR FAJARDO CANARIA",0,"AYACUCHO","VICTOR FAJARDO","CANARIA","C051005"]
[null,null,null,null,null,null,null,null,null,null,null,null,"AYACUCHO VICTOR FAJARDO CAYARA",0,"AYACUCHO","VICTOR FAJARDO","CAYARA","C051006"]
[null,null,null,null,null,null,null,null,null,null,null,null,"AYACUCHO VICTOR FAJARDO COLCA",0,"AYACUCHO","VICTOR FAJARDO","COLCA","C051007"]
[null,null,null,null,null,null,null,null,null,null,null,null,"AYACUCHO VICTOR FAJARDO HUAMANQUIQUIA",0,"AYACUCHO","VICTOR FAJARDO","HUAMANQUIQUIA","C051008"]
[null,null,null,null,null,null,null,null,null,null,null,null,"AYACUCHO VICTOR FAJARDO HUANCAPI",0,"AYACUCHO","VICTOR FAJARDO","HUANCAPI","C051001"]
[null,null,null,null,null,null,null,null,null,null,null,null,"AYACUCHO VICTOR FAJARDO HUANCARAYLLA",0,"AYACUCHO","VICTOR FAJARDO","HUANCARAYLLA","C051009"]
[null,null,null,null,null,null,null,null,null,null,null,null,"AYACUCHO VICTOR FAJARDO HUAYA",0,"AYACUCHO","VICTOR FAJARDO","HUAYA","C051010"]
[null,null,null,null,null,null,null,null,null,null,null,null,"AYACUCHO VICTOR FAJARDO SARHUA",0,"AYACUCHO","VICTOR FAJARDO","SARHUA","C051011"]
[null,null,null,null,null,null,null,null,null,null,null,null,"AYACUCHO VICTOR FAJARDO VILCANCHOS",0,"AYACUCHO","VICTOR FAJARDO","VILCANCHOS","C051012"]
[null,null,null,null,null,null,null,null,null,null,null,null,"AYACUCHO VILCAS HUAMAN ACCOMARCA",0,"AYACUCHO","VILCAS HUAMAN","ACCOMARCA","C051102"]
[null,null,null,null,null,null,null,null,null,null,null,null,"AYACUCHO VILCAS HUAMAN CARHUANCA",0,"AYACUCHO","VILCAS HUAMAN","CARHUANCA","C051103"]
[null,null,null,null,null,null,null,null,null,null,null,null,"AYACUCHO VILCAS HUAMAN CONCEPCION",0,"AYACUCHO","VILCAS HUAMAN","CONCEPCION","C051104"]
[null,null,null,null,null,null,null,null,null,null,null,null,"AYACUCHO VILCAS HUAMAN HUAMBALPA",0,"AYACUCHO","VILCAS HUAMAN","HUAMBALPA","C051105"]
[null,null,null,null,null,null,null,null,null,null,null,null,"AYACUCHO VILCAS HUAMAN INDEPENDENCIA",0,"AYACUCHO","VILCAS HUAMAN","INDEPENDENCIA","C051106"]
[null,null,null,null,null,null,null,null,null,null,null,null,"AYACUCHO VILCAS HUAMAN SAURAMA",0,"AYACUCHO","VILCAS HUAMAN","SAURAMA","C051107"]
[null,null,null,null,null,null,null,null,null,null,null,null,"AYACUCHO VILCAS HUAMAN VILCAS HUAMAN",0,"AYACUCHO","VILCAS HUAMAN","VILCAS HUAMAN","C051101"]
[null,null,null,null,null,null,null,null,null,null,null,null,"AYACUCHO VILCAS HUAMAN VISCHONGO",0,"AYACUCHO","VILCAS HUAMAN","VISCHONGO","C051108"]
[null,null,null,null,null,null,null,null,null,null,null,null,"CAJAMARCA CAJABAMBA CACHACHI",0,"CAJAMARCA","CAJABAMBA","CACHACHI","C060202"]
[null,null,null,null,null,null,null,null,null,null,null,null,"CAJAMARCA CAJABAMBA CAJABAMBA",0,"CAJAMARCA","CAJABAMBA","CAJABAMBA","C060201"]
[null,null,null,null,null,null,null,null,null,null,null,null,"CAJAMARCA CAJABAMBA CONDEBAMBA",0,"CAJAMARCA","CAJABAMBA","CONDEBAMBA","C060203"]
[null,null,null,null,null,null,null,null,null,null,null,null,"CAJAMARCA CAJABAMBA SITACOCHA",0,"CAJAMARCA","CAJABAMBA","SITACOCHA","C060204"]
[null,null,null,null,null,null,null,null,null,null,null,null,"CAJAMARCA CAJAMARCA ASUNCION",0,"CAJAMARCA","CAJAMARCA","ASUNCION","C060102"]
[null,null,null,null,null,null,null,null,null,null,null,null,"CAJAMARCA CAJAMARCA CAJAMARCA",0,"CAJAMARCA","CAJAMARCA","CAJAMARCA","C060101"]
[null,null,null,null,null,null,null,null,null,null,null,null,"CAJAMARCA CAJAMARCA CHETILLA",0,"CAJAMARCA","CAJAMARCA","CHETILLA","C060103"]
[null,null,null,null,null,null,null,null,null,null,null,null,"CAJAMARCA CAJAMARCA COSPAN",0,"CAJAMARCA","CAJAMARCA","COSPAN","C060104"]
[null,null,null,null,null,null,null,null,null,null,null,null,"CAJAMARCA CAJAMARCA ENCAÑADA",0,"CAJAMARCA","CAJAMARCA","ENCAÑADA","C060105"]
[null,null,null,null,null,null,null,null,null,null,null,null,"CAJAMARCA CAJAMARCA JESUS",0,"CAJAMARCA","CAJAMARCA","JESUS","C060106"]
[null,null,null,null,null,null,null,null,null,null,null,null,"CAJAMARCA CAJAMARCA LLACANORA",0,"CAJAMARCA","CAJAMARCA","LLACANORA","C060107"]
[null,null,null,null,null,null,null,null,null,null,null,null,"CAJAMARCA CAJAMARCA LOS BAÑOS DEL INCA",0,"CAJAMARCA","CAJAMARCA","LOS BAÑOS DEL INCA","C060108"]
[null,null,null,null,null,null,null,null,null,null,null,null,"CAJAMARCA CAJAMARCA MAGDALENA",0,"CAJAMARCA","CAJAMARCA","MAGDALENA","C060109"]
[null,null,null,null,null,null,null,null,null,null,null,null,"CAJAMARCA CAJAMARCA MATARA",0,"CAJAMARCA","CAJAMARCA","MATARA","C060110"]
[null,null,null,null,null,null,null,null,null,null,null,null,"CAJAMARCA CAJAMARCA NAMORA",0,"CAJAMARCA","CAJAMARCA","NAMORA","C060111"]
[null,null,null,null,null,null,null,null,null,null,null,null,"CAJAMARCA CAJAMARCA SAN JUAN",0,"CAJAMARCA","CAJAMARCA","SAN JUAN","C060112"]
[null,null,null,null,null,null,null,null,null,null,null,null,"CAJAMARCA CELENDIN CELENDIN",0,"CAJAMARCA","CELENDIN","CELENDIN","C060301"]
[null,null,null,null,null,null,null,null,null,null,null,null,{"$f":"O579&\" \"&P579&\" \"&Q579","v":"CAJAMARCA CELENDIN CHUMUCH"},{"$f":"IF(AND($D$9=O579,$D$10=P579),N578+1,0)","v":0},"CAJAMARCA","CELENDIN","CHUMUCH","C060302"]
[null,null,null,null,null,null,null,null,null,null,null,null,"CAJAMARCA CELENDIN CORTEGANA",0,"CAJAMARCA","CELENDIN","CORTEGANA","C060303"]
[null,null,null,null,null,null,null,null,null,null,null,null,"CAJAMARCA CELENDIN HUASMIN",0,"CAJAMARCA","CELENDIN","HUASMIN","C060304"]
[null,null,null,null,null,null,null,null,null,null,null,null,"CAJAMARCA CELENDIN JORGE CHAVEZ",0,"CAJAMARCA","CELENDIN","JORGE CHAVEZ","C060305"]
[null,null,null,null,null,null,null,null,null,null,null,null,"CAJAMARCA CELENDIN JOSE GALVEZ",0,"CAJAMARCA","CELENDIN","JOSE GALVEZ","C060306"]
[null,null,null,null,null,null,null,null,null,null,null,null,"CAJAMARCA CELENDIN LA LIBERTAD DE PALLAN",0,"CAJAMARCA","CELENDIN","LA LIBERTAD DE PALLAN","C060312"]
[null,null,null,null,null,null,null,null,null,null,null,null,"CAJAMARCA CELENDIN MIGUEL IGLESIAS",0,"CAJAMARCA","CELENDIN","MIGUEL IGLESIAS","C060307"]
[null,null,null,null,null,null,null,null,null,null,null,null,"CAJAMARCA CELENDIN OXAMARCA",0,"CAJAMARCA","CELENDIN","OXAMARCA","C060308"]
[null,null,null,null,null,null,null,null,null,null,null,null,"CAJAMARCA CELENDIN SOROCHUCO",0,"CAJAMARCA","CELENDIN","SOROCHUCO","C060309"]
[null,null,null,null,null,null,null,null,null,null,null,null,"CAJAMARCA CELENDIN SUCRE",0,"CAJAMARCA","CELENDIN","SUCRE","C060310"]
[null,null,null,null,null,null,null,null,null,null,null,null,"CAJAMARCA CELENDIN UTCO",0,"CAJAMARCA","CELENDIN","UTCO","C060311"]
[null,null,null,null,null,null,null,null,null,null,null,null,"CAJAMARCA CHOTA ANGUIA",0,"CAJAMARCA","CHOTA","ANGUIA","C060402"]
[null,null,null,null,null,null,null,null,null,null,null,null,"CAJAMARCA CHOTA CHADIN",0,"CAJAMARCA","CHOTA","CHADIN","C060403"]
[null,null,null,null,null,null,null,null,null,null,null,null,"CAJAMARCA CHOTA CHALAMARCA",0,"CAJAMARCA","CHOTA","CHALAMARCA","C060419"]
[null,null,null,null,null,null,null,null,null,null,null,null,"CAJAMARCA CHOTA CHIGUIRIP",0,"CAJAMARCA","CHOTA","CHIGUIRIP","C060404"]
[null,null,null,null,null,null,null,null,null,null,null,null,"CAJAMARCA CHOTA CHIMBAN",0,"CAJAMARCA","CHOTA","CHIMBAN","C060405"]
[null,null,null,null,null,null,null,null,null,null,null,null,"CAJAMARCA CHOTA CHOROPAMPA",0,"CAJAMARCA","CHOTA","CHOROPAMPA","C060406"]
[null,null,null,null,null,null,null,null,null,null,null,null,"CAJAMARCA CHOTA CHOTA",0,"CAJAMARCA","CHOTA","CHOTA","C060401"]
[null,null,null,null,null,null,null,null,null,null,null,null,"CAJAMARCA CHOTA COCHABAMBA",0,"CAJAMARCA","CHOTA","COCHABAMBA","C060407"]
[null,null,null,null,null,null,null,null,null,null,null,null,"CAJAMARCA CHOTA CONCHAN",0,"CAJAMARCA","CHOTA","CONCHAN","C060408"]
[null,null,null,null,null,null,null,null,null,null,null,null,"CAJAMARCA CHOTA HUAMBOS",0,"CAJAMARCA","CHOTA","HUAMBOS","C060409"]
[null,null,null,null,null,null,null,null,null,null,null,null,"CAJAMARCA CHOTA LAJAS",0,"CAJAMARCA","CHOTA","LAJAS","C060410"]
[null,null,null,null,null,null,null,null,null,null,null,null,"CAJAMARCA CHOTA LLAMA",0,"CAJAMARCA","CHOTA","LLAMA","C060411"]
[null,null,null,null,null,null,null,null,null,null,null,null,"CAJAMARCA CHOTA MIRACOSTA",0,"CAJAMARCA","CHOTA","MIRACOSTA","C060412"]
[null,null,null,null,null,null,null,null,null,null,null,null,"CAJAMARCA CHOTA PACCHA",0,"CAJAMARCA","CHOTA","PACCHA","C060413"]
[null,null,null,null,null,null,null,null,null,null,null,null,"CAJAMARCA CHOTA PION",0,"CAJAMARCA","CHOTA","PION","C060414"]
[null,null,null,null,null,null,null,null,null,null,null,null,"CAJAMARCA CHOTA QUEROCOTO",0,"CAJAMARCA","CHOTA","QUEROCOTO","C060415"]
[null,null,null,null,null,null,null,null,null,null,null,null,"CAJAMARCA CHOTA SAN JUAN DE LICUPIS",0,"CAJAMARCA","CHOTA","SAN JUAN DE LICUPIS","C060416"]
[null,null,null,null,null,null,null,null,null,null,null,null,"CAJAMARCA CHOTA TACABAMBA",0,"CAJAMARCA","CHOTA","TACABAMBA","C060417"]
[null,null,null,null,null,null,null,null,null,null,null,null,"CAJAMARCA CHOTA TOCMOCHE",0,"CAJAMARCA","CHOTA","TOCMOCHE","C060418"]
[null,null,null,null,null,null,null,null,null,null,null,null,"CAJAMARCA CONTUMAZA CHILETE",0,"CAJAMARCA","CONTUMAZA","CHILETE","C060502"]
[null,null,null,null,null,null,null,null,null,null,null,null,"CAJAMARCA CONTUMAZA CONTUMAZA",0,"CAJAMARCA","CONTUMAZA","CONTUMAZA","C060501"]
[null,null,null,null,null,null,null,null,null,null,null,null,"CAJAMARCA CONTUMAZA CUPISNIQUE",0,"CAJAMARCA","CONTUMAZA","CUPISNIQUE","C060503"]
[null,null,null,null,null,null,null,null,null,null,null,null,"CAJAMARCA CONTUMAZA GUZMANGO",0,"CAJAMARCA","CONTUMAZA","GUZMANGO","C060504"]
[null,null,null,null,null,null,null,null,null,null,null,null,"CAJAMARCA CONTUMAZA SAN BENITO",0,"CAJAMARCA","CONTUMAZA","SAN BENITO","C060505"]
[null,null,null,null,null,null,null,null,null,null,null,null,"CAJAMARCA CONTUMAZA SANTA CRUZ DE TOLED",0,"CAJAMARCA","CONTUMAZA","SANTA CRUZ DE TOLED","C060506"]
[null,null,null,null,null,null,null,null,null,null,null,null,"CAJAMARCA CONTUMAZA TANTARICA",0,"CAJAMARCA","CONTUMAZA","TANTARICA","C060507"]
[null,null,null,null,null,null,null,null,null,null,null,null,"CAJAMARCA CONTUMAZA YONAN",0,"CAJAMARCA","CONTUMAZA","YONAN","C060508"]
[null,null,null,null,null,null,null,null,null,null,null,null,"CAJAMARCA CUTERVO CALLAYUC",0,"CAJAMARCA","CUTERVO","CALLAYUC","C060602"]
[null,null,null,null,null,null,null,null,null,null,null,null,"CAJAMARCA CUTERVO CHOROS",0,"CAJAMARCA","CUTERVO","CHOROS","C060603"]
[null,null,null,null,null,null,null,null,null,null,null,null,"CAJAMARCA CUTERVO CUJILLO",0,"CAJAMARCA","CUTERVO","CUJILLO","C060604"]
[null,null,null,null,null,null,null,null,null,null,null,null,"CAJAMARCA CUTERVO CUTERVO",0,"CAJAMARCA","CUTERVO","CUTERVO","C060601"]
[null,null,null,null,null,null,null,null,null,null,null,null,"CAJAMARCA CUTERVO LA RAMADA",0,"CAJAMARCA","CUTERVO","LA RAMADA","C060605"]
[null,null,null,null,null,null,null,null,null,null,null,null,"CAJAMARCA CUTERVO PIMPINGOS",0,"CAJAMARCA","CUTERVO","PIMPINGOS","C060606"]
[null,null,null,null,null,null,null,null,null,null,null,null,"CAJAMARCA CUTERVO QUEROCOTILLO",0,"CAJAMARCA","CUTERVO","QUEROCOTILLO","C060607"]
[null,null,null,null,null,null,null,null,null,null,null,null,"CAJAMARCA CUTERVO SAN ANDRES DE CUTERVO",0,"CAJAMARCA","CUTERVO","SAN ANDRES DE CUTERVO","C060608"]
[null,null,null,null,null,null,null,null,null,null,null,null,"CAJAMARCA CUTERVO SAN JUAN DE CUTERVO",0,"CAJAMARCA","CUTERVO","SAN JUAN DE CUTERVO","C060609"]
[null,null,null,null,null,null,null,null,null,null,null,null,"CAJAMARCA CUTERVO SAN LUIS DE LUCMA",0,"CAJAMARCA","CUTERVO","SAN LUIS DE LUCMA","C060610"]
[null,null,null,null,null,null,null,null,null,null,null,null,"CAJAMARCA CUTERVO SANTA CRUZ",0,"CAJAMARCA","CUTERVO","SANTA CRUZ","C060611"]
[null,null,null,null,null,null,null,null,null,null,null,null,"CAJAMARCA CUTERVO SANTO DOMINGO DE LA CAPILLA",0,"CAJAMARCA","CUTERVO","SANTO DOMINGO DE LA CAPILLA","C060612"]
[null,null,null,null,null,null,null,null,null,null,null,null,"CAJAMARCA CUTERVO SANTO TOMAS",0,"CAJAMARCA","CUTERVO","SANTO TOMAS","C060613"]
[null,null,null,null,null,null,null,null,null,null,null,null,"CAJAMARCA CUTERVO SOCOTA",0,"CAJAMARCA","CUTERVO","SOCOTA","C060614"]
[null,null,null,null,null,null,null,null,null,null,null,null,"CAJAMARCA CUTERVO TORIBIO CASANOVA",0,"CAJAMARCA","CUTERVO","TORIBIO CASANOVA","C060615"]
[null,null,null,null,null,null,null,null,null,null,null,null,"CAJAMARCA HUALGAYOC BAMBAMARCA",0,"CAJAMARCA","HUALGAYOC","BAMBAMARCA","C060701"]
[null,null,null,null,null,null,null,null,null,null,null,null,"CAJAMARCA HUALGAYOC CHUGUR",0,"CAJAMARCA","HUALGAYOC","CHUGUR","C060702"]
[null,null,null,null,null,null,null,null,null,null,null,null,"CAJAMARCA HUALGAYOC HUALGAYOC",0,"CAJAMARCA","HUALGAYOC","HUALGAYOC","C060703"]
[null,null,null,null,null,null,null,null,null,null,null,null,"CAJAMARCA JAEN BELLAVISTA",0,"CAJAMARCA","JAEN","BELLAVISTA","C060802"]
[null,null,null,null,null,null,null,null,null,null,null,null,"CAJAMARCA JAEN CHONTALI",0,"CAJAMARCA","JAEN","CHONTALI","C060803"]
[null,null,null,null,null,null,null,null,null,null,null,null,"CAJAMARCA JAEN COLASAY",0,"CAJAMARCA","JAEN","COLASAY","C060804"]
[null,null,null,null,null,null,null,null,null,null,null,null,"CAJAMARCA JAEN HUABAL",0,"CAJAMARCA","JAEN","HUABAL","C060805"]
[null,null,null,null,null,null,null,null,null,null,null,null,"CAJAMARCA JAEN JAEN",0,"CAJAMARCA","JAEN","JAEN","C060801"]
[null,null,null,null,null,null,null,null,null,null,null,null,"CAJAMARCA JAEN LAS PIRIAS",0,"CAJAMARCA","JAEN","LAS PIRIAS","C060806"]
[null,null,null,null,null,null,null,null,null,null,null,null,"CAJAMARCA JAEN POMAHUACA",0,"CAJAMARCA","JAEN","POMAHUACA","C060807"]
[null,null,null,null,null,null,null,null,null,null,null,null,"CAJAMARCA JAEN PUCARA",0,"CAJAMARCA","JAEN","PUCARA","C060808"]
[null,null,null,null,null,null,null,null,null,null,null,null,{"$f":"O643&\" \"&P643&\" \"&Q643","v":"CAJAMARCA JAEN SALLIQUE"},{"$f":"IF(AND($D$9=O643,$D$10=P643),N642+1,0)","v":0},"CAJAMARCA","JAEN","SALLIQUE","C060809"]
[null,null,null,null,null,null,null,null,null,null,null,null,"CAJAMARCA JAEN SAN FELIPE",0,"CAJAMARCA","JAEN","SAN FELIPE","C060810"]
[null,null,null,null,null,null,null,null,null,null,null,null,"CAJAMARCA JAEN SAN JOSE DEL ALTO",0,"CAJAMARCA","JAEN","SAN JOSE DEL ALTO","C060811"]
[null,null,null,null,null,null,null,null,null,null,null,null,"CAJAMARCA JAEN SANTA ROSA",0,"CAJAMARCA","JAEN","SANTA ROSA","C060812"]
[null,null,null,null,null,null,null,null,null,null,null,null,"CAJAMARCA SAN IGNACIO CHIRINOS",0,"CAJAMARCA","SAN IGNACIO","CHIRINOS","C060902"]
[null,null,null,null,null,null,null,null,null,null,null,null,"CAJAMARCA SAN IGNACIO HUARANGO",0,"CAJAMARCA","SAN IGNACIO","HUARANGO","C060903"]
[null,null,null,null,null,null,null,null,null,null,null,null,"CAJAMARCA SAN IGNACIO LA COIPA",0,"CAJAMARCA","SAN IGNACIO","LA COIPA","C060904"]
[null,null,null,null,null,null,null,null,null,null,null,null,"CAJAMARCA SAN IGNACIO NAMBALLE",0,"CAJAMARCA","SAN IGNACIO","NAMBALLE","C060905"]
[null,null,null,null,null,null,null,null,null,null,null,null,"CAJAMARCA SAN IGNACIO SAN IGNACIO",0,"CAJAMARCA","SAN IGNACIO","SAN IGNACIO","C060901"]
[null,null,null,null,null,null,null,null,null,null,null,null,"CAJAMARCA SAN IGNACIO SAN JOSE DE LOURDES",0,"CAJAMARCA","SAN IGNACIO","SAN JOSE DE LOURDES","C060906"]
[null,null,null,null,null,null,null,null,null,null,null,null,"CAJAMARCA SAN IGNACIO TABACONAS",0,"CAJAMARCA","SAN IGNACIO","TABACONAS","C060907"]
[null,null,null,null,null,null,null,null,null,null,null,null,"CAJAMARCA SAN MARCOS CHANCAY",0,"CAJAMARCA","SAN MARCOS","CHANCAY","C061002"]
[null,null,null,null,null,null,null,null,null,null,null,null,"CAJAMARCA SAN MARCOS EDUARDO VILLANUEVA",0,"CAJAMARCA","SAN MARCOS","EDUARDO VILLANUEVA","C061003"]
[null,null,null,null,null,null,null,null,null,null,null,null,"CAJAMARCA SAN MARCOS GREGORIO PITA",0,"CAJAMARCA","SAN MARCOS","GREGORIO PITA","C061004"]
[null,null,null,null,null,null,null,null,null,null,null,null,"CAJAMARCA SAN MARCOS ICHOCAN",0,"CAJAMARCA","SAN MARCOS","ICHOCAN","C061005"]
[null,null,null,null,null,null,null,null,null,null,null,null,"CAJAMARCA SAN MARCOS JOSE MANUEL QUIROZ",0,"CAJAMARCA","SAN MARCOS","JOSE MANUEL QUIROZ","C061006"]
[null,null,null,null,null,null,null,null,null,null,null,null,"CAJAMARCA SAN MARCOS JOSE SABOGAL",0,"CAJAMARCA","SAN MARCOS","JOSE SABOGAL","C061007"]
[null,null,null,null,null,null,null,null,null,null,null,null,"CAJAMARCA SAN MARCOS PEDRO GALVEZ",0,"CAJAMARCA","SAN MARCOS","PEDRO GALVEZ","C061001"]
[null,null,null,null,null,null,null,null,null,null,null,null,"CAJAMARCA SAN MIGUEL BOLIVAR",0,"CAJAMARCA","SAN MIGUEL","BOLIVAR","C061102"]
[null,null,null,null,null,null,null,null,null,null,null,null,"CAJAMARCA SAN MIGUEL CALQUIS",0,"CAJAMARCA","SAN MIGUEL","CALQUIS","C061103"]
[null,null,null,null,null,null,null,null,null,null,null,null,"CAJAMARCA SAN MIGUEL CATILLUC",0,"CAJAMARCA","SAN MIGUEL","CATILLUC","C061104"]
[null,null,null,null,null,null,null,null,null,null,null,null,"CAJAMARCA SAN MIGUEL EL PRADO",0,"CAJAMARCA","SAN MIGUEL","EL PRADO","C061105"]
[null,null,null,null,null,null,null,null,null,null,null,null,"CAJAMARCA SAN MIGUEL LA FLORIDA",0,"CAJAMARCA","SAN MIGUEL","LA FLORIDA","C061106"]
[null,null,null,null,null,null,null,null,null,null,null,null,"CAJAMARCA SAN MIGUEL LLAPA",0,"CAJAMARCA","SAN MIGUEL","LLAPA","C061107"]
[null,null,null,null,null,null,null,null,null,null,null,null,"CAJAMARCA SAN MIGUEL NANCHOC",0,"CAJAMARCA","SAN MIGUEL","NANCHOC","C061108"]
[null,null,null,null,null,null,null,null,null,null,null,null,"CAJAMARCA SAN MIGUEL NIEPOS",0,"CAJAMARCA","SAN MIGUEL","NIEPOS","C061109"]
[null,null,null,null,null,null,null,null,null,null,null,null,"CAJAMARCA SAN MIGUEL SAN GREGORIO",0,"CAJAMARCA","SAN MIGUEL","SAN GREGORIO","C061110"]
[null,null,null,null,null,null,null,null,null,null,null,null,"CAJAMARCA SAN MIGUEL SAN MIGUEL",0,"CAJAMARCA","SAN MIGUEL","SAN MIGUEL","C061101"]
[null,null,null,null,null,null,null,null,null,null,null,null,"CAJAMARCA SAN MIGUEL SAN SILVESTRE DE COCHAN",0,"CAJAMARCA","SAN MIGUEL","SAN SILVESTRE DE COCHAN","C061111"]
[null,null,null,null,null,null,null,null,null,null,null,null,"CAJAMARCA SAN MIGUEL TONGOD",0,"CAJAMARCA","SAN MIGUEL","TONGOD","C061112"]
[null,null,null,null,null,null,null,null,null,null,null,null,"CAJAMARCA SAN MIGUEL UNION AGUA BLANCA",0,"CAJAMARCA","SAN MIGUEL","UNION AGUA BLANCA","C061113"]
[null,null,null,null,null,null,null,null,null,null,null,null,"CAJAMARCA SAN PABLO SAN BERNARDINO",0,"CAJAMARCA","SAN PABLO","SAN BERNARDINO","C061202"]
[null,null,null,null,null,null,null,null,null,null,null,null,"CAJAMARCA SAN PABLO SAN LUIS",0,"CAJAMARCA","SAN PABLO","SAN LUIS","C061203"]
[null,null,null,null,null,null,null,null,null,null,null,null,"CAJAMARCA SAN PABLO SAN PABLO",0,"CAJAMARCA","SAN PABLO","SAN PABLO","C061201"]
[null,null,null,null,null,null,null,null,null,null,null,null,"CAJAMARCA SAN PABLO TUMBADEN",0,"CAJAMARCA","SAN PABLO","TUMBADEN","C061204"]
[null,null,null,null,null,null,null,null,null,null,null,null,"CAJAMARCA SANTA CRUZ ANDABAMBA",0,"CAJAMARCA","SANTA CRUZ","ANDABAMBA","C061302"]
[null,null,null,null,null,null,null,null,null,null,null,null,"CAJAMARCA SANTA CRUZ CATACHE",0,"CAJAMARCA","SANTA CRUZ","CATACHE","C061303"]
[null,null,null,null,null,null,null,null,null,null,null,null,"CAJAMARCA SANTA CRUZ CHANCAYBAÑOS",0,"CAJAMARCA","SANTA CRUZ","CHANCAYBAÑOS","C061304"]
[null,null,null,null,null,null,null,null,null,null,null,null,"CAJAMARCA SANTA CRUZ LA ESPERANZA",0,"CAJAMARCA","SANTA CRUZ","LA ESPERANZA","C061305"]
[null,null,null,null,null,null,null,null,null,null,null,null,"CAJAMARCA SANTA CRUZ NINABAMBA",0,"CAJAMARCA","SANTA CRUZ","NINABAMBA","C061306"]
[null,null,null,null,null,null,null,null,null,null,null,null,"CAJAMARCA SANTA CRUZ PULAN",0,"CAJAMARCA","SANTA CRUZ","PULAN","C061307"]
[null,null,null,null,null,null,null,null,null,null,null,null,"CAJAMARCA SANTA CRUZ SANTA CRUZ",0,"CAJAMARCA","SANTA CRUZ","SANTA CRUZ","C061301"]
[null,null,null,null,null,null,null,null,null,null,null,null,"CAJAMARCA SANTA CRUZ SAUCEPAMPA",0,"CAJAMARCA","SANTA CRUZ","SAUCEPAMPA","C061308"]
[null,null,null,null,null,null,null,null,null,null,null,null,"CAJAMARCA SANTA CRUZ SEXI",0,"CAJAMARCA","SANTA CRUZ","SEXI","C061309"]
[null,null,null,null,null,null,null,null,null,null,null,null,"CAJAMARCA SANTA CRUZ UTICYACU",0,"CAJAMARCA","SANTA CRUZ","UTICYACU","C061310"]
[null,null,null,null,null,null,null,null,null,null,null,null,"CAJAMARCA SANTA CRUZ YAUYUCAN",0,"CAJAMARCA","SANTA CRUZ","YAUYUCAN","C061311"]
[null,null,null,null,null,null,null,null,null,null,null,null,"CALLAO CALLAO BELLAVISTA",0,"CALLAO","CALLAO","BELLAVISTA","C070102"]
[null,null,null,null,null,null,null,null,null,null,null,null,"CALLAO CALLAO CALLAO",0,"CALLAO","CALLAO","CALLAO","C070101"]
[null,null,null,null,null,null,null,null,null,null,null,null,"CALLAO CALLAO CARMEN DE LA LEGUA REYNOSO",0,"CALLAO","CALLAO","CARMEN DE LA LEGUA REYNOSO","C070103"]
[null,null,null,null,null,null,null,null,null,null,null,null,"CALLAO CALLAO LA PERLA",0,"CALLAO","CALLAO","LA PERLA","C070104"]
[null,null,null,null,null,null,null,null,null,null,null,null,"CALLAO CALLAO LA PUNTA",0,"CALLAO","CALLAO","LA PUNTA","C070105"]
[null,null,null,null,null,null,null,null,null,null,null,null,"CALLAO CALLAO MI PERÚ",0,"CALLAO","CALLAO","MI PERÚ","C070107"]
[null,null,null,null,null,null,null,null,null,null,null,null,"CALLAO CALLAO VENTANILLA",0,"CALLAO","CALLAO","VENTANILLA","C070106"]
[null,null,null,null,null,null,null,null,null,null,null,null,"CUSCO ACOMAYO ACOMAYO",0,"CUSCO","ACOMAYO","ACOMAYO","C080201"]
[null,null,null,null,null,null,null,null,null,null,null,null,"CUSCO ACOMAYO ACOPIA",0,"CUSCO","ACOMAYO","ACOPIA","C080202"]
[null,null,null,null,null,null,null,null,null,null,null,null,"CUSCO ACOMAYO ACOS",0,"CUSCO","ACOMAYO","ACOS","C080203"]
[null,null,null,null,null,null,null,null,null,null,null,null,"CUSCO ACOMAYO MOSOC LLACTA",0,"CUSCO","ACOMAYO","MOSOC LLACTA","C080204"]
[null,null,null,null,null,null,null,null,null,null,null,null,"CUSCO ACOMAYO POMACANCHI",0,"CUSCO","ACOMAYO","POMACANCHI","C080205"]
[null,null,null,null,null,null,null,null,null,null,null,null,"CUSCO ACOMAYO RONDOCAN",0,"CUSCO","ACOMAYO","RONDOCAN","C080206"]
[null,null,null,null,null,null,null,null,null,null,null,null,"CUSCO ACOMAYO SANGARARA",0,"CUSCO","ACOMAYO","SANGARARA","C080207"]
[null,null,null,null,null,null,null,null,null,null,null,null,"CUSCO ANTA ANCAHUASI",0,"CUSCO","ANTA","ANCAHUASI","C080302"]
[null,null,null,null,null,null,null,null,null,null,null,null,"CUSCO ANTA ANTA",0,"CUSCO","ANTA","ANTA","C080301"]
[null,null,null,null,null,null,null,null,null,null,null,null,"CUSCO ANTA CACHIMAYO",0,"CUSCO","ANTA","CACHIMAYO","C080303"]
[null,null,null,null,null,null,null,null,null,null,null,null,"CUSCO ANTA CHINCHAYPUJIO",0,"CUSCO","ANTA","CHINCHAYPUJIO","C080304"]
[null,null,null,null,null,null,null,null,null,null,null,null,{"$f":"O707&\" \"&P707&\" \"&Q707","v":"CUSCO ANTA HUAROCONDO"},{"$f":"IF(AND($D$9=O707,$D$10=P707),N706+1,0)","v":0},"CUSCO","ANTA","HUAROCONDO","C080305"]
[null,null,null,null,null,null,null,null,null,null,null,null,"CUSCO ANTA LIMATAMBO",0,"CUSCO","ANTA","LIMATAMBO","C080306"]
[null,null,null,null,null,null,null,null,null,null,null,null,"CUSCO ANTA MOLLEPATA",0,"CUSCO","ANTA","MOLLEPATA","C080307"]
[null,null,null,null,null,null,null,null,null,null,null,null,"CUSCO ANTA PUCYURA",0,"CUSCO","ANTA","PUCYURA","C080308"]
[null,null,null,null,null,null,null,null,null,null,null,null,"CUSCO ANTA ZURITE",0,"CUSCO","ANTA","ZURITE","C080309"]
[null,null,null,null,null,null,null,null,null,null,null,null,"CUSCO CALCA CALCA",0,"CUSCO","CALCA","CALCA","C080401"]
[null,null,null,null,null,null,null,null,null,null,null,null,"CUSCO CALCA COYA",0,"CUSCO","CALCA","COYA","C080402"]
[null,null,null,null,null,null,null,null,null,null,null,null,"CUSCO CALCA LAMAY",0,"CUSCO","CALCA","LAMAY","C080403"]
[null,null,null,null,null,null,null,null,null,null,null,null,"CUSCO CALCA LARES",0,"CUSCO","CALCA","LARES","C080404"]
[null,null,null,null,null,null,null,null,null,null,null,null,"CUSCO CALCA PISAC",0,"CUSCO","CALCA","PISAC","C080405"]
[null,null,null,null,null,null,null,null,null,null,null,null,"CUSCO CALCA SAN SALVADOR",0,"CUSCO","CALCA","SAN SALVADOR","C080406"]
[null,null,null,null,null,null,null,null,null,null,null,null,"CUSCO CALCA TARAY",0,"CUSCO","CALCA","TARAY","C080407"]
[null,null,null,null,null,null,null,null,null,null,null,null,"CUSCO CALCA YANATILE",0,"CUSCO","CALCA","YANATILE","C080408"]
[null,null,null,null,null,null,null,null,null,null,null,null,"CUSCO CANAS CHECCA",0,"CUSCO","CANAS","CHECCA","C080502"]
[null,null,null,null,null,null,null,null,null,null,null,null,"CUSCO CANAS KUNTURKANKI",0,"CUSCO","CANAS","KUNTURKANKI","C080503"]
[null,null,null,null,null,null,null,null,null,null,null,null,"CUSCO CANAS LANGUI",0,"CUSCO","CANAS","LANGUI","C080504"]
[null,null,null,null,null,null,null,null,null,null,null,null,"CUSCO CANAS LAYO",0,"CUSCO","CANAS","LAYO","C080505"]
[null,null,null,null,null,null,null,null,null,null,null,null,"CUSCO CANAS PAMPAMARCA",0,"CUSCO","CANAS","PAMPAMARCA","C080506"]
[null,null,null,null,null,null,null,null,null,null,null,null,"CUSCO CANAS QUEHUE",0,"CUSCO","CANAS","QUEHUE","C080507"]
[null,null,null,null,null,null,null,null,null,null,null,null,"CUSCO CANAS TUPAC AMARU",0,"CUSCO","CANAS","TUPAC AMARU","C080508"]
[null,null,null,null,null,null,null,null,null,null,null,null,"CUSCO CANAS YANAOCA",0,"CUSCO","CANAS","YANAOCA","C080501"]
[null,null,null,null,null,null,null,null,null,null,null,null,"CUSCO CANCHIS CHECACUPE",0,"CUSCO","CANCHIS","CHECACUPE","C080602"]
[null,null,null,null,null,null,null,null,null,null,null,null,"CUSCO CANCHIS COMBAPATA",0,"CUSCO","CANCHIS","COMBAPATA","C080603"]
[null,null,null,null,null,null,null,null,null,null,null,null,"CUSCO CANCHIS MARANGANI",0,"CUSCO","CANCHIS","MARANGANI","C080604"]
[null,null,null,null,null,null,null,null,null,null,null,null,"CUSCO CANCHIS PITUMARCA",0,"CUSCO","CANCHIS","PITUMARCA","C080605"]
[null,null,null,null,null,null,null,null,null,null,null,null,"CUSCO CANCHIS SAN PABLO",0,"CUSCO","CANCHIS","SAN PABLO","C080606"]
[null,null,null,null,null,null,null,null,null,null,null,null,"CUSCO CANCHIS SAN PEDRO",0,"CUSCO","CANCHIS","SAN PEDRO","C080607"]
[null,null,null,null,null,null,null,null,null,null,null,null,"CUSCO CANCHIS SICUANI",0,"CUSCO","CANCHIS","SICUANI","C080601"]
[null,null,null,null,null,null,null,null,null,null,null,null,"CUSCO CANCHIS TINTA",0,"CUSCO","CANCHIS","TINTA","C080608"]
[null,null,null,null,null,null,null,null,null,null,null,null,"CUSCO CHUMBIVILCAS CAPACMARCA",0,"CUSCO","CHUMBIVILCAS","CAPACMARCA","C080702"]
[null,null,null,null,null,null,null,null,null,null,null,null,"CUSCO CHUMBIVILCAS CHAMACA",0,"CUSCO","CHUMBIVILCAS","CHAMACA","C080703"]
[null,null,null,null,null,null,null,null,null,null,null,null,"CUSCO CHUMBIVILCAS COLQUEMARCA",0,"CUSCO","CHUMBIVILCAS","COLQUEMARCA","C080704"]
[null,null,null,null,null,null,null,null,null,null,null,null,"CUSCO CHUMBIVILCAS LIVITACA",0,"CUSCO","CHUMBIVILCAS","LIVITACA","C080705"]
[null,null,null,null,null,null,null,null,null,null,null,null,"CUSCO CHUMBIVILCAS LLUSCO",0,"CUSCO","CHUMBIVILCAS","LLUSCO","C080706"]
[null,null,null,null,null,null,null,null,null,null,null,null,"CUSCO CHUMBIVILCAS QUIÑOTA",0,"CUSCO","CHUMBIVILCAS","QUIÑOTA","C080707"]
[null,null,null,null,null,null,null,null,null,null,null,null,"CUSCO CHUMBIVILCAS SANTO TOMAS",0,"CUSCO","CHUMBIVILCAS","SANTO TOMAS","C080701"]
[null,null,null,null,null,null,null,null,null,null,null,null,"CUSCO CHUMBIVILCAS VELILLE",0,"CUSCO","CHUMBIVILCAS","VELILLE","C080708"]
[null,null,null,null,null,null,null,null,null,null,null,null,"CUSCO CUSCO CCORCA",0,"CUSCO","CUSCO","CCORCA","C080102"]
[null,null,null,null,null,null,null,null,null,null,null,null,"CUSCO CUSCO CUSCO",0,"CUSCO","CUSCO","CUSCO","C080101"]
[null,null,null,null,null,null,null,null,null,null,null,null,"CUSCO CUSCO POROY",0,"CUSCO","CUSCO","POROY","C080103"]
[null,null,null,null,null,null,null,null,null,null,null,null,"CUSCO CUSCO SAN JERONIMO",0,"CUSCO","CUSCO","SAN JERONIMO","C080104"]
[null,null,null,null,null,null,null,null,null,null,null,null,"CUSCO CUSCO SAN SEBASTIAN",0,"CUSCO","CUSCO","SAN SEBASTIAN","C080105"]
[null,null,null,null,null,null,null,null,null,null,null,null,"CUSCO CUSCO SANTIAGO",0,"CUSCO","CUSCO","SANTIAGO","C080106"]
[null,null,null,null,null,null,null,null,null,null,null,null,"CUSCO CUSCO SAYLLA",0,"CUSCO","CUSCO","SAYLLA","C080107"]
[null,null,null,null,null,null,null,null,null,null,null,null,"CUSCO CUSCO WANCHAQ",0,"CUSCO","CUSCO","WANCHAQ","C080108"]
[null,null,null,null,null,null,null,null,null,null,null,null,"CUSCO ESPINAR ALTO PICHIGUA",0,"CUSCO","ESPINAR","ALTO PICHIGUA","C080808"]
[null,null,null,null,null,null,null,null,null,null,null,null,"CUSCO ESPINAR CONDOROMA",0,"CUSCO","ESPINAR","CONDOROMA","C080802"]
[null,null,null,null,null,null,null,null,null,null,null,null,"CUSCO ESPINAR COPORAQUE",0,"CUSCO","ESPINAR","COPORAQUE","C080803"]
[null,null,null,null,null,null,null,null,null,null,null,null,"CUSCO ESPINAR ESPINAR",0,"CUSCO","ESPINAR","ESPINAR","C080801"]
[null,null,null,null,null,null,null,null,null,null,null,null,"CUSCO ESPINAR OCORURO",0,"CUSCO","ESPINAR","OCORURO","C080804"]
[null,null,null,null,null,null,null,null,null,null,null,null,"CUSCO ESPINAR PALLPATA",0,"CUSCO","ESPINAR","PALLPATA","C080805"]
[null,null,null,null,null,null,null,null,null,null,null,null,"CUSCO ESPINAR PICHIGUA",0,"CUSCO","ESPINAR","PICHIGUA","C080806"]
[null,null,null,null,null,null,null,null,null,null,null,null,"CUSCO ESPINAR SUYCKUTAMBO",0,"CUSCO","ESPINAR","SUYCKUTAMBO","C080807"]
[null,null,null,null,null,null,null,null,null,null,null,null,"CUSCO LA CONVENCION ECHARATE",0,"CUSCO","LA CONVENCION","ECHARATE","C080902"]
[null,null,null,null,null,null,null,null,null,null,null,null,"CUSCO LA CONVENCION HUAYOPATA",0,"CUSCO","LA CONVENCION","HUAYOPATA","C080903"]
[null,null,null,null,null,null,null,null,null,null,null,null,"CUSCO LA CONVENCION INKAWASI",0,"CUSCO","LA CONVENCION","INKAWASI","C080911"]
[null,null,null,null,null,null,null,null,null,null,null,null,"CUSCO LA CONVENCION KIMBIRI",0,"CUSCO","LA CONVENCION","KIMBIRI","C080907"]
[null,null,null,null,null,null,null,null,null,null,null,null,"CUSCO LA CONVENCION MARANURA",0,"CUSCO","LA CONVENCION","MARANURA","C080904"]
[null,null,null,null,null,null,null,null,null,null,null,null,"CUSCO LA CONVENCION OCOBAMBA",0,"CUSCO","LA CONVENCION","OCOBAMBA","C080905"]
[null,null,null,null,null,null,null,null,null,null,null,null,"CUSCO LA CONVENCION PICHARI",0,"CUSCO","LA CONVENCION","PICHARI","C080910"]
[null,null,null,null,null,null,null,null,null,null,null,null,"CUSCO LA CONVENCION QUELLOUNO",0,"CUSCO","LA CONVENCION","QUELLOUNO","C080906"]
[null,null,null,null,null,null,null,null,null,null,null,null,"CUSCO LA CONVENCION SANTA ANA",0,"CUSCO","LA CONVENCION","SANTA ANA","C080901"]
[null,null,null,null,null,null,null,null,null,null,null,null,"CUSCO LA CONVENCION SANTA TERESA",0,"CUSCO","LA CONVENCION","SANTA TERESA","C080908"]
[null,null,null,null,null,null,null,null,null,null,null,null,"CUSCO LA CONVENCION VILCABAMBA",0,"CUSCO","LA CONVENCION","VILCABAMBA","C080909"]
[null,null,null,null,null,null,null,null,null,null,null,null,{"$f":"O771&\" \"&P771&\" \"&Q771","v":"CUSCO LA CONVENCION VILLA VIRGEN"},{"$f":"IF(AND($D$9=O771,$D$10=P771),N770+1,0)","v":0},"CUSCO","LA CONVENCION","VILLA VIRGEN","C080912"]
[null,null,null,null,null,null,null,null,null,null,null,null,"CUSCO PARURO ACCHA",0,"CUSCO","PARURO","ACCHA","C081002"]
[null,null,null,null,null,null,null,null,null,null,null,null,"CUSCO PARURO CCAPI",0,"CUSCO","PARURO","CCAPI","C081003"]
[null,null,null,null,null,null,null,null,null,null,null,null,"CUSCO PARURO COLCHA",0,"CUSCO","PARURO","COLCHA","C081004"]
[null,null,null,null,null,null,null,null,null,null,null,null,"CUSCO PARURO HUANOQUITE",0,"CUSCO","PARURO","HUANOQUITE","C081005"]
[null,null,null,null,null,null,null,null,null,null,null,null,"CUSCO PARURO OMACHA",0,"CUSCO","PARURO","OMACHA","C081006"]
[null,null,null,null,null,null,null,null,null,null,null,null,"CUSCO PARURO PACCARITAMBO",0,"CUSCO","PARURO","PACCARITAMBO","C081007"]
[null,null,null,null,null,null,null,null,null,null,null,null,"CUSCO PARURO PARURO",0,"CUSCO","PARURO","PARURO","C081001"]
[null,null,null,null,null,null,null,null,null,null,null,null,"CUSCO PARURO PILLPINTO",0,"CUSCO","PARURO","PILLPINTO","C081008"]
[null,null,null,null,null,null,null,null,null,null,null,null,"CUSCO PARURO YAURISQUE",0,"CUSCO","PARURO","YAURISQUE","C081009"]
[null,null,null,null,null,null,null,null,null,null,null,null,"CUSCO PAUCARTAMBO CAICAY",0,"CUSCO","PAUCARTAMBO","CAICAY","C081102"]
[null,null,null,null,null,null,null,null,null,null,null,null,"CUSCO PAUCARTAMBO CHALLABAMBA",0,"CUSCO","PAUCARTAMBO","CHALLABAMBA","C081103"]
[null,null,null,null,null,null,null,null,null,null,null,null,"CUSCO PAUCARTAMBO COLQUEPATA",0,"CUSCO","PAUCARTAMBO","COLQUEPATA","C081104"]
[null,null,null,null,null,null,null,null,null,null,null,null,"CUSCO PAUCARTAMBO HUANCARANI",0,"CUSCO","PAUCARTAMBO","HUANCARANI","C081105"]
[null,null,null,null,null,null,null,null,null,null,null,null,"CUSCO PAUCARTAMBO KOSÑIPATA",0,"CUSCO","PAUCARTAMBO","KOSÑIPATA","C081106"]
[null,null,null,null,null,null,null,null,null,null,null,null,"CUSCO PAUCARTAMBO PAUCARTAMBO",0,"CUSCO","PAUCARTAMBO","PAUCARTAMBO","C081101"]
[null,null,null,null,null,null,null,null,null,null,null,null,"CUSCO QUISPICANCHI ANDAHUAYLILLAS",0,"CUSCO","QUISPICANCHI","ANDAHUAYLILLAS","C081202"]
[null,null,null,null,null,null,null,null,null,null,null,null,"CUSCO QUISPICANCHI CAMANTI",0,"CUSCO","QUISPICANCHI","CAMANTI","C081203"]
[null,null,null,null,null,null,null,null,null,null,null,null,"CUSCO QUISPICANCHI CCARHUAYO",0,"CUSCO","QUISPICANCHI","CCARHUAYO","C081204"]
[null,null,null,null,null,null,null,null,null,null,null,null,"CUSCO QUISPICANCHI CCATCA",0,"CUSCO","QUISPICANCHI","CCATCA","C081205"]
[null,null,null,null,null,null,null,null,null,null,null,null,"CUSCO QUISPICANCHI CUSIPATA",0,"CUSCO","QUISPICANCHI","CUSIPATA","C081206"]
[null,null,null,null,null,null,null,null,null,null,null,null,"CUSCO QUISPICANCHI HUARO",0,"CUSCO","QUISPICANCHI","HUARO","C081207"]
[null,null,null,null,null,null,null,null,null,null,null,null,"CUSCO QUISPICANCHI LUCRE",0,"CUSCO","QUISPICANCHI","LUCRE","C081208"]
[null,null,null,null,null,null,null,null,null,null,null,null,"CUSCO QUISPICANCHI MARCAPATA",0,"CUSCO","QUISPICANCHI","MARCAPATA","C081209"]
[null,null,null,null,null,null,null,null,null,null,null,null,"CUSCO QUISPICANCHI OCONGATE",0,"CUSCO","QUISPICANCHI","OCONGATE","C081210"]
[null,null,null,null,null,null,null,null,null,null,null,null,"CUSCO QUISPICANCHI OROPESA",0,"CUSCO","QUISPICANCHI","OROPESA","C081211"]
[null,null,null,null,null,null,null,null,null,null,null,null,"CUSCO QUISPICANCHI QUIQUIJANA",0,"CUSCO","QUISPICANCHI","QUIQUIJANA","C081212"]
[null,null,null,null,null,null,null,null,null,null,null,null,"CUSCO QUISPICANCHI URCOS",0,"CUSCO","QUISPICANCHI","URCOS","C081201"]
[null,null,null,null,null,null,null,null,null,null,null,null,"CUSCO URUBAMBA CHINCHERO",0,"CUSCO","URUBAMBA","CHINCHERO","C081302"]
[null,null,null,null,null,null,null,null,null,null,null,null,"CUSCO URUBAMBA HUAYLLABAMBA",0,"CUSCO","URUBAMBA","HUAYLLABAMBA","C081303"]
[null,null,null,null,null,null,null,null,null,null,null,null,"CUSCO URUBAMBA MACHUPICCHU",0,"CUSCO","URUBAMBA","MACHUPICCHU","C081304"]
[null,null,null,null,null,null,null,null,null,null,null,null,"CUSCO URUBAMBA MARAS",0,"CUSCO","URUBAMBA","MARAS","C081305"]
[null,null,null,null,null,null,null,null,null,null,null,null,"CUSCO URUBAMBA OLLANTAYTAMBO",0,"CUSCO","URUBAMBA","OLLANTAYTAMBO","C081306"]
[null,null,null,null,null,null,null,null,null,null,null,null,"CUSCO URUBAMBA URUBAMBA",0,"CUSCO","URUBAMBA","URUBAMBA","C081301"]
[null,null,null,null,null,null,null,null,null,null,null,null,"CUSCO URUBAMBA YUCAY",0,"CUSCO","URUBAMBA","YUCAY","C081307"]
[null,null,null,null,null,null,null,null,null,null,null,null,"HUANCAVELICA ACOBAMBA ACOBAMBA",0,"HUANCAVELICA","ACOBAMBA","ACOBAMBA","C090201"]
[null,null,null,null,null,null,null,null,null,null,null,null,"HUANCAVELICA ACOBAMBA ANDABAMBA",0,"HUANCAVELICA","ACOBAMBA","ANDABAMBA","C090202"]
[null,null,null,null,null,null,null,null,null,null,null,null,"HUANCAVELICA ACOBAMBA ANTA",0,"HUANCAVELICA","ACOBAMBA","ANTA","C090203"]
[null,null,null,null,null,null,null,null,null,null,null,null,"HUANCAVELICA ACOBAMBA CAJA",0,"HUANCAVELICA","ACOBAMBA","CAJA","C090204"]
[null,null,null,null,null,null,null,null,null,null,null,null,"HUANCAVELICA ACOBAMBA MARCAS",0,"HUANCAVELICA","ACOBAMBA","MARCAS","C090205"]
[null,null,null,null,null,null,null,null,null,null,null,null,"HUANCAVELICA ACOBAMBA PAUCARA",0,"HUANCAVELICA","ACOBAMBA","PAUCARA","C090206"]
[null,null,null,null,null,null,null,null,null,null,null,null,"HUANCAVELICA ACOBAMBA POMACOCHA",0,"HUANCAVELICA","ACOBAMBA","POMACOCHA","C090207"]
[null,null,null,null,null,null,null,null,null,null,null,null,"HUANCAVELICA ACOBAMBA ROSARIO",0,"HUANCAVELICA","ACOBAMBA","ROSARIO","C090208"]
[null,null,null,null,null,null,null,null,null,null,null,null,"HUANCAVELICA ANGARAES ANCHONGA",0,"HUANCAVELICA","ANGARAES","ANCHONGA","C090302"]
[null,null,null,null,null,null,null,null,null,null,null,null,"HUANCAVELICA ANGARAES CALLANMARCA",0,"HUANCAVELICA","ANGARAES","CALLANMARCA","C090303"]
[null,null,null,null,null,null,null,null,null,null,null,null,"HUANCAVELICA ANGARAES CCOCHACCASA",0,"HUANCAVELICA","ANGARAES","CCOCHACCASA","C090304"]
[null,null,null,null,null,null,null,null,null,null,null,null,"HUANCAVELICA ANGARAES CHINCHO",0,"HUANCAVELICA","ANGARAES","CHINCHO","C090305"]
[null,null,null,null,null,null,null,null,null,null,null,null,"HUANCAVELICA ANGARAES CONGALLA",0,"HUANCAVELICA","ANGARAES","CONGALLA","C090306"]
[null,null,null,null,null,null,null,null,null,null,null,null,"HUANCAVELICA ANGARAES HUANCA-HUANCA",0,"HUANCAVELICA","ANGARAES","HUANCA-HUANCA","C090307"]
[null,null,null,null,null,null,null,null,null,null,null,null,"HUANCAVELICA ANGARAES HUAYLLAY GRANDE",0,"HUANCAVELICA","ANGARAES","HUAYLLAY GRANDE","C090308"]
[null,null,null,null,null,null,null,null,null,null,null,null,"HUANCAVELICA ANGARAES JULCAMARCA",0,"HUANCAVELICA","ANGARAES","JULCAMARCA","C090309"]
[null,null,null,null,null,null,null,null,null,null,null,null,"HUANCAVELICA ANGARAES LIRCAY",0,"HUANCAVELICA","ANGARAES","LIRCAY","C090301"]
[null,null,null,null,null,null,null,null,null,null,null,null,"HUANCAVELICA ANGARAES SAN ANTONIO DE ANTAPARCO",0,"HUANCAVELICA","ANGARAES","SAN ANTONIO DE ANTAPARCO","C090310"]
[null,null,null,null,null,null,null,null,null,null,null,null,"HUANCAVELICA ANGARAES SANTO TOMAS DE PATA",0,"HUANCAVELICA","ANGARAES","SANTO TOMAS DE PATA","C090311"]
[null,null,null,null,null,null,null,null,null,null,null,null,"HUANCAVELICA ANGARAES SECCLLA",0,"HUANCAVELICA","ANGARAES","SECCLLA","C090312"]
[null,null,null,null,null,null,null,null,null,null,null,null,"HUANCAVELICA CASTROVIRREYNA ARMA",0,"HUANCAVELICA","CASTROVIRREYNA","ARMA","C090402"]
[null,null,null,null,null,null,null,null,null,null,null,null,"HUANCAVELICA CASTROVIRREYNA AURAHUA",0,"HUANCAVELICA","CASTROVIRREYNA","AURAHUA","C090403"]
[null,null,null,null,null,null,null,null,null,null,null,null,"HUANCAVELICA CASTROVIRREYNA CAPILLAS",0,"HUANCAVELICA","CASTROVIRREYNA","CAPILLAS","C090404"]
[null,null,null,null,null,null,null,null,null,null,null,null,"HUANCAVELICA CASTROVIRREYNA CASTROVIRREYNA",0,"HUANCAVELICA","CASTROVIRREYNA","CASTROVIRREYNA","C090401"]
[null,null,null,null,null,null,null,null,null,null,null,null,"HUANCAVELICA CASTROVIRREYNA CHUPAMARCA",0,"HUANCAVELICA","CASTROVIRREYNA","CHUPAMARCA","C090405"]
[null,null,null,null,null,null,null,null,null,null,null,null,"HUANCAVELICA CASTROVIRREYNA COCAS",0,"HUANCAVELICA","CASTROVIRREYNA","COCAS","C090406"]
[null,null,null,null,null,null,null,null,null,null,null,null,"HUANCAVELICA CASTROVIRREYNA HUACHOS",0,"HUANCAVELICA","CASTROVIRREYNA","HUACHOS","C090407"]
[null,null,null,null,null,null,null,null,null,null,null,null,"HUANCAVELICA CASTROVIRREYNA HUAMATAMBO",0,"HUANCAVELICA","CASTROVIRREYNA","HUAMATAMBO","C090408"]
[null,null,null,null,null,null,null,null,null,null,null,null,"HUANCAVELICA CASTROVIRREYNA MOLLEPAMPA",0,"HUANCAVELICA","CASTROVIRREYNA","MOLLEPAMPA","C090409"]
[null,null,null,null,null,null,null,null,null,null,null,null,{"$f":"O835&\" \"&P835&\" \"&Q835","v":"HUANCAVELICA CASTROVIRREYNA SAN JUAN"},{"$f":"IF(AND($D$9=O835,$D$10=P835),N834+1,0)","v":0},"HUANCAVELICA","CASTROVIRREYNA","SAN JUAN","C090410"]
[null,null,null,null,null,null,null,null,null,null,null,null,"HUANCAVELICA CASTROVIRREYNA SANTA ANA",0,"HUANCAVELICA","CASTROVIRREYNA","SANTA ANA","C090411"]
[null,null,null,null,null,null,null,null,null,null,null,null,"HUANCAVELICA CASTROVIRREYNA TANTARA",0,"HUANCAVELICA","CASTROVIRREYNA","TANTARA","C090412"]
[null,null,null,null,null,null,null,null,null,null,null,null,"HUANCAVELICA CASTROVIRREYNA TICRAPO",0,"HUANCAVELICA","CASTROVIRREYNA","TICRAPO","C090413"]
[null,null,null,null,null,null,null,null,null,null,null,null,"HUANCAVELICA CHURCAMPA ANCO",0,"HUANCAVELICA","CHURCAMPA","ANCO","C090502"]
[null,null,null,null,null,null,null,null,null,null,null,null,"HUANCAVELICA CHURCAMPA CHINCHIHUASI",0,"HUANCAVELICA","CHURCAMPA","CHINCHIHUASI","C090503"]
[null,null,null,null,null,null,null,null,null,null,null,null,"HUANCAVELICA CHURCAMPA CHURCAMPA",0,"HUANCAVELICA","CHURCAMPA","CHURCAMPA","C090501"]
[null,null,null,null,null,null,null,null,null,null,null,null,"HUANCAVELICA CHURCAMPA COSME",0,"HUANCAVELICA","CHURCAMPA","COSME","C090511"]
[null,null,null,null,null,null,null,null,null,null,null,null,"HUANCAVELICA CHURCAMPA EL CARMEN",0,"HUANCAVELICA","CHURCAMPA","EL CARMEN","C090504"]
[null,null,null,null,null,null,null,null,null,null,null,null,"HUANCAVELICA CHURCAMPA LA MERCED",0,"HUANCAVELICA","CHURCAMPA","LA MERCED","C090505"]
[null,null,null,null,null,null,null,null,null,null,null,null,"HUANCAVELICA CHURCAMPA LOCROJA",0,"HUANCAVELICA","CHURCAMPA","LOCROJA","C090506"]
[null,null,null,null,null,null,null,null,null,null,null,null,"HUANCAVELICA CHURCAMPA PACHAMARCA",0,"HUANCAVELICA","CHURCAMPA","PACHAMARCA","C090510"]
[null,null,null,null,null,null,null,null,null,null,null,null,"HUANCAVELICA CHURCAMPA PAUCARBAMBA",0,"HUANCAVELICA","CHURCAMPA","PAUCARBAMBA","C090507"]
[null,null,null,null,null,null,null,null,null,null,null,null,"HUANCAVELICA CHURCAMPA SAN MIGUEL DE MAYOCC",0,"HUANCAVELICA","CHURCAMPA","SAN MIGUEL DE MAYOCC","C090508"]
[null,null,null,null,null,null,null,null,null,null,null,null,"HUANCAVELICA CHURCAMPA SAN PEDRO DE CORIS",0,"HUANCAVELICA","CHURCAMPA","SAN PEDRO DE CORIS","C090509"]
[null,null,null,null,null,null,null,null,null,null,null,null,"HUANCAVELICA HUANCAVELICA ACOBAMBILLA",0,"HUANCAVELICA","HUANCAVELICA","ACOBAMBILLA","C090102"]
[null,null,null,null,null,null,null,null,null,null,null,null,"HUANCAVELICA HUANCAVELICA ACORIA",0,"HUANCAVELICA","HUANCAVELICA","ACORIA","C090103"]
[null,null,null,null,null,null,null,null,null,null,null,null,"HUANCAVELICA HUANCAVELICA ASCENSION",0,"HUANCAVELICA","HUANCAVELICA","ASCENSION","C090118"]
[null,null,null,null,null,null,null,null,null,null,null,null,"HUANCAVELICA HUANCAVELICA CONAYCA",0,"HUANCAVELICA","HUANCAVELICA","CONAYCA","C090104"]
[null,null,null,null,null,null,null,null,null,null,null,null,"HUANCAVELICA HUANCAVELICA CUENCA",0,"HUANCAVELICA","HUANCAVELICA","CUENCA","C090105"]
[null,null,null,null,null,null,null,null,null,null,null,null,"HUANCAVELICA HUANCAVELICA HUACHOCOLPA",0,"HUANCAVELICA","HUANCAVELICA","HUACHOCOLPA","C090106"]
[null,null,null,null,null,null,null,null,null,null,null,null,"HUANCAVELICA HUANCAVELICA HUANCAVELICA",0,"HUANCAVELICA","HUANCAVELICA","HUANCAVELICA","C090101"]
[null,null,null,null,null,null,null,null,null,null,null,null,"HUANCAVELICA HUANCAVELICA HUANDO",0,"HUANCAVELICA","HUANCAVELICA","HUANDO","C090119"]
[null,null,null,null,null,null,null,null,null,null,null,null,"HUANCAVELICA HUANCAVELICA HUAYLLAHUARA",0,"HUANCAVELICA","HUANCAVELICA","HUAYLLAHUARA","C090107"]
[null,null,null,null,null,null,null,null,null,null,null,null,"HUANCAVELICA HUANCAVELICA IZCUCHACA",0,"HUANCAVELICA","HUANCAVELICA","IZCUCHACA","C090108"]
[null,null,null,null,null,null,null,null,null,null,null,null,"HUANCAVELICA HUANCAVELICA LARIA",0,"HUANCAVELICA","HUANCAVELICA","LARIA","C090109"]
[null,null,null,null,null,null,null,null,null,null,null,null,"HUANCAVELICA HUANCAVELICA MANTA",0,"HUANCAVELICA","HUANCAVELICA","MANTA","C090110"]
[null,null,null,null,null,null,null,null,null,null,null,null,"HUANCAVELICA HUANCAVELICA MARISCAL CACERES",0,"HUANCAVELICA","HUANCAVELICA","MARISCAL CACERES","C090111"]
[null,null,null,null,null,null,null,null,null,null,null,null,"HUANCAVELICA HUANCAVELICA MOYA",0,"HUANCAVELICA","HUANCAVELICA","MOYA","C090112"]
[null,null,null,null,null,null,null,null,null,null,null,null,"HUANCAVELICA HUANCAVELICA NUEVO OCCORO",0,"HUANCAVELICA","HUANCAVELICA","NUEVO OCCORO","C090113"]
[null,null,null,null,null,null,null,null,null,null,null,null,"HUANCAVELICA HUANCAVELICA PALCA",0,"HUANCAVELICA","HUANCAVELICA","PALCA","C090114"]
[null,null,null,null,null,null,null,null,null,null,null,null,"HUANCAVELICA HUANCAVELICA PILCHACA",0,"HUANCAVELICA","HUANCAVELICA","PILCHACA","C090115"]
[null,null,null,null,null,null,null,null,null,null,null,null,"HUANCAVELICA HUANCAVELICA VILCA",0,"HUANCAVELICA","HUANCAVELICA","VILCA","C090116"]
[null,null,null,null,null,null,null,null,null,null,null,null,"HUANCAVELICA HUANCAVELICA YAULI",0,"HUANCAVELICA","HUANCAVELICA","YAULI","C090117"]
[null,null,null,null,null,null,null,null,null,null,null,null,"HUANCAVELICA HUAYTARA AYAVI",0,"HUANCAVELICA","HUAYTARA","AYAVI","C090602"]
[null,null,null,null,null,null,null,null,null,null,null,null,"HUANCAVELICA HUAYTARA CORDOVA",0,"HUANCAVELICA","HUAYTARA","CORDOVA","C090603"]
[null,null,null,null,null,null,null,null,null,null,null,null,"HUANCAVELICA HUAYTARA HUAYACUNDO ARMA",0,"HUANCAVELICA","HUAYTARA","HUAYACUNDO ARMA","C090604"]
[null,null,null,null,null,null,null,null,null,null,null,null,"HUANCAVELICA HUAYTARA HUAYTARA",0,"HUANCAVELICA","HUAYTARA","HUAYTARA","C090601"]
[null,null,null,null,null,null,null,null,null,null,null,null,"HUANCAVELICA HUAYTARA LARAMARCA",0,"HUANCAVELICA","HUAYTARA","LARAMARCA","C090605"]
[null,null,null,null,null,null,null,null,null,null,null,null,"HUANCAVELICA HUAYTARA OCOYO",0,"HUANCAVELICA","HUAYTARA","OCOYO","C090606"]
[null,null,null,null,null,null,null,null,null,null,null,null,"HUANCAVELICA HUAYTARA PILPICHACA",0,"HUANCAVELICA","HUAYTARA","PILPICHACA","C090607"]
[null,null,null,null,null,null,null,null,null,null,null,null,"HUANCAVELICA HUAYTARA QUERCO",0,"HUANCAVELICA","HUAYTARA","QUERCO","C090608"]
[null,null,null,null,null,null,null,null,null,null,null,null,"HUANCAVELICA HUAYTARA QUITO-ARMA",0,"HUANCAVELICA","HUAYTARA","QUITO-ARMA","C090609"]
[null,null,null,null,null,null,null,null,null,null,null,null,"HUANCAVELICA HUAYTARA SAN ANTONIO DE CUSICANCHA",0,"HUANCAVELICA","HUAYTARA","SAN ANTONIO DE CUSICANCHA","C090610"]
[null,null,null,null,null,null,null,null,null,null,null,null,"HUANCAVELICA HUAYTARA SAN FRANCISCO DE SANGAYAICO",0,"HUANCAVELICA","HUAYTARA","SAN FRANCISCO DE SANGAYAICO","C090611"]
[null,null,null,null,null,null,null,null,null,null,null,null,"HUANCAVELICA HUAYTARA SAN ISIDRO",0,"HUANCAVELICA","HUAYTARA","SAN ISIDRO","C090612"]
[null,null,null,null,null,null,null,null,null,null,null,null,"HUANCAVELICA HUAYTARA SANTIAGO DE CHOCORVOS",0,"HUANCAVELICA","HUAYTARA","SANTIAGO DE CHOCORVOS","C090613"]
[null,null,null,null,null,null,null,null,null,null,null,null,"HUANCAVELICA HUAYTARA SANTIAGO DE QUIRAHUARA",0,"HUANCAVELICA","HUAYTARA","SANTIAGO DE QUIRAHUARA","C090614"]
[null,null,null,null,null,null,null,null,null,null,null,null,"HUANCAVELICA HUAYTARA SANTO DOMINGO DE CAPILLAS",0,"HUANCAVELICA","HUAYTARA","SANTO DOMINGO DE CAPILLAS","C090615"]
[null,null,null,null,null,null,null,null,null,null,null,null,"HUANCAVELICA HUAYTARA TAMBO",0,"HUANCAVELICA","HUAYTARA","TAMBO","C090616"]
[null,null,null,null,null,null,null,null,null,null,null,null,"HUANCAVELICA TAYACAJA ACOSTAMBO",0,"HUANCAVELICA","TAYACAJA","ACOSTAMBO","C090702"]
[null,null,null,null,null,null,null,null,null,null,null,null,"HUANCAVELICA TAYACAJA ACRAQUIA",0,"HUANCAVELICA","TAYACAJA","ACRAQUIA","C090703"]
[null,null,null,null,null,null,null,null,null,null,null,null,"HUANCAVELICA TAYACAJA AHUAYCHA",0,"HUANCAVELICA","TAYACAJA","AHUAYCHA","C090704"]
[null,null,null,null,null,null,null,null,null,null,null,null,"HUANCAVELICA TAYACAJA ANDAYMARCA",0,"HUANCAVELICA","TAYACAJA","ANDAYMARCA","C090720"]
[null,null,null,null,null,null,null,null,null,null,null,null,"HUANCAVELICA TAYACAJA COLCABAMBA",0,"HUANCAVELICA","TAYACAJA","COLCABAMBA","C090705"]
[null,null,null,null,null,null,null,null,null,null,null,null,"HUANCAVELICA TAYACAJA DANIEL HERNANDEZ",0,"HUANCAVELICA","TAYACAJA","DANIEL HERNANDEZ","C090705"]
[null,null,null,null,null,null,null,null,null,null,null,null,"HUANCAVELICA TAYACAJA HUACHOCOLPA",0,"HUANCAVELICA","TAYACAJA","HUACHOCOLPA","C090707"]
[null,null,null,null,null,null,null,null,null,null,null,null,"HUANCAVELICA TAYACAJA HUARIBAMBA",0,"HUANCAVELICA","TAYACAJA","HUARIBAMBA","C090709"]
[null,null,null,null,null,null,null,null,null,null,null,null,"HUANCAVELICA TAYACAJA ÑAHUIMPUQUIO",0,"HUANCAVELICA","TAYACAJA","ÑAHUIMPUQUIO","C090709"]
[null,null,null,null,null,null,null,null,null,null,null,null,"HUANCAVELICA TAYACAJA PAMPAS",0,"HUANCAVELICA","TAYACAJA","PAMPAS","C090701"]
[null,null,null,null,null,null,null,null,null,null,null,null,"HUANCAVELICA TAYACAJA PAZOS",0,"HUANCAVELICA","TAYACAJA","PAZOS","C090711"]
[null,null,null,null,null,null,null,null,null,null,null,null,"HUANCAVELICA TAYACAJA QUICHUAS",0,"HUANCAVELICA","TAYACAJA","QUICHUAS","C090719"]
[null,null,null,null,null,null,null,null,null,null,null,null,"HUANCAVELICA TAYACAJA QUISHUAR",0,"HUANCAVELICA","TAYACAJA","QUISHUAR","C090713"]
[null,null,null,null,null,null,null,null,null,null,null,null,"HUANCAVELICA TAYACAJA SALCABAMBA",0,"HUANCAVELICA","TAYACAJA","SALCABAMBA","C090714"]
[null,null,null,null,null,null,null,null,null,null,null,null,{"$f":"O899&\" \"&P899&\" \"&Q899","v":"HUANCAVELICA TAYACAJA SALCAHUASI"},{"$f":"IF(AND($D$9=O899,$D$10=P899),N898+1,0)","v":0},"HUANCAVELICA","TAYACAJA","SALCAHUASI","C090715"]
[null,null,null,null,null,null,null,null,null,null,null,null,"HUANCAVELICA TAYACAJA SAN MARCOS DE ROCCHAC",0,"HUANCAVELICA","TAYACAJA","SAN MARCOS DE ROCCHAC","C090716"]
[null,null,null,null,null,null,null,null,null,null,null,null,"HUANCAVELICA TAYACAJA SURCUBAMBA",0,"HUANCAVELICA","TAYACAJA","SURCUBAMBA","C090717"]
[null,null,null,null,null,null,null,null,null,null,null,null,"HUANCAVELICA TAYACAJA TINTAY PUNCU",0,"HUANCAVELICA","TAYACAJA","TINTAY PUNCU","C090718"]
[null,null,null,null,null,null,null,null,null,null,null,null,"HUANUCO AMBO AMBO",0,"HUANUCO","AMBO","AMBO","C100201"]
[null,null,null,null,null,null,null,null,null,null,null,null,"HUANUCO AMBO CAYNA",0,"HUANUCO","AMBO","CAYNA","C100202"]
[null,null,null,null,null,null,null,null,null,null,null,null,"HUANUCO AMBO COLPAS",0,"HUANUCO","AMBO","COLPAS","C100203"]
[null,null,null,null,null,null,null,null,null,null,null,null,"HUANUCO AMBO CONCHAMARCA",0,"HUANUCO","AMBO","CONCHAMARCA","C100204"]
[null,null,null,null,null,null,null,null,null,null,null,null,"HUANUCO AMBO HUACAR",0,"HUANUCO","AMBO","HUACAR","C100205"]
[null,null,null,null,null,null,null,null,null,null,null,null,"HUANUCO AMBO SAN FRANCISCO",0,"HUANUCO","AMBO","SAN FRANCISCO","C100206"]
[null,null,null,null,null,null,null,null,null,null,null,null,"HUANUCO AMBO SAN RAFAEL",0,"HUANUCO","AMBO","SAN RAFAEL","C100207"]
[null,null,null,null,null,null,null,null,null,null,null,null,"HUANUCO AMBO TOMAY KICHWA",0,"HUANUCO","AMBO","TOMAY KICHWA","C100208"]
[null,null,null,null,null,null,null,null,null,null,null,null,"HUANUCO DOS DE MAYO CHUQUIS",0,"HUANUCO","DOS DE MAYO","CHUQUIS","C100307"]
[null,null,null,null,null,null,null,null,null,null,null,null,"HUANUCO DOS DE MAYO LA UNION",0,"HUANUCO","DOS DE MAYO","LA UNION","C100301"]
[null,null,null,null,null,null,null,null,null,null,null,null,"HUANUCO DOS DE MAYO MARIAS",0,"HUANUCO","DOS DE MAYO","MARIAS","C100311"]
[null,null,null,null,null,null,null,null,null,null,null,null,"HUANUCO DOS DE MAYO PACHAS",0,"HUANUCO","DOS DE MAYO","PACHAS","C100313"]
[null,null,null,null,null,null,null,null,null,null,null,null,"HUANUCO DOS DE MAYO QUIVILLA",0,"HUANUCO","DOS DE MAYO","QUIVILLA","C100316"]
[null,null,null,null,null,null,null,null,null,null,null,null,"HUANUCO DOS DE MAYO RIPAN",0,"HUANUCO","DOS DE MAYO","RIPAN","C100317"]
[null,null,null,null,null,null,null,null,null,null,null,null,"HUANUCO DOS DE MAYO SHUNQUI",0,"HUANUCO","DOS DE MAYO","SHUNQUI","C100321"]
[null,null,null,null,null,null,null,null,null,null,null,null,"HUANUCO DOS DE MAYO SILLAPATA",0,"HUANUCO","DOS DE MAYO","SILLAPATA","C100322"]
[null,null,null,null,null,null,null,null,null,null,null,null,"HUANUCO DOS DE MAYO YANAS",0,"HUANUCO","DOS DE MAYO","YANAS","C100323"]
[null,null,null,null,null,null,null,null,null,null,null,null,"HUANUCO HUACAYBAMBA CANCHABAMBA",0,"HUANUCO","HUACAYBAMBA","CANCHABAMBA","C100402"]
[null,null,null,null,null,null,null,null,null,null,null,null,"HUANUCO HUACAYBAMBA COCHABAMBA",0,"HUANUCO","HUACAYBAMBA","COCHABAMBA","C100403"]
[null,null,null,null,null,null,null,null,null,null,null,null,"HUANUCO HUACAYBAMBA HUACAYBAMBA",0,"HUANUCO","HUACAYBAMBA","HUACAYBAMBA","C100401"]
[null,null,null,null,null,null,null,null,null,null,null,null,"HUANUCO HUACAYBAMBA PINRA",0,"HUANUCO","HUACAYBAMBA","PINRA","C100404"]
[null,null,null,null,null,null,null,null,null,null,null,null,"HUANUCO HUAMALIES ARANCAY",0,"HUANUCO","HUAMALIES","ARANCAY","C100502"]
[null,null,null,null,null,null,null,null,null,null,null,null,"HUANUCO HUAMALIES CHAVIN DE PARIARCA",0,"HUANUCO","HUAMALIES","CHAVIN DE PARIARCA","C100503"]
[null,null,null,null,null,null,null,null,null,null,null,null,"HUANUCO HUAMALIES JACAS GRANDE",0,"HUANUCO","HUAMALIES","JACAS GRANDE","C100504"]
[null,null,null,null,null,null,null,null,null,null,null,null,"HUANUCO HUAMALIES JIRCAN",0,"HUANUCO","HUAMALIES","JIRCAN","C100505"]
[null,null,null,null,null,null,null,null,null,null,null,null,"HUANUCO HUAMALIES LLATA",0,"HUANUCO","HUAMALIES","LLATA","C100501"]
[null,null,null,null,null,null,null,null,null,null,null,null,"HUANUCO HUAMALIES MIRAFLORES",0,"HUANUCO","HUAMALIES","MIRAFLORES","C100506"]
[null,null,null,null,null,null,null,null,null,null,null,null,"HUANUCO HUAMALIES MONZON",0,"HUANUCO","HUAMALIES","MONZON","C100507"]
[null,null,null,null,null,null,null,null,null,null,null,null,"HUANUCO HUAMALIES PUNCHAO",0,"HUANUCO","HUAMALIES","PUNCHAO","C100508"]
[null,null,null,null,null,null,null,null,null,null,null,null,"HUANUCO HUAMALIES PUÑOS",0,"HUANUCO","HUAMALIES","PUÑOS","C100508"]
[null,null,null,null,null,null,null,null,null,null,null,null,"HUANUCO HUAMALIES SINGA",0,"HUANUCO","HUAMALIES","SINGA","C100510"]
[null,null,null,null,null,null,null,null,null,null,null,null,"HUANUCO HUAMALIES TANTAMAYO",0,"HUANUCO","HUAMALIES","TANTAMAYO","C100511"]
[null,null,null,null,null,null,null,null,null,null,null,null,"HUANUCO HUANUCO AMARILIS",0,"HUANUCO","HUANUCO","AMARILIS","C100102"]
[null,null,null,null,null,null,null,null,null,null,null,null,"HUANUCO HUANUCO CHINCHAO",0,"HUANUCO","HUANUCO","CHINCHAO","C100103"]
[null,null,null,null,null,null,null,null,null,null,null,null,"HUANUCO HUANUCO CHURUBAMBA",0,"HUANUCO","HUANUCO","CHURUBAMBA","C100104"]
[null,null,null,null,null,null,null,null,null,null,null,null,"HUANUCO HUANUCO HUANUCO",0,"HUANUCO","HUANUCO","HUANUCO","C100101"]
[null,null,null,null,null,null,null,null,null,null,null,null,"HUANUCO HUANUCO MARGOS",0,"HUANUCO","HUANUCO","MARGOS","C100105"]
[null,null,null,null,null,null,null,null,null,null,null,null,"HUANUCO HUANUCO PILLCO MARCA",0,"HUANUCO","HUANUCO","PILLCO MARCA","C100111"]
[null,null,null,null,null,null,null,null,null,null,null,null,"HUANUCO HUANUCO QUISQUI (KICHKI)",0,"HUANUCO","HUANUCO","QUISQUI (KICHKI)","C100106"]
[null,null,null,null,null,null,null,null,null,null,null,null,"HUANUCO HUANUCO SAN FRANCISCO DE CAYRAN",0,"HUANUCO","HUANUCO","SAN FRANCISCO DE CAYRAN","C100107"]
[null,null,null,null,null,null,null,null,null,null,null,null,"HUANUCO HUANUCO SAN PABLO DE PILLAO",0,"HUANUCO","HUANUCO","SAN PABLO DE PILLAO","C100113"]
[null,null,null,null,null,null,null,null,null,null,null,null,"HUANUCO HUANUCO SAN PEDRO DE CHAULAN",0,"HUANUCO","HUANUCO","SAN PEDRO DE CHAULAN","C100108"]
[null,null,null,null,null,null,null,null,null,null,null,null,"HUANUCO HUANUCO SANTA MARIA DEL VALLE",0,"HUANUCO","HUANUCO","SANTA MARIA DEL VALLE","C100109"]
[null,null,null,null,null,null,null,null,null,null,null,null,"HUANUCO HUANUCO YACUS",0,"HUANUCO","HUANUCO","YACUS","C100112"]
[null,null,null,null,null,null,null,null,null,null,null,null,"HUANUCO HUANUCO YARUMAYO",0,"HUANUCO","HUANUCO","YARUMAYO","C100110"]
[null,null,null,null,null,null,null,null,null,null,null,null,"HUANUCO LAURICOCHA BAÑOS",0,"HUANUCO","LAURICOCHA","BAÑOS","C101002"]
[null,null,null,null,null,null,null,null,null,null,null,null,"HUANUCO LAURICOCHA JESUS",0,"HUANUCO","LAURICOCHA","JESUS","C101001"]
[null,null,null,null,null,null,null,null,null,null,null,null,"HUANUCO LAURICOCHA JIVIA",0,"HUANUCO","LAURICOCHA","JIVIA","C101003"]
[null,null,null,null,null,null,null,null,null,null,null,null,"HUANUCO LAURICOCHA QUEROPALCA",0,"HUANUCO","LAURICOCHA","QUEROPALCA","C101004"]
[null,null,null,null,null,null,null,null,null,null,null,null,"HUANUCO LAURICOCHA RONDOS",0,"HUANUCO","LAURICOCHA","RONDOS","C101005"]
[null,null,null,null,null,null,null,null,null,null,null,null,"HUANUCO LAURICOCHA SAN FRANCISCO DE ASIS",0,"HUANUCO","LAURICOCHA","SAN FRANCISCO DE ASIS","C101006"]
[null,null,null,null,null,null,null,null,null,null,null,null,"HUANUCO LAURICOCHA SAN MIGUEL DE CAURI",0,"HUANUCO","LAURICOCHA","SAN MIGUEL DE CAURI","C101007"]
[null,null,null,null,null,null,null,null,null,null,null,null,"HUANUCO LEONCIO PRADO CASTILLO GRANDE",0,"HUANUCO","LEONCIO PRADO","CASTILLO GRANDE","C100608"]
[null,null,null,null,null,null,null,null,null,null,null,null,"HUANUCO LEONCIO PRADO DANIEL ALOMIA ROBLES",0,"HUANUCO","LEONCIO PRADO","DANIEL ALOMIA ROBLES","C100602"]
[null,null,null,null,null,null,null,null,null,null,null,null,"HUANUCO LEONCIO PRADO HERMILIO VALDIZAN",0,"HUANUCO","LEONCIO PRADO","HERMILIO VALDIZAN","C100603"]
[null,null,null,null,null,null,null,null,null,null,null,null,"HUANUCO LEONCIO PRADO JOSE CRESPO Y CASTILLO",0,"HUANUCO","LEONCIO PRADO","JOSE CRESPO Y CASTILLO","C100604"]
[null,null,null,null,null,null,null,null,null,null,null,null,"HUANUCO LEONCIO PRADO LUYANDO",0,"HUANUCO","LEONCIO PRADO","LUYANDO","C100605"]
[null,null,null,null,null,null,null,null,null,null,null,null,"HUANUCO LEONCIO PRADO MARIANO DAMASO BERAUN",0,"HUANUCO","LEONCIO PRADO","MARIANO DAMASO BERAUN","C100606"]
[null,null,null,null,null,null,null,null,null,null,null,null,"HUANUCO LEONCIO PRADO PUCAYACU",0,"HUANUCO","LEONCIO PRADO","PUCAYACU","C100607"]
[null,null,null,null,null,null,null,null,null,null,null,null,"HUANUCO LEONCIO PRADO RUPA-RUPA",0,"HUANUCO","LEONCIO PRADO","RUPA-RUPA","C100601"]
[null,null,null,null,null,null,null,null,null,null,null,null,{"$f":"O963&\" \"&P963&\" \"&Q963","v":"HUANUCO MARAÑON CHOLON"},{"$f":"IF(AND($D$9=O963,$D$10=P963),N962+1,0)","v":0},"HUANUCO","MARAÑON","CHOLON","C100702"]
[null,null,null,null,null,null,null,null,null,null,null,null,"HUANUCO MARAÑON HUACRACHUCO",0,"HUANUCO","MARAÑON","HUACRACHUCO","C100701"]
[null,null,null,null,null,null,null,null,null,null,null,null,"HUANUCO MARAÑON LA MORADA",0,"HUANUCO","MARAÑON","LA MORADA","C100704"]
[null,null,null,null,null,null,null,null,null,null,null,null,"HUANUCO MARAÑON SAN BUENAVENTURA",0,"HUANUCO","MARAÑON","SAN BUENAVENTURA","C100703"]
[null,null,null,null,null,null,null,null,null,null,null,null,"HUANUCO MARAÑON SANTA ROSA DE ALTO YANAJANCA",0,"HUANUCO","MARAÑON","SANTA ROSA DE ALTO YANAJANCA","C100705"]
[null,null,null,null,null,null,null,null,null,null,null,null,"HUANUCO PACHITEA CHAGLLA",0,"HUANUCO","PACHITEA","CHAGLLA","C100802"]
[null,null,null,null,null,null,null,null,null,null,null,null,"HUANUCO PACHITEA MOLINO",0,"HUANUCO","PACHITEA","MOLINO","C100803"]
[null,null,null,null,null,null,null,null,null,null,null,null,"HUANUCO PACHITEA PANAO",0,"HUANUCO","PACHITEA","PANAO","C100801"]
[null,null,null,null,null,null,null,null,null,null,null,null,"HUANUCO PACHITEA UMARI",0,"HUANUCO","PACHITEA","UMARI","C100804"]
[null,null,null,null,null,null,null,null,null,null,null,null,"HUANUCO PUERTO INCA CODO DEL POZUZO",0,"HUANUCO","PUERTO INCA","CODO DEL POZUZO","C100902"]
[null,null,null,null,null,null,null,null,null,null,null,null,"HUANUCO PUERTO INCA HONORIA",0,"HUANUCO","PUERTO INCA","HONORIA","C100903"]
[null,null,null,null,null,null,null,null,null,null,null,null,"HUANUCO PUERTO INCA PUERTO INCA",0,"HUANUCO","PUERTO INCA","PUERTO INCA","C100901"]
[null,null,null,null,null,null,null,null,null,null,null,null,"HUANUCO PUERTO INCA TOURNAVISTA",0,"HUANUCO","PUERTO INCA","TOURNAVISTA","C100904"]
[null,null,null,null,null,null,null,null,null,null,null,null,"HUANUCO PUERTO INCA YUYAPICHIS",0,"HUANUCO","PUERTO INCA","YUYAPICHIS","C100905"]
[null,null,null,null,null,null,null,null,null,null,null,null,"HUANUCO YAROWILCA APARICIO POMARES",0,"HUANUCO","YAROWILCA","APARICIO POMARES","C101104"]
[null,null,null,null,null,null,null,null,null,null,null,null,"HUANUCO YAROWILCA CAHUAC",0,"HUANUCO","YAROWILCA","CAHUAC","C101102"]
[null,null,null,null,null,null,null,null,null,null,null,null,"HUANUCO YAROWILCA CHACABAMBA",0,"HUANUCO","YAROWILCA","CHACABAMBA","C101103"]
[null,null,null,null,null,null,null,null,null,null,null,null,"HUANUCO YAROWILCA CHAVINILLO",0,"HUANUCO","YAROWILCA","CHAVINILLO","C101101"]
[null,null,null,null,null,null,null,null,null,null,null,null,"HUANUCO YAROWILCA CHORAS",0,"HUANUCO","YAROWILCA","CHORAS","C101108"]
[null,null,null,null,null,null,null,null,null,null,null,null,"HUANUCO YAROWILCA JACAS CHICO",0,"HUANUCO","YAROWILCA","JACAS CHICO","C101105"]
[null,null,null,null,null,null,null,null,null,null,null,null,"HUANUCO YAROWILCA OBAS",0,"HUANUCO","YAROWILCA","OBAS","C101106"]
[null,null,null,null,null,null,null,null,null,null,null,null,"HUANUCO YAROWILCA PAMPAMARCA",0,"HUANUCO","YAROWILCA","PAMPAMARCA","C101107"]
[null,null,null,null,null,null,null,null,null,null,null,null,"ICA CHINCHA ALTO LARAN",0,"ICA","CHINCHA","ALTO LARAN","C110202"]
[null,null,null,null,null,null,null,null,null,null,null,null,"ICA CHINCHA CHAVIN",0,"ICA","CHINCHA","CHAVIN","C110203"]
[null,null,null,null,null,null,null,null,null,null,null,null,"ICA CHINCHA CHINCHA ALTA",0,"ICA","CHINCHA","CHINCHA ALTA","C110201"]
[null,null,null,null,null,null,null,null,null,null,null,null,"ICA CHINCHA CHINCHA BAJA",0,"ICA","CHINCHA","CHINCHA BAJA","C110204"]
[null,null,null,null,null,null,null,null,null,null,null,null,"ICA CHINCHA EL CARMEN",0,"ICA","CHINCHA","EL CARMEN","C110205"]
[null,null,null,null,null,null,null,null,null,null,null,null,"ICA CHINCHA GROCIO PRADO",0,"ICA","CHINCHA","GROCIO PRADO","C110206"]
[null,null,null,null,null,null,null,null,null,null,null,null,"ICA CHINCHA PUEBLO NUEVO",0,"ICA","CHINCHA","PUEBLO NUEVO","C110207"]
[null,null,null,null,null,null,null,null,null,null,null,null,"ICA CHINCHA SAN JUAN DE YANAC",0,"ICA","CHINCHA","SAN JUAN DE YANAC","C110208"]
[null,null,null,null,null,null,null,null,null,null,null,null,"ICA CHINCHA SAN PEDRO DE HUACARPANA",0,"ICA","CHINCHA","SAN PEDRO DE HUACARPANA","C110209"]
[null,null,null,null,null,null,null,null,null,null,null,null,"ICA CHINCHA SUNAMPE",0,"ICA","CHINCHA","SUNAMPE","C110210"]
[null,null,null,null,null,null,null,null,null,null,null,null,"ICA CHINCHA TAMBO DE MORA",0,"ICA","CHINCHA","TAMBO DE MORA","C110211"]
[null,null,null,null,null,null,null,null,null,null,null,null,"ICA ICA ICA",0,"ICA","ICA","ICA","C110101"]
[null,null,null,null,null,null,null,null,null,null,null,null,"ICA ICA LA TINGUIÑA",0,"ICA","ICA","LA TINGUIÑA","C110102"]
[null,null,null,null,null,null,null,null,null,null,null,null,"ICA ICA LOS AQUIJES",0,"ICA","ICA","LOS AQUIJES","C110103"]
[null,null,null,null,null,null,null,null,null,null,null,null,"ICA ICA OCUCAJE",0,"ICA","ICA","OCUCAJE","C110104"]
[null,null,null,null,null,null,null,null,null,null,null,null,"ICA ICA PACHACUTEC",0,"ICA","ICA","PACHACUTEC","C110105"]
[null,null,null,null,null,null,null,null,null,null,null,null,"ICA ICA PARCONA",0,"ICA","ICA","PARCONA","C110106"]
[null,null,null,null,null,null,null,null,null,null,null,null,"ICA ICA PUEBLO NUEVO",0,"ICA","ICA","PUEBLO NUEVO","C110107"]
[null,null,null,null,null,null,null,null,null,null,null,null,"ICA ICA SALAS",0,"ICA","ICA","SALAS","C110108"]
[null,null,null,null,null,null,null,null,null,null,null,null,"ICA ICA SAN JOSE DE LOS MOLINOS",0,"ICA","ICA","SAN JOSE DE LOS MOLINOS","C110109"]
[null,null,null,null,null,null,null,null,null,null,null,null,"ICA ICA SAN JUAN BAUTISTA",0,"ICA","ICA","SAN JUAN BAUTISTA","C110110"]
[null,null,null,null,null,null,null,null,null,null,null,null,"ICA ICA SANTIAGO",0,"ICA","ICA","SANTIAGO","C110111"]
[null,null,null,null,null,null,null,null,null,null,null,null,"ICA ICA SUBTANJALLA",0,"ICA","ICA","SUBTANJALLA","C110112"]
[null,null,null,null,null,null,null,null,null,null,null,null,"ICA ICA TATE",0,"ICA","ICA","TATE","C110113"]
[null,null,null,null,null,null,null,null,null,null,null,null,"ICA ICA YAUCA DEL ROSARIO",0,"ICA","ICA","YAUCA DEL ROSARIO","C110114"]
[null,null,null,null,null,null,null,null,null,null,null,null,"ICA NAZCA CHANGUILLO",0,"ICA","NAZCA","CHANGUILLO","C110302"]
[null,null,null,null,null,null,null,null,null,null,null,null,"ICA NAZCA EL INGENIO",0,"ICA","NAZCA","EL INGENIO","C110303"]
[null,null,null,null,null,null,null,null,null,null,null,null,"ICA NAZCA MARCONA",0,"ICA","NAZCA","MARCONA","C110304"]
[null,null,null,null,null,null,null,null,null,null,null,null,"ICA NAZCA NASCA",0,"ICA","NAZCA","NASCA","C110301"]
[null,null,null,null,null,null,null,null,null,null,null,null,"ICA NAZCA VISTA ALEGRE",0,"ICA","NAZCA","VISTA ALEGRE","C110305"]
[null,null,null,null,null,null,null,null,null,null,null,null,"ICA PALPA LLIPATA",0,"ICA","PALPA","LLIPATA","C110402"]
[null,null,null,null,null,null,null,null,null,null,null,null,"ICA PALPA PALPA",0,"ICA","PALPA","PALPA","C110401"]
[null,null,null,null,null,null,null,null,null,null,null,null,"ICA PALPA RIO GRANDE",0,"ICA","PALPA","RIO GRANDE","C110403"]
[null,null,null,null,null,null,null,null,null,null,null,null,"ICA PALPA SANTA CRUZ",0,"ICA","PALPA","SANTA CRUZ","C110404"]
[null,null,null,null,null,null,null,null,null,null,null,null,"ICA PALPA TIBILLO",0,"ICA","PALPA","TIBILLO","C110405"]
[null,null,null,null,null,null,null,null,null,null,null,null,"ICA PISCO HUANCANO",0,"ICA","PISCO","HUANCANO","C110502"]
[null,null,null,null,null,null,null,null,null,null,null,null,"ICA PISCO HUMAY",0,"ICA","PISCO","HUMAY","C110503"]
[null,null,null,null,null,null,null,null,null,null,null,null,"ICA PISCO INDEPENDENCIA",0,"ICA","PISCO","INDEPENDENCIA","C110504"]
[null,null,null,null,null,null,null,null,null,null,null,null,"ICA PISCO PARACAS",0,"ICA","PISCO","PARACAS","C110505"]
[null,null,null,null,null,null,null,null,null,null,null,null,"ICA PISCO PISCO",0,"ICA","PISCO","PISCO","C110501"]
[null,null,null,null,null,null,null,null,null,null,null,null,"ICA PISCO SAN ANDRES",0,"ICA","PISCO","SAN ANDRES","C110506"]
[null,null,null,null,null,null,null,null,null,null,null,null,"ICA PISCO SAN CLEMENTE",0,"ICA","PISCO","SAN CLEMENTE","C110507"]
[null,null,null,null,null,null,null,null,null,null,null,null,{"$f":"O1027&\" \"&P1027&\" \"&Q1027","v":"ICA PISCO TUPAC AMARU INCA"},{"$f":"IF(AND($D$9=O1027,$D$10=P1027),N1026+1,0)","v":0},"ICA","PISCO","TUPAC AMARU INCA","C110508"]
[null,null,null,null,null,null,null,null,null,null,null,null,"JUNIN CHANCHAMAYO CHANCHAMAYO",0,"JUNIN","CHANCHAMAYO","CHANCHAMAYO","C120301"]
[null,null,null,null,null,null,null,null,null,null,null,null,"JUNIN CHANCHAMAYO PERENE",0,"JUNIN","CHANCHAMAYO","PERENE","C120302"]
[null,null,null,null,null,null,null,null,null,null,null,null,"JUNIN CHANCHAMAYO PICHANAQUI",0,"JUNIN","CHANCHAMAYO","PICHANAQUI","C120303"]
[null,null,null,null,null,null,null,null,null,null,null,null,"JUNIN CHANCHAMAYO SAN LUIS DE SHUARO",0,"JUNIN","CHANCHAMAYO","SAN LUIS DE SHUARO","C120304"]
[null,null,null,null,null,null,null,null,null,null,null,null,"JUNIN CHANCHAMAYO SAN RAMON",0,"JUNIN","CHANCHAMAYO","SAN RAMON","C120305"]
[null,null,null,null,null,null,null,null,null,null,null,null,"JUNIN CHANCHAMAYO VITOC",0,"JUNIN","CHANCHAMAYO","VITOC","C120306"]
[null,null,null,null,null,null,null,null,null,null,null,null,"JUNIN CHUPACA AHUAC",0,"JUNIN","CHUPACA","AHUAC","C120902"]
[null,null,null,null,null,null,null,null,null,null,null,null,"JUNIN CHUPACA CHONGOS BAJO",0,"JUNIN","CHUPACA","CHONGOS BAJO","C120903"]
[null,null,null,null,null,null,null,null,null,null,null,null,"JUNIN CHUPACA CHUPACA",0,"JUNIN","CHUPACA","CHUPACA","C120901"]
[null,null,null,null,null,null,null,null,null,null,null,null,"JUNIN CHUPACA HUACHAC",0,"JUNIN","CHUPACA","HUACHAC","C120904"]
[null,null,null,null,null,null,null,null,null,null,null,null,"JUNIN CHUPACA HUAMANCACA CHICO",0,"JUNIN","CHUPACA","HUAMANCACA CHICO","C120905"]
[null,null,null,null,null,null,null,null,null,null,null,null,"JUNIN CHUPACA SAN JUAN DE ISCOS",0,"JUNIN","CHUPACA","SAN JUAN DE ISCOS","C120906"]
[null,null,null,null,null,null,null,null,null,null,null,null,"JUNIN CHUPACA SAN JUAN DE JARPA",0,"JUNIN","CHUPACA","SAN JUAN DE JARPA","C120907"]
[null,null,null,null,null,null,null,null,null,null,null,null,"JUNIN CHUPACA TRES DE DICIEMBRE",0,"JUNIN","CHUPACA","TRES DE DICIEMBRE","C120908"]
[null,null,null,null,null,null,null,null,null,null,null,null,"JUNIN CHUPACA YANACANCHA",0,"JUNIN","CHUPACA","YANACANCHA","C120909"]
[null,null,null,null,null,null,null,null,null,null,null,null,"JUNIN CONCEPCION ACO",0,"JUNIN","CONCEPCION","ACO","C120202"]
[null,null,null,null,null,null,null,null,null,null,null,null,"JUNIN CONCEPCION ANDAMARCA",0,"JUNIN","CONCEPCION","ANDAMARCA","C120203"]
[null,null,null,null,null,null,null,null,null,null,null,null,"JUNIN CONCEPCION CHAMBARA",0,"JUNIN","CONCEPCION","CHAMBARA","C120204"]
[null,null,null,null,null,null,null,null,null,null,null,null,"JUNIN CONCEPCION COCHAS",0,"JUNIN","CONCEPCION","COCHAS","C120205"]
[null,null,null,null,null,null,null,null,null,null,null,null,"JUNIN CONCEPCION COMAS",0,"JUNIN","CONCEPCION","COMAS","C120206"]
[null,null,null,null,null,null,null,null,null,null,null,null,"JUNIN CONCEPCION CONCEPCION",0,"JUNIN","CONCEPCION","CONCEPCION","C120201"]
[null,null,null,null,null,null,null,null,null,null,null,null,"JUNIN CONCEPCION HEROINAS TOLEDO",0,"JUNIN","CONCEPCION","HEROINAS TOLEDO","C120207"]
[null,null,null,null,null,null,null,null,null,null,null,null,"JUNIN CONCEPCION MANZANARES",0,"JUNIN","CONCEPCION","MANZANARES","C120208"]
[null,null,null,null,null,null,null,null,null,null,null,null,"JUNIN CONCEPCION MARISCAL CASTILLA",0,"JUNIN","CONCEPCION","MARISCAL CASTILLA","C120209"]
[null,null,null,null,null,null,null,null,null,null,null,null,"JUNIN CONCEPCION MATAHUASI",0,"JUNIN","CONCEPCION","MATAHUASI","C120210"]
[null,null,null,null,null,null,null,null,null,null,null,null,"JUNIN CONCEPCION MITO",0,"JUNIN","CONCEPCION","MITO","C120211"]
[null,null,null,null,null,null,null,null,null,null,null,null,"JUNIN CONCEPCION NUEVE DE JULIO",0,"JUNIN","CONCEPCION","NUEVE DE JULIO","C120212"]
[null,null,null,null,null,null,null,null,null,null,null,null,"JUNIN CONCEPCION ORCOTUNA",0,"JUNIN","CONCEPCION","ORCOTUNA","C120213"]
[null,null,null,null,null,null,null,null,null,null,null,null,"JUNIN CONCEPCION SAN JOSE DE QUERO",0,"JUNIN","CONCEPCION","SAN JOSE DE QUERO","C120214"]
[null,null,null,null,null,null,null,null,null,null,null,null,"JUNIN CONCEPCION SANTA ROSA DE OCOPA",0,"JUNIN","CONCEPCION","SANTA ROSA DE OCOPA","C120215"]
[null,null,null,null,null,null,null,null,null,null,null,null,"JUNIN HUANCAYO CARHUACALLANGA",0,"JUNIN","HUANCAYO","CARHUACALLANGA","C120104"]
[null,null,null,null,null,null,null,null,null,null,null,null,"JUNIN HUANCAYO CHACAPAMPA",0,"JUNIN","HUANCAYO","CHACAPAMPA","C120105"]
[null,null,null,null,null,null,null,null,null,null,null,null,"JUNIN HUANCAYO CHICCHE",0,"JUNIN","HUANCAYO","CHICCHE","C120106"]
[null,null,null,null,null,null,null,null,null,null,null,null,"JUNIN HUANCAYO CHILCA",0,"JUNIN","HUANCAYO","CHILCA","C120107"]
[null,null,null,null,null,null,null,null,null,null,null,null,"JUNIN HUANCAYO CHONGOS ALTO",0,"JUNIN","HUANCAYO","CHONGOS ALTO","C120108"]
[null,null,null,null,null,null,null,null,null,null,null,null,"JUNIN HUANCAYO CHUPURO",0,"JUNIN","HUANCAYO","CHUPURO","C120111"]
[null,null,null,null,null,null,null,null,null,null,null,null,"JUNIN HUANCAYO COLCA",0,"JUNIN","HUANCAYO","COLCA","C120112"]
[null,null,null,null,null,null,null,null,null,null,null,null,"JUNIN HUANCAYO CULLHUAS",0,"JUNIN","HUANCAYO","CULLHUAS","C120113"]
[null,null,null,null,null,null,null,null,null,null,null,null,"JUNIN HUANCAYO EL TAMBO",0,"JUNIN","HUANCAYO","EL TAMBO","C120114"]
[null,null,null,null,null,null,null,null,null,null,null,null,"JUNIN HUANCAYO HUACRAPUQUIO",0,"JUNIN","HUANCAYO","HUACRAPUQUIO","C120116"]
[null,null,null,null,null,null,null,null,null,null,null,null,"JUNIN HUANCAYO HUALHUAS",0,"JUNIN","HUANCAYO","HUALHUAS","C120117"]
[null,null,null,null,null,null,null,null,null,null,null,null,"JUNIN HUANCAYO HUANCAN",0,"JUNIN","HUANCAYO","HUANCAN","C120119"]
[null,null,null,null,null,null,null,null,null,null,null,null,"JUNIN HUANCAYO HUANCAYO",0,"JUNIN","HUANCAYO","HUANCAYO","C120101"]
[null,null,null,null,null,null,null,null,null,null,null,null,"JUNIN HUANCAYO HUASICANCHA",0,"JUNIN","HUANCAYO","HUASICANCHA","C120120"]
[null,null,null,null,null,null,null,null,null,null,null,null,"JUNIN HUANCAYO HUAYUCACHI",0,"JUNIN","HUANCAYO","HUAYUCACHI","C120121"]
[null,null,null,null,null,null,null,null,null,null,null,null,"JUNIN HUANCAYO INGENIO",0,"JUNIN","HUANCAYO","INGENIO","C120122"]
[null,null,null,null,null,null,null,null,null,null,null,null,"JUNIN HUANCAYO PARIAHUANCA",0,"JUNIN","HUANCAYO","PARIAHUANCA","C120124"]
[null,null,null,null,null,null,null,null,null,null,null,null,"JUNIN HUANCAYO PILCOMAYO",0,"JUNIN","HUANCAYO","PILCOMAYO","C120125"]
[null,null,null,null,null,null,null,null,null,null,null,null,"JUNIN HUANCAYO PUCARA",0,"JUNIN","HUANCAYO","PUCARA","C120126"]
[null,null,null,null,null,null,null,null,null,null,null,null,"JUNIN HUANCAYO QUICHUAY",0,"JUNIN","HUANCAYO","QUICHUAY","C120127"]
[null,null,null,null,null,null,null,null,null,null,null,null,"JUNIN HUANCAYO QUILCAS",0,"JUNIN","HUANCAYO","QUILCAS","C120128"]
[null,null,null,null,null,null,null,null,null,null,null,null,"JUNIN HUANCAYO SAN AGUSTIN",0,"JUNIN","HUANCAYO","SAN AGUSTIN","C120129"]
[null,null,null,null,null,null,null,null,null,null,null,null,"JUNIN HUANCAYO SAN JERONIMO DE TUNAN",0,"JUNIN","HUANCAYO","SAN JERONIMO DE TUNAN","C120130"]
[null,null,null,null,null,null,null,null,null,null,null,null,"JUNIN HUANCAYO SANTO DOMINGO DE ACOBAMBA",0,"JUNIN","HUANCAYO","SANTO DOMINGO DE ACOBAMBA","C120135"]
[null,null,null,null,null,null,null,null,null,null,null,null,"JUNIN HUANCAYO SAÑO",0,"JUNIN","HUANCAYO","SAÑO","C120135"]
[null,null,null,null,null,null,null,null,null,null,null,null,"JUNIN HUANCAYO SAPALLANGA",0,"JUNIN","HUANCAYO","SAPALLANGA","C120133"]
[null,null,null,null,null,null,null,null,null,null,null,null,"JUNIN HUANCAYO SICAYA",0,"JUNIN","HUANCAYO","SICAYA","C120134"]
[null,null,null,null,null,null,null,null,null,null,null,null,"JUNIN HUANCAYO VIQUES",0,"JUNIN","HUANCAYO","VIQUES","C120136"]
[null,null,null,null,null,null,null,null,null,null,null,null,"JUNIN JAUJA ACOLLA",0,"JUNIN","JAUJA","ACOLLA","C120402"]
[null,null,null,null,null,null,null,null,null,null,null,null,"JUNIN JAUJA APATA",0,"JUNIN","JAUJA","APATA","C120403"]
[null,null,null,null,null,null,null,null,null,null,null,null,"JUNIN JAUJA ATAURA",0,"JUNIN","JAUJA","ATAURA","C120404"]
[null,null,null,null,null,null,null,null,null,null,null,null,"JUNIN JAUJA CANCHAYLLO",0,"JUNIN","JAUJA","CANCHAYLLO","C120405"]
[null,null,null,null,null,null,null,null,null,null,null,null,"JUNIN JAUJA CURICACA",0,"JUNIN","JAUJA","CURICACA","C120406"]
[null,null,null,null,null,null,null,null,null,null,null,null,{"$f":"O1091&\" \"&P1091&\" \"&Q1091","v":"JUNIN JAUJA EL MANTARO"},{"$f":"IF(AND($D$9=O1091,$D$10=P1091),N1090+1,0)","v":0},"JUNIN","JAUJA","EL MANTARO","C120407"]
[null,null,null,null,null,null,null,null,null,null,null,null,"JUNIN JAUJA HUAMALI",0,"JUNIN","JAUJA","HUAMALI","C120408"]
[null,null,null,null,null,null,null,null,null,null,null,null,"JUNIN JAUJA HUARIPAMPA",0,"JUNIN","JAUJA","HUARIPAMPA","C120409"]
[null,null,null,null,null,null,null,null,null,null,null,null,"JUNIN JAUJA HUERTAS",0,"JUNIN","JAUJA","HUERTAS","C120410"]
[null,null,null,null,null,null,null,null,null,null,null,null,"JUNIN JAUJA JANJAILLO",0,"JUNIN","JAUJA","JANJAILLO","C120411"]
[null,null,null,null,null,null,null,null,null,null,null,null,"JUNIN JAUJA JAUJA",0,"JUNIN","JAUJA","JAUJA","C120401"]
[null,null,null,null,null,null,null,null,null,null,null,null,"JUNIN JAUJA JULCAN",0,"JUNIN","JAUJA","JULCAN","C120412"]
[null,null,null,null,null,null,null,null,null,null,null,null,"JUNIN JAUJA LEONOR ORDOÑEZ",0,"JUNIN","JAUJA","LEONOR ORDOÑEZ","C120413"]
[null,null,null,null,null,null,null,null,null,null,null,null,"JUNIN JAUJA LLOCLLAPAMPA",0,"JUNIN","JAUJA","LLOCLLAPAMPA","C120414"]
[null,null,null,null,null,null,null,null,null,null,null,null,"JUNIN JAUJA MARCO",0,"JUNIN","JAUJA","MARCO","C120415"]
[null,null,null,null,null,null,null,null,null,null,null,null,"JUNIN JAUJA MASMA",0,"JUNIN","JAUJA","MASMA","C120416"]
[null,null,null,null,null,null,null,null,null,null,null,null,"JUNIN JAUJA MASMA CHICCHE",0,"JUNIN","JAUJA","MASMA CHICCHE","C120417"]
[null,null,null,null,null,null,null,null,null,null,null,null,"JUNIN JAUJA MOLINOS",0,"JUNIN","JAUJA","MOLINOS","C120418"]
[null,null,null,null,null,null,null,null,null,null,null,null,"JUNIN JAUJA MONOBAMBA",0,"JUNIN","JAUJA","MONOBAMBA","C120419"]
[null,null,null,null,null,null,null,null,null,null,null,null,"JUNIN JAUJA MUQUI",0,"JUNIN","JAUJA","MUQUI","C120420"]
[null,null,null,null,null,null,null,null,null,null,null,null,"JUNIN JAUJA MUQUIYAUYO",0,"JUNIN","JAUJA","MUQUIYAUYO","C120421"]
[null,null,null,null,null,null,null,null,null,null,null,null,"JUNIN JAUJA PACA",0,"JUNIN","JAUJA","PACA","C120422"]
[null,null,null,null,null,null,null,null,null,null,null,null,"JUNIN JAUJA PACCHA",0,"JUNIN","JAUJA","PACCHA","C120423"]
[null,null,null,null,null,null,null,null,null,null,null,null,"JUNIN JAUJA PANCAN",0,"JUNIN","JAUJA","PANCAN","C120424"]
[null,null,null,null,null,null,null,null,null,null,null,null,"JUNIN JAUJA PARCO",0,"JUNIN","JAUJA","PARCO","C120425"]
[null,null,null,null,null,null,null,null,null,null,null,null,"JUNIN JAUJA POMACANCHA",0,"JUNIN","JAUJA","POMACANCHA","C120426"]
[null,null,null,null,null,null,null,null,null,null,null,null,"JUNIN JAUJA RICRAN",0,"JUNIN","JAUJA","RICRAN","C120427"]
[null,null,null,null,null,null,null,null,null,null,null,null,"JUNIN JAUJA SAN LORENZO",0,"JUNIN","JAUJA","SAN LORENZO","C120428"]
[null,null,null,null,null,null,null,null,null,null,null,null,"JUNIN JAUJA SAN PEDRO DE CHUNAN",0,"JUNIN","JAUJA","SAN PEDRO DE CHUNAN","C120429"]
[null,null,null,null,null,null,null,null,null,null,null,null,"JUNIN JAUJA SAUSA",0,"JUNIN","JAUJA","SAUSA","C120430"]
[null,null,null,null,null,null,null,null,null,null,null,null,"JUNIN JAUJA SINCOS",0,"JUNIN","JAUJA","SINCOS","C120431"]
[null,null,null,null,null,null,null,null,null,null,null,null,"JUNIN JAUJA TUNAN MARCA",0,"JUNIN","JAUJA","TUNAN MARCA","C120432"]
[null,null,null,null,null,null,null,null,null,null,null,null,"JUNIN JAUJA YAULI",0,"JUNIN","JAUJA","YAULI","C120433"]
[null,null,null,null,null,null,null,null,null,null,null,null,"JUNIN JAUJA YAUYOS",0,"JUNIN","JAUJA","YAUYOS","C120434"]
[null,null,null,null,null,null,null,null,null,null,null,null,"JUNIN JUNIN CARHUAMAYO",0,"JUNIN","JUNIN","CARHUAMAYO","C120502"]
[null,null,null,null,null,null,null,null,null,null,null,null,"JUNIN JUNIN JUNIN",0,"JUNIN","JUNIN","JUNIN","C120501"]
[null,null,null,null,null,null,null,null,null,null,null,null,"JUNIN JUNIN ONDORES",0,"JUNIN","JUNIN","ONDORES","C120503"]
[null,null,null,null,null,null,null,null,null,null,null,null,"JUNIN JUNIN ULCUMAYO",0,"JUNIN","JUNIN","ULCUMAYO","C120504"]
[null,null,null,null,null,null,null,null,null,null,null,null,"JUNIN SATIPO COVIRIALI",0,"JUNIN","SATIPO","COVIRIALI","C120602"]
[null,null,null,null,null,null,null,null,null,null,null,null,"JUNIN SATIPO LLAYLLA",0,"JUNIN","SATIPO","LLAYLLA","C120603"]
[null,null,null,null,null,null,null,null,null,null,null,null,"JUNIN SATIPO MAZAMARI",0,"JUNIN","SATIPO","MAZAMARI","C120604"]
[null,null,null,null,null,null,null,null,null,null,null,null,"JUNIN SATIPO PAMPA HERMOSA",0,"JUNIN","SATIPO","PAMPA HERMOSA","C120605"]
[null,null,null,null,null,null,null,null,null,null,null,null,"JUNIN SATIPO PANGOA",0,"JUNIN","SATIPO","PANGOA","C120606"]
[null,null,null,null,null,null,null,null,null,null,null,null,"JUNIN SATIPO RIO NEGRO",0,"JUNIN","SATIPO","RIO NEGRO","C120607"]
[null,null,null,null,null,null,null,null,null,null,null,null,"JUNIN SATIPO RIO TAMBO",0,"JUNIN","SATIPO","RIO TAMBO","C120608"]
[null,null,null,null,null,null,null,null,null,null,null,null,"JUNIN SATIPO SATIPO",0,"JUNIN","SATIPO","SATIPO","C120601"]
[null,null,null,null,null,null,null,null,null,null,null,null,"JUNIN TARMA ACOBAMBA",0,"JUNIN","TARMA","ACOBAMBA","C120702"]
[null,null,null,null,null,null,null,null,null,null,null,null,"JUNIN TARMA HUARICOLCA",0,"JUNIN","TARMA","HUARICOLCA","C120703"]
[null,null,null,null,null,null,null,null,null,null,null,null,"JUNIN TARMA HUASAHUASI",0,"JUNIN","TARMA","HUASAHUASI","C120704"]
[null,null,null,null,null,null,null,null,null,null,null,null,"JUNIN TARMA LA UNION",0,"JUNIN","TARMA","LA UNION","C120705"]
[null,null,null,null,null,null,null,null,null,null,null,null,"JUNIN TARMA PALCA",0,"JUNIN","TARMA","PALCA","C120706"]
[null,null,null,null,null,null,null,null,null,null,null,null,"JUNIN TARMA PALCAMAYO",0,"JUNIN","TARMA","PALCAMAYO","C120707"]
[null,null,null,null,null,null,null,null,null,null,null,null,"JUNIN TARMA SAN PEDRO DE CAJAS",0,"JUNIN","TARMA","SAN PEDRO DE CAJAS","C120708"]
[null,null,null,null,null,null,null,null,null,null,null,null,"JUNIN TARMA TAPO",0,"JUNIN","TARMA","TAPO","C120709"]
[null,null,null,null,null,null,null,null,null,null,null,null,"JUNIN TARMA TARMA",0,"JUNIN","TARMA","TARMA","C120701"]
[null,null,null,null,null,null,null,null,null,null,null,null,"JUNIN YAULI CHACAPALPA",0,"JUNIN","YAULI","CHACAPALPA","C120802"]
[null,null,null,null,null,null,null,null,null,null,null,null,"JUNIN YAULI HUAY-HUAY",0,"JUNIN","YAULI","HUAY-HUAY","C120803"]
[null,null,null,null,null,null,null,null,null,null,null,null,"JUNIN YAULI LA OROYA",0,"JUNIN","YAULI","LA OROYA","C120801"]
[null,null,null,null,null,null,null,null,null,null,null,null,"JUNIN YAULI MARCAPOMACOCHA",0,"JUNIN","YAULI","MARCAPOMACOCHA","C120804"]
[null,null,null,null,null,null,null,null,null,null,null,null,"JUNIN YAULI MOROCOCHA",0,"JUNIN","YAULI","MOROCOCHA","C120805"]
[null,null,null,null,null,null,null,null,null,null,null,null,"JUNIN YAULI PACCHA",0,"JUNIN","YAULI","PACCHA","C120806"]
[null,null,null,null,null,null,null,null,null,null,null,null,"JUNIN YAULI SANTA BARBARA DE CARHUACAYAN",0,"JUNIN","YAULI","SANTA BARBARA DE CARHUACAYAN","C120807"]
[null,null,null,null,null,null,null,null,null,null,null,null,"JUNIN YAULI SANTA ROSA DE SACCO",0,"JUNIN","YAULI","SANTA ROSA DE SACCO","C120808"]
[null,null,null,null,null,null,null,null,null,null,null,null,"JUNIN YAULI SUITUCANCHA",0,"JUNIN","YAULI","SUITUCANCHA","C120809"]
[null,null,null,null,null,null,null,null,null,null,null,null,"JUNIN YAULI YAULI",0,"JUNIN","YAULI","YAULI","C120810"]
[null,null,null,null,null,null,null,null,null,null,null,null,"LA LIBERTAD ASCOPE ASCOPE",0,"LA LIBERTAD","ASCOPE","ASCOPE","C130201"]
[null,null,null,null,null,null,null,null,null,null,null,null,"LA LIBERTAD ASCOPE CASA GRANDE",0,"LA LIBERTAD","ASCOPE","CASA GRANDE","C130208"]
[null,null,null,null,null,null,null,null,null,null,null,null,"LA LIBERTAD ASCOPE CHICAMA",0,"LA LIBERTAD","ASCOPE","CHICAMA","C130202"]
[null,null,null,null,null,null,null,null,null,null,null,null,"LA LIBERTAD ASCOPE CHOCOPE",0,"LA LIBERTAD","ASCOPE","CHOCOPE","C130203"]
[null,null,null,null,null,null,null,null,null,null,null,null,{"$f":"O1155&\" \"&P1155&\" \"&Q1155","v":"LA LIBERTAD ASCOPE MAGDALENA DE CAO"},{"$f":"IF(AND($D$9=O1155,$D$10=P1155),N1154+1,0)","v":0},"LA LIBERTAD","ASCOPE","MAGDALENA DE CAO","C130204"]
[null,null,null,null,null,null,null,null,null,null,null,null,"LA LIBERTAD ASCOPE PAIJAN",0,"LA LIBERTAD","ASCOPE","PAIJAN","C130205"]
[null,null,null,null,null,null,null,null,null,null,null,null,"LA LIBERTAD ASCOPE RAZURI",0,"LA LIBERTAD","ASCOPE","RAZURI","C130206"]
[null,null,null,null,null,null,null,null,null,null,null,null,"LA LIBERTAD ASCOPE SANTIAGO DE CAO",0,"LA LIBERTAD","ASCOPE","SANTIAGO DE CAO","C130207"]
[null,null,null,null,null,null,null,null,null,null,null,null,"LA LIBERTAD BOLIVAR BAMBAMARCA",0,"LA LIBERTAD","BOLIVAR","BAMBAMARCA","C130302"]
[null,null,null,null,null,null,null,null,null,null,null,null,"LA LIBERTAD BOLIVAR BOLIVAR",0,"LA LIBERTAD","BOLIVAR","BOLIVAR","C130301"]
[null,null,null,null,null,null,null,null,null,null,null,null,"LA LIBERTAD BOLIVAR CONDORMARCA",0,"LA LIBERTAD","BOLIVAR","CONDORMARCA","C130303"]
[null,null,null,null,null,null,null,null,null,null,null,null,"LA LIBERTAD BOLIVAR LONGOTEA",0,"LA LIBERTAD","BOLIVAR","LONGOTEA","C130304"]
[null,null,null,null,null,null,null,null,null,null,null,null,"LA LIBERTAD BOLIVAR UCHUMARCA",0,"LA LIBERTAD","BOLIVAR","UCHUMARCA","C130305"]
[null,null,null,null,null,null,null,null,null,null,null,null,"LA LIBERTAD BOLIVAR UCUNCHA",0,"LA LIBERTAD","BOLIVAR","UCUNCHA","C130306"]
[null,null,null,null,null,null,null,null,null,null,null,null,"LA LIBERTAD CHEPEN CHEPEN",0,"LA LIBERTAD","CHEPEN","CHEPEN","C130401"]
[null,null,null,null,null,null,null,null,null,null,null,null,"LA LIBERTAD CHEPEN PACANGA",0,"LA LIBERTAD","CHEPEN","PACANGA","C130402"]
[null,null,null,null,null,null,null,null,null,null,null,null,"LA LIBERTAD CHEPEN PUEBLO NUEVO",0,"LA LIBERTAD","CHEPEN","PUEBLO NUEVO","C130403"]
[null,null,null,null,null,null,null,null,null,null,null,null,"LA LIBERTAD GRAN CHIMU CASCAS",0,"LA LIBERTAD","GRAN CHIMU","CASCAS","C131101"]
[null,null,null,null,null,null,null,null,null,null,null,null,"LA LIBERTAD GRAN CHIMU LUCMA",0,"LA LIBERTAD","GRAN CHIMU","LUCMA","C131102"]
[null,null,null,null,null,null,null,null,null,null,null,null,"LA LIBERTAD GRAN CHIMU MARMOT",0,"LA LIBERTAD","GRAN CHIMU","MARMOT","C131103"]
[null,null,null,null,null,null,null,null,null,null,null,null,"LA LIBERTAD GRAN CHIMU SAYAPULLO",0,"LA LIBERTAD","GRAN CHIMU","SAYAPULLO","C131104"]
[null,null,null,null,null,null,null,null,null,null,null,null,"LA LIBERTAD JULCAN CALAMARCA",0,"LA LIBERTAD","JULCAN","CALAMARCA","C130502"]
[null,null,null,null,null,null,null,null,null,null,null,null,"LA LIBERTAD JULCAN CARABAMBA",0,"LA LIBERTAD","JULCAN","CARABAMBA","C130503"]
[null,null,null,null,null,null,null,null,null,null,null,null,"LA LIBERTAD JULCAN HUASO",0,"LA LIBERTAD","JULCAN","HUASO","C130504"]
[null,null,null,null,null,null,null,null,null,null,null,null,"LA LIBERTAD JULCAN JULCAN",0,"LA LIBERTAD","JULCAN","JULCAN","C130501"]
[null,null,null,null,null,null,null,null,null,null,null,null,"LA LIBERTAD OTUZCO AGALLPAMPA",0,"LA LIBERTAD","OTUZCO","AGALLPAMPA","C130602"]
[null,null,null,null,null,null,null,null,null,null,null,null,"LA LIBERTAD OTUZCO CHARAT",0,"LA LIBERTAD","OTUZCO","CHARAT","C130604"]
[null,null,null,null,null,null,null,null,null,null,null,null,"LA LIBERTAD OTUZCO HUARANCHAL",0,"LA LIBERTAD","OTUZCO","HUARANCHAL","C130605"]
[null,null,null,null,null,null,null,null,null,null,null,null,"LA LIBERTAD OTUZCO LA CUESTA",0,"LA LIBERTAD","OTUZCO","LA CUESTA","C130606"]
[null,null,null,null,null,null,null,null,null,null,null,null,"LA LIBERTAD OTUZCO MACHE",0,"LA LIBERTAD","OTUZCO","MACHE","C130608"]
[null,null,null,null,null,null,null,null,null,null,null,null,"LA LIBERTAD OTUZCO OTUZCO",0,"LA LIBERTAD","OTUZCO","OTUZCO","C130601"]
[null,null,null,null,null,null,null,null,null,null,null,null,"LA LIBERTAD OTUZCO PARANDAY",0,"LA LIBERTAD","OTUZCO","PARANDAY","C130610"]
[null,null,null,null,null,null,null,null,null,null,null,null,"LA LIBERTAD OTUZCO SALPO",0,"LA LIBERTAD","OTUZCO","SALPO","C130611"]
[null,null,null,null,null,null,null,null,null,null,null,null,"LA LIBERTAD OTUZCO SINSICAP",0,"LA LIBERTAD","OTUZCO","SINSICAP","C130613"]
[null,null,null,null,null,null,null,null,null,null,null,null,"LA LIBERTAD OTUZCO USQUIL",0,"LA LIBERTAD","OTUZCO","USQUIL","C130614"]
[null,null,null,null,null,null,null,null,null,null,null,null,"LA LIBERTAD PACASMAYO GUADALUPE",0,"LA LIBERTAD","PACASMAYO","GUADALUPE","C130702"]
[null,null,null,null,null,null,null,null,null,null,null,null,"LA LIBERTAD PACASMAYO JEQUETEPEQUE",0,"LA LIBERTAD","PACASMAYO","JEQUETEPEQUE","C130703"]
[null,null,null,null,null,null,null,null,null,null,null,null,"LA LIBERTAD PACASMAYO PACASMAYO",0,"LA LIBERTAD","PACASMAYO","PACASMAYO","C130704"]
[null,null,null,null,null,null,null,null,null,null,null,null,"LA LIBERTAD PACASMAYO SAN JOSE",0,"LA LIBERTAD","PACASMAYO","SAN JOSE","C130705"]
[null,null,null,null,null,null,null,null,null,null,null,null,"LA LIBERTAD PACASMAYO SAN PEDRO DE LLOC",0,"LA LIBERTAD","PACASMAYO","SAN PEDRO DE LLOC","C130701"]
[null,null,null,null,null,null,null,null,null,null,null,null,"LA LIBERTAD PATAZ BULDIBUYO",0,"LA LIBERTAD","PATAZ","BULDIBUYO","C130802"]
[null,null,null,null,null,null,null,null,null,null,null,null,"LA LIBERTAD PATAZ CHILLIA",0,"LA LIBERTAD","PATAZ","CHILLIA","C130803"]
[null,null,null,null,null,null,null,null,null,null,null,null,"LA LIBERTAD PATAZ HUANCASPATA",0,"LA LIBERTAD","PATAZ","HUANCASPATA","C130804"]
[null,null,null,null,null,null,null,null,null,null,null,null,"LA LIBERTAD PATAZ HUAYLILLAS",0,"LA LIBERTAD","PATAZ","HUAYLILLAS","C130805"]
[null,null,null,null,null,null,null,null,null,null,null,null,"LA LIBERTAD PATAZ HUAYO",0,"LA LIBERTAD","PATAZ","HUAYO","C130806"]
[null,null,null,null,null,null,null,null,null,null,null,null,"LA LIBERTAD PATAZ ONGON",0,"LA LIBERTAD","PATAZ","ONGON","C130807"]
[null,null,null,null,null,null,null,null,null,null,null,null,"LA LIBERTAD PATAZ PARCOY",0,"LA LIBERTAD","PATAZ","PARCOY","C130808"]
[null,null,null,null,null,null,null,null,null,null,null,null,"LA LIBERTAD PATAZ PATAZ",0,"LA LIBERTAD","PATAZ","PATAZ","C130809"]
[null,null,null,null,null,null,null,null,null,null,null,null,"LA LIBERTAD PATAZ PIAS",0,"LA LIBERTAD","PATAZ","PIAS","C130810"]
[null,null,null,null,null,null,null,null,null,null,null,null,"LA LIBERTAD PATAZ SANTIAGO DE CHALLAS",0,"LA LIBERTAD","PATAZ","SANTIAGO DE CHALLAS","C130811"]
[null,null,null,null,null,null,null,null,null,null,null,null,"LA LIBERTAD PATAZ TAURIJA",0,"LA LIBERTAD","PATAZ","TAURIJA","C130812"]
[null,null,null,null,null,null,null,null,null,null,null,null,"LA LIBERTAD PATAZ TAYABAMBA",0,"LA LIBERTAD","PATAZ","TAYABAMBA","C130801"]
[null,null,null,null,null,null,null,null,null,null,null,null,"LA LIBERTAD PATAZ URPAY",0,"LA LIBERTAD","PATAZ","URPAY","C130813"]
[null,null,null,null,null,null,null,null,null,null,null,null,"LA LIBERTAD SANCHEZ CARRION CHUGAY",0,"LA LIBERTAD","SANCHEZ CARRION","CHUGAY","C130902"]
[null,null,null,null,null,null,null,null,null,null,null,null,"LA LIBERTAD SANCHEZ CARRION COCHORCO",0,"LA LIBERTAD","SANCHEZ CARRION","COCHORCO","C130903"]
[null,null,null,null,null,null,null,null,null,null,null,null,"LA LIBERTAD SANCHEZ CARRION CURGOS",0,"LA LIBERTAD","SANCHEZ CARRION","CURGOS","C130904"]
[null,null,null,null,null,null,null,null,null,null,null,null,"LA LIBERTAD SANCHEZ CARRION HUAMACHUCO",0,"LA LIBERTAD","SANCHEZ CARRION","HUAMACHUCO","C130901"]
[null,null,null,null,null,null,null,null,null,null,null,null,"LA LIBERTAD SANCHEZ CARRION MARCABAL",0,"LA LIBERTAD","SANCHEZ CARRION","MARCABAL","C130905"]
[null,null,null,null,null,null,null,null,null,null,null,null,"LA LIBERTAD SANCHEZ CARRION SANAGORAN",0,"LA LIBERTAD","SANCHEZ CARRION","SANAGORAN","C130906"]
[null,null,null,null,null,null,null,null,null,null,null,null,"LA LIBERTAD SANCHEZ CARRION SARIN",0,"LA LIBERTAD","SANCHEZ CARRION","SARIN","C130907"]
[null,null,null,null,null,null,null,null,null,null,null,null,"LA LIBERTAD SANCHEZ CARRION SARTIMBAMBA",0,"LA LIBERTAD","SANCHEZ CARRION","SARTIMBAMBA","C130908"]
[null,null,null,null,null,null,null,null,null,null,null,null,"LA LIBERTAD SANTIAGO DE CHUCO ANGASMARCA",0,"LA LIBERTAD","SANTIAGO DE CHUCO","ANGASMARCA","C131002"]
[null,null,null,null,null,null,null,null,null,null,null,null,"LA LIBERTAD SANTIAGO DE CHUCO CACHICADAN",0,"LA LIBERTAD","SANTIAGO DE CHUCO","CACHICADAN","C131003"]
[null,null,null,null,null,null,null,null,null,null,null,null,"LA LIBERTAD SANTIAGO DE CHUCO MOLLEBAMBA",0,"LA LIBERTAD","SANTIAGO DE CHUCO","MOLLEBAMBA","C131004"]
[null,null,null,null,null,null,null,null,null,null,null,null,"LA LIBERTAD SANTIAGO DE CHUCO MOLLEPATA",0,"LA LIBERTAD","SANTIAGO DE CHUCO","MOLLEPATA","C131005"]
[null,null,null,null,null,null,null,null,null,null,null,null,"LA LIBERTAD SANTIAGO DE CHUCO QUIRUVILCA",0,"LA LIBERTAD","SANTIAGO DE CHUCO","QUIRUVILCA","C131006"]
[null,null,null,null,null,null,null,null,null,null,null,null,"LA LIBERTAD SANTIAGO DE CHUCO SANTA CRUZ DE CHUCA",0,"LA LIBERTAD","SANTIAGO DE CHUCO","SANTA CRUZ DE CHUCA","C131007"]
[null,null,null,null,null,null,null,null,null,null,null,null,"LA LIBERTAD SANTIAGO DE CHUCO SANTIAGO DE CHUCO",0,"LA LIBERTAD","SANTIAGO DE CHUCO","SANTIAGO DE CHUCO","C131001"]
[null,null,null,null,null,null,null,null,null,null,null,null,{"$f":"O1219&\" \"&P1219&\" \"&Q1219","v":"LA LIBERTAD SANTIAGO DE CHUCO SITABAMBA"},{"$f":"IF(AND($D$9=O1219,$D$10=P1219),N1218+1,0)","v":0},"LA LIBERTAD","SANTIAGO DE CHUCO","SITABAMBA","C131008"]
[null,null,null,null,null,null,null,null,null,null,null,null,"LA LIBERTAD TRUJILLO EL PORVENIR",0,"LA LIBERTAD","TRUJILLO","EL PORVENIR","C130102"]
[null,null,null,null,null,null,null,null,null,null,null,null,"LA LIBERTAD TRUJILLO FLORENCIA DE MORA",0,"LA LIBERTAD","TRUJILLO","FLORENCIA DE MORA","C130103"]
[null,null,null,null,null,null,null,null,null,null,null,null,"LA LIBERTAD TRUJILLO HUANCHACO",0,"LA LIBERTAD","TRUJILLO","HUANCHACO","C130104"]
[null,null,null,null,null,null,null,null,null,null,null,null,"LA LIBERTAD TRUJILLO LA ESPERANZA",0,"LA LIBERTAD","TRUJILLO","LA ESPERANZA","C130105"]
[null,null,null,null,null,null,null,null,null,null,null,null,"LA LIBERTAD TRUJILLO LAREDO",0,"LA LIBERTAD","TRUJILLO","LAREDO","C130106"]
[null,null,null,null,null,null,null,null,null,null,null,null,"LA LIBERTAD TRUJILLO MOCHE",0,"LA LIBERTAD","TRUJILLO","MOCHE","C130107"]
[null,null,null,null,null,null,null,null,null,null,null,null,"LA LIBERTAD TRUJILLO POROTO",0,"LA LIBERTAD","TRUJILLO","POROTO","C130108"]
[null,null,null,null,null,null,null,null,null,null,null,null,"LA LIBERTAD TRUJILLO SALAVERRY",0,"LA LIBERTAD","TRUJILLO","SALAVERRY","C130109"]
[null,null,null,null,null,null,null,null,null,null,null,null,"LA LIBERTAD TRUJILLO SIMBAL",0,"LA LIBERTAD","TRUJILLO","SIMBAL","C130110"]
[null,null,null,null,null,null,null,null,null,null,null,null,"LA LIBERTAD TRUJILLO TRUJILLO",0,"LA LIBERTAD","TRUJILLO","TRUJILLO","C130101"]
[null,null,null,null,null,null,null,null,null,null,null,null,"LA LIBERTAD TRUJILLO VICTOR LARCO HERRERA",0,"LA LIBERTAD","TRUJILLO","VICTOR LARCO HERRERA","C130111"]
[null,null,null,null,null,null,null,null,null,null,null,null,"LA LIBERTAD VIRU CHAO",0,"LA LIBERTAD","VIRU","CHAO","C131202"]
[null,null,null,null,null,null,null,null,null,null,null,null,"LA LIBERTAD VIRU GUADALUPITO",0,"LA LIBERTAD","VIRU","GUADALUPITO","C131203"]
[null,null,null,null,null,null,null,null,null,null,null,null,"LA LIBERTAD VIRU VIRU",0,"LA LIBERTAD","VIRU","VIRU","C131201"]
[null,null,null,null,null,null,null,null,null,null,null,null,"LAMBAYEQUE CHICLAYO CAYALTI",0,"LAMBAYEQUE","CHICLAYO","CAYALTI","C140116"]
[null,null,null,null,null,null,null,null,null,null,null,null,"LAMBAYEQUE CHICLAYO CHICLAYO",0,"LAMBAYEQUE","CHICLAYO","CHICLAYO","C140101"]
[null,null,null,null,null,null,null,null,null,null,null,null,"LAMBAYEQUE CHICLAYO CHONGOYAPE",0,"LAMBAYEQUE","CHICLAYO","CHONGOYAPE","C140102"]
[null,null,null,null,null,null,null,null,null,null,null,null,"LAMBAYEQUE CHICLAYO ETEN",0,"LAMBAYEQUE","CHICLAYO","ETEN","C140103"]
[null,null,null,null,null,null,null,null,null,null,null,null,"LAMBAYEQUE CHICLAYO ETEN PUERTO",0,"LAMBAYEQUE","CHICLAYO","ETEN PUERTO","C140104"]
[null,null,null,null,null,null,null,null,null,null,null,null,"LAMBAYEQUE CHICLAYO JOSE LEONARDO ORTIZ",0,"LAMBAYEQUE","CHICLAYO","JOSE LEONARDO ORTIZ","C140105"]
[null,null,null,null,null,null,null,null,null,null,null,null,"LAMBAYEQUE CHICLAYO LA VICTORIA",0,"LAMBAYEQUE","CHICLAYO","LA VICTORIA","C140106"]
[null,null,null,null,null,null,null,null,null,null,null,null,"LAMBAYEQUE CHICLAYO LAGUNAS",0,"LAMBAYEQUE","CHICLAYO","LAGUNAS","C140107"]
[null,null,null,null,null,null,null,null,null,null,null,null,"LAMBAYEQUE CHICLAYO MONSEFU",0,"LAMBAYEQUE","CHICLAYO","MONSEFU","C140108"]
[null,null,null,null,null,null,null,null,null,null,null,null,"LAMBAYEQUE CHICLAYO NUEVA ARICA",0,"LAMBAYEQUE","CHICLAYO","NUEVA ARICA","C140109"]
[null,null,null,null,null,null,null,null,null,null,null,null,"LAMBAYEQUE CHICLAYO OYOTUN",0,"LAMBAYEQUE","CHICLAYO","OYOTUN","C140110"]
[null,null,null,null,null,null,null,null,null,null,null,null,"LAMBAYEQUE CHICLAYO PATAPO",0,"LAMBAYEQUE","CHICLAYO","PATAPO","C140117"]
[null,null,null,null,null,null,null,null,null,null,null,null,"LAMBAYEQUE CHICLAYO PICSI",0,"LAMBAYEQUE","CHICLAYO","PICSI","C140111"]
[null,null,null,null,null,null,null,null,null,null,null,null,"LAMBAYEQUE CHICLAYO PIMENTEL",0,"LAMBAYEQUE","CHICLAYO","PIMENTEL","C140112"]
[null,null,null,null,null,null,null,null,null,null,null,null,"LAMBAYEQUE CHICLAYO POMALCA",0,"LAMBAYEQUE","CHICLAYO","POMALCA","C140118"]
[null,null,null,null,null,null,null,null,null,null,null,null,"LAMBAYEQUE CHICLAYO PUCALA",0,"LAMBAYEQUE","CHICLAYO","PUCALA","C140119"]
[null,null,null,null,null,null,null,null,null,null,null,null,"LAMBAYEQUE CHICLAYO REQUE",0,"LAMBAYEQUE","CHICLAYO","REQUE","C140113"]
[null,null,null,null,null,null,null,null,null,null,null,null,"LAMBAYEQUE CHICLAYO SANTA ROSA",0,"LAMBAYEQUE","CHICLAYO","SANTA ROSA","C140114"]
[null,null,null,null,null,null,null,null,null,null,null,null,"LAMBAYEQUE CHICLAYO SAÑA",0,"LAMBAYEQUE","CHICLAYO","SAÑA","C140114"]
[null,null,null,null,null,null,null,null,null,null,null,null,"LAMBAYEQUE CHICLAYO TUMAN",0,"LAMBAYEQUE","CHICLAYO","TUMAN","C140120"]
[null,null,null,null,null,null,null,null,null,null,null,null,"LAMBAYEQUE FERREÑAFE CAÑARIS",0,"LAMBAYEQUE","FERREÑAFE","CAÑARIS","C140202"]
[null,null,null,null,null,null,null,null,null,null,null,null,"LAMBAYEQUE FERREÑAFE FERREÑAFE",0,"LAMBAYEQUE","FERREÑAFE","FERREÑAFE","C140201"]
[null,null,null,null,null,null,null,null,null,null,null,null,"LAMBAYEQUE FERREÑAFE INCAHUASI",0,"LAMBAYEQUE","FERREÑAFE","INCAHUASI","C140203"]
[null,null,null,null,null,null,null,null,null,null,null,null,"LAMBAYEQUE FERREÑAFE MANUEL ANTONIO MESONES MURO",0,"LAMBAYEQUE","FERREÑAFE","MANUEL ANTONIO MESONES MURO","C140204"]
[null,null,null,null,null,null,null,null,null,null,null,null,"LAMBAYEQUE FERREÑAFE PITIPO",0,"LAMBAYEQUE","FERREÑAFE","PITIPO","C140205"]
[null,null,null,null,null,null,null,null,null,null,null,null,"LAMBAYEQUE FERREÑAFE PUEBLO NUEVO",0,"LAMBAYEQUE","FERREÑAFE","PUEBLO NUEVO","C140206"]
[null,null,null,null,null,null,null,null,null,null,null,null,"LAMBAYEQUE LAMBAYEQUE CHOCHOPE",0,"LAMBAYEQUE","LAMBAYEQUE","CHOCHOPE","C140302"]
[null,null,null,null,null,null,null,null,null,null,null,null,"LAMBAYEQUE LAMBAYEQUE ILLIMO",0,"LAMBAYEQUE","LAMBAYEQUE","ILLIMO","C140303"]
[null,null,null,null,null,null,null,null,null,null,null,null,"LAMBAYEQUE LAMBAYEQUE JAYANCA",0,"LAMBAYEQUE","LAMBAYEQUE","JAYANCA","C140304"]
[null,null,null,null,null,null,null,null,null,null,null,null,"LAMBAYEQUE LAMBAYEQUE LAMBAYEQUE",0,"LAMBAYEQUE","LAMBAYEQUE","LAMBAYEQUE","C140301"]
[null,null,null,null,null,null,null,null,null,null,null,null,"LAMBAYEQUE LAMBAYEQUE MOCHUMI",0,"LAMBAYEQUE","LAMBAYEQUE","MOCHUMI","C140305"]
[null,null,null,null,null,null,null,null,null,null,null,null,"LAMBAYEQUE LAMBAYEQUE MORROPE",0,"LAMBAYEQUE","LAMBAYEQUE","MORROPE","C140306"]
[null,null,null,null,null,null,null,null,null,null,null,null,"LAMBAYEQUE LAMBAYEQUE MOTUPE",0,"LAMBAYEQUE","LAMBAYEQUE","MOTUPE","C140307"]
[null,null,null,null,null,null,null,null,null,null,null,null,"LAMBAYEQUE LAMBAYEQUE OLMOS",0,"LAMBAYEQUE","LAMBAYEQUE","OLMOS","C140308"]
[null,null,null,null,null,null,null,null,null,null,null,null,"LAMBAYEQUE LAMBAYEQUE PACORA",0,"LAMBAYEQUE","LAMBAYEQUE","PACORA","C140309"]
[null,null,null,null,null,null,null,null,null,null,null,null,"LAMBAYEQUE LAMBAYEQUE SALAS",0,"LAMBAYEQUE","LAMBAYEQUE","SALAS","C140310"]
[null,null,null,null,null,null,null,null,null,null,null,null,"LAMBAYEQUE LAMBAYEQUE SAN JOSE",0,"LAMBAYEQUE","LAMBAYEQUE","SAN JOSE","C140311"]
[null,null,null,null,null,null,null,null,null,null,null,null,"LAMBAYEQUE LAMBAYEQUE TUCUME",0,"LAMBAYEQUE","LAMBAYEQUE","TUCUME","C140312"]
[null,null,null,null,null,null,null,null,null,null,null,null,"LIMA BARRANCA BARRANCA",0,"LIMA","BARRANCA","BARRANCA","C150201"]
[null,null,null,null,null,null,null,null,null,null,null,null,"LIMA BARRANCA PARAMONGA",0,"LIMA","BARRANCA","PARAMONGA","C150202"]
[null,null,null,null,null,null,null,null,null,null,null,null,"LIMA BARRANCA PATIVILCA",0,"LIMA","BARRANCA","PATIVILCA","C150203"]
[null,null,null,null,null,null,null,null,null,null,null,null,"LIMA BARRANCA SUPE",0,"LIMA","BARRANCA","SUPE","C150204"]
[null,null,null,null,null,null,null,null,null,null,null,null,"LIMA BARRANCA SUPE PUERTO",0,"LIMA","BARRANCA","SUPE PUERTO","C150205"]
[null,null,null,null,null,null,null,null,null,null,null,null,"LIMA CAJATAMBO CAJATAMBO",0,"LIMA","CAJATAMBO","CAJATAMBO","C150205"]
[null,null,null,null,null,null,null,null,null,null,null,null,"LIMA CAJATAMBO COPA",0,"LIMA","CAJATAMBO","COPA","C150205"]
[null,null,null,null,null,null,null,null,null,null,null,null,"LIMA CAJATAMBO GORGOR",0,"LIMA","CAJATAMBO","GORGOR","C150205"]
[null,null,null,null,null,null,null,null,null,null,null,null,"LIMA CAJATAMBO HUANCAPON",0,"LIMA","CAJATAMBO","HUANCAPON","C150205"]
[null,null,null,null,null,null,null,null,null,null,null,null,"LIMA CAJATAMBO MANAS",0,"LIMA","CAJATAMBO","MANAS","C150205"]
[null,null,null,null,null,null,null,null,null,null,null,null,"LIMA CANTA ARAHUAY",0,"LIMA","CANTA","ARAHUAY","C150205"]
[null,null,null,null,null,null,null,null,null,null,null,null,{"$f":"O1283&\" \"&P1283&\" \"&Q1283","v":"LIMA CANTA CANTA"},{"$f":"IF(AND($D$9=O1283,$D$10=P1283),N1282+1,0)","v":0},"LIMA","CANTA","CANTA","C150205"]
[null,null,null,null,null,null,null,null,null,null,null,null,"LIMA CANTA HUAMANTANGA",0,"LIMA","CANTA","HUAMANTANGA","C150205"]
[null,null,null,null,null,null,null,null,null,null,null,null,"LIMA CANTA HUAROS",0,"LIMA","CANTA","HUAROS","C150205"]
[null,null,null,null,null,null,null,null,null,null,null,null,"LIMA CANTA LACHAQUI",0,"LIMA","CANTA","LACHAQUI","C150205"]
[null,null,null,null,null,null,null,null,null,null,null,null,"LIMA CANTA SAN BUENAVENTURA",0,"LIMA","CANTA","SAN BUENAVENTURA","C150205"]
[null,null,null,null,null,null,null,null,null,null,null,null,"LIMA CANTA SANTA ROSA DE QUIVES",0,"LIMA","CANTA","SANTA ROSA DE QUIVES","C150205"]
[null,null,null,null,null,null,null,null,null,null,null,null,"LIMA CAÑETE ASIA",0,"LIMA","CAÑETE","ASIA","C150502"]
[null,null,null,null,null,null,null,null,null,null,null,null,"LIMA CAÑETE CALANGO",0,"LIMA","CAÑETE","CALANGO","C150503"]
[null,null,null,null,null,null,null,null,null,null,null,null,"LIMA CAÑETE CERRO AZUL",0,"LIMA","CAÑETE","CERRO AZUL","C150504"]
[null,null,null,null,null,null,null,null,null,null,null,null,"LIMA CAÑETE CHILCA",0,"LIMA","CAÑETE","CHILCA","C150505"]
[null,null,null,null,null,null,null,null,null,null,null,null,"LIMA CAÑETE COAYLLO",0,"LIMA","CAÑETE","COAYLLO","C150407"]
[null,null,null,null,null,null,null,null,null,null,null,null,"LIMA CAÑETE IMPERIAL",0,"LIMA","CAÑETE","IMPERIAL","C150407"]
[null,null,null,null,null,null,null,null,null,null,null,null,"LIMA CAÑETE LUNAHUANA",0,"LIMA","CAÑETE","LUNAHUANA","C150407"]
[null,null,null,null,null,null,null,null,null,null,null,null,"LIMA CAÑETE MALA",0,"LIMA","CAÑETE","MALA","C150407"]
[null,null,null,null,null,null,null,null,null,null,null,null,"LIMA CAÑETE NUEVO IMPERIAL",0,"LIMA","CAÑETE","NUEVO IMPERIAL","C150407"]
[null,null,null,null,null,null,null,null,null,null,null,null,"LIMA CAÑETE PACARAN",0,"LIMA","CAÑETE","PACARAN","C150407"]
[null,null,null,null,null,null,null,null,null,null,null,null,"LIMA CAÑETE QUILMANA",0,"LIMA","CAÑETE","QUILMANA","C150407"]
[null,null,null,null,null,null,null,null,null,null,null,null,"LIMA CAÑETE SAN ANTONIO",0,"LIMA","CAÑETE","SAN ANTONIO","C150407"]
[null,null,null,null,null,null,null,null,null,null,null,null,"LIMA CAÑETE SAN LUIS",0,"LIMA","CAÑETE","SAN LUIS","C150407"]
[null,null,null,null,null,null,null,null,null,null,null,null,"LIMA CAÑETE SAN VICENTE DE CAÑETE",0,"LIMA","CAÑETE","SAN VICENTE DE CAÑETE","C150407"]
[null,null,null,null,null,null,null,null,null,null,null,null,"LIMA CAÑETE SANTA CRUZ DE FLORES",0,"LIMA","CAÑETE","SANTA CRUZ DE FLORES","C150407"]
[null,null,null,null,null,null,null,null,null,null,null,null,"LIMA CAÑETE ZUÑIGA",0,"LIMA","CAÑETE","ZUÑIGA","C150407"]
[null,null,null,null,null,null,null,null,null,null,null,null,"LIMA HUARAL ATAVILLOS ALTO",0,"LIMA","HUARAL","ATAVILLOS ALTO","C150602"]
[null,null,null,null,null,null,null,null,null,null,null,null,"LIMA HUARAL ATAVILLOS BAJO",0,"LIMA","HUARAL","ATAVILLOS BAJO","C150603"]
[null,null,null,null,null,null,null,null,null,null,null,null,"LIMA HUARAL AUCALLAMA",0,"LIMA","HUARAL","AUCALLAMA","C150604"]
[null,null,null,null,null,null,null,null,null,null,null,null,"LIMA HUARAL CHANCAY",0,"LIMA","HUARAL","CHANCAY","C150605"]
[null,null,null,null,null,null,null,null,null,null,null,null,"LIMA HUARAL HUARAL",0,"LIMA","HUARAL","HUARAL","C150601"]
[null,null,null,null,null,null,null,null,null,null,null,null,"LIMA HUARAL IHUARI",0,"LIMA","HUARAL","IHUARI","C150606"]
[null,null,null,null,null,null,null,null,null,null,null,null,"LIMA HUARAL LAMPIAN",0,"LIMA","HUARAL","LAMPIAN","C150607"]
[null,null,null,null,null,null,null,null,null,null,null,null,"LIMA HUARAL PACARAOS",0,"LIMA","HUARAL","PACARAOS","C150608"]
[null,null,null,null,null,null,null,null,null,null,null,null,"LIMA HUARAL SAN MIGUEL DE ACOS",0,"LIMA","HUARAL","SAN MIGUEL DE ACOS","C150609"]
[null,null,null,null,null,null,null,null,null,null,null,null,"LIMA HUARAL SANTA CRUZ DE ANDAMARCA",0,"LIMA","HUARAL","SANTA CRUZ DE ANDAMARCA","C150610"]
[null,null,null,null,null,null,null,null,null,null,null,null,"LIMA HUARAL SUMBILCA",0,"LIMA","HUARAL","SUMBILCA","C150611"]
[null,null,null,null,null,null,null,null,null,null,null,null,"LIMA HUARAL VEINTISIETE DE NOVIEMBRE",0,"LIMA","HUARAL","VEINTISIETE DE NOVIEMBRE","C150612"]
[null,null,null,null,null,null,null,null,null,null,null,null,"LIMA HUAROCHIRI ANTIOQUIA",0,"LIMA","HUAROCHIRI","ANTIOQUIA","C150702"]
[null,null,null,null,null,null,null,null,null,null,null,null,"LIMA HUAROCHIRI CALLAHUANCA",0,"LIMA","HUAROCHIRI","CALLAHUANCA","C150703"]
[null,null,null,null,null,null,null,null,null,null,null,null,"LIMA HUAROCHIRI CARAMPOMA",0,"LIMA","HUAROCHIRI","CARAMPOMA","C150704"]
[null,null,null,null,null,null,null,null,null,null,null,null,"LIMA HUAROCHIRI CHICLA",0,"LIMA","HUAROCHIRI","CHICLA","C150705"]
[null,null,null,null,null,null,null,null,null,null,null,null,"LIMA HUAROCHIRI CUENCA",0,"LIMA","HUAROCHIRI","CUENCA","C150706"]
[null,null,null,null,null,null,null,null,null,null,null,null,"LIMA HUAROCHIRI HUACHUPAMPA",0,"LIMA","HUAROCHIRI","HUACHUPAMPA","C150707"]
[null,null,null,null,null,null,null,null,null,null,null,null,"LIMA HUAROCHIRI HUANZA",0,"LIMA","HUAROCHIRI","HUANZA","C150708"]
[null,null,null,null,null,null,null,null,null,null,null,null,"LIMA HUAROCHIRI HUAROCHIRI",0,"LIMA","HUAROCHIRI","HUAROCHIRI","C150709"]
[null,null,null,null,null,null,null,null,null,null,null,null,"LIMA HUAROCHIRI LAHUAYTAMBO",0,"LIMA","HUAROCHIRI","LAHUAYTAMBO","C150710"]
[null,null,null,null,null,null,null,null,null,null,null,null,"LIMA HUAROCHIRI LANGA",0,"LIMA","HUAROCHIRI","LANGA","C150711"]
[null,null,null,null,null,null,null,null,null,null,null,null,"LIMA HUAROCHIRI LARAOS",0,"LIMA","HUAROCHIRI","LARAOS","C150712"]
[null,null,null,null,null,null,null,null,null,null,null,null,"LIMA HUAROCHIRI MARIATANA",0,"LIMA","HUAROCHIRI","MARIATANA","C150713"]
[null,null,null,null,null,null,null,null,null,null,null,null,"LIMA HUAROCHIRI MATUCANA",0,"LIMA","HUAROCHIRI","MATUCANA","C150701"]
[null,null,null,null,null,null,null,null,null,null,null,null,"LIMA HUAROCHIRI RICARDO PALMA",0,"LIMA","HUAROCHIRI","RICARDO PALMA","C150714"]
[null,null,null,null,null,null,null,null,null,null,null,null,"LIMA HUAROCHIRI SAN ANDRES DE TUPICOCHA",0,"LIMA","HUAROCHIRI","SAN ANDRES DE TUPICOCHA","C150715"]
[null,null,null,null,null,null,null,null,null,null,null,null,"LIMA HUAROCHIRI SAN ANTONIO",0,"LIMA","HUAROCHIRI","SAN ANTONIO","C150716"]
[null,null,null,null,null,null,null,null,null,null,null,null,"LIMA HUAROCHIRI SAN BARTOLOME",0,"LIMA","HUAROCHIRI","SAN BARTOLOME","C150717"]
[null,null,null,null,null,null,null,null,null,null,null,null,"LIMA HUAROCHIRI SAN DAMIAN",0,"LIMA","HUAROCHIRI","SAN DAMIAN","C150718"]
[null,null,null,null,null,null,null,null,null,null,null,null,"LIMA HUAROCHIRI SAN JUAN DE IRIS",0,"LIMA","HUAROCHIRI","SAN JUAN DE IRIS","C150719"]
[null,null,null,null,null,null,null,null,null,null,null,null,"LIMA HUAROCHIRI SAN JUAN DE TANTARANCHE",0,"LIMA","HUAROCHIRI","SAN JUAN DE TANTARANCHE","C150720"]
[null,null,null,null,null,null,null,null,null,null,null,null,"LIMA HUAROCHIRI SAN LORENZO DE QUINTI",0,"LIMA","HUAROCHIRI","SAN LORENZO DE QUINTI","C150721"]
[null,null,null,null,null,null,null,null,null,null,null,null,"LIMA HUAROCHIRI SAN MATEO",0,"LIMA","HUAROCHIRI","SAN MATEO","C150722"]
[null,null,null,null,null,null,null,null,null,null,null,null,"LIMA HUAROCHIRI SAN MATEO DE OTAO",0,"LIMA","HUAROCHIRI","SAN MATEO DE OTAO","C150723"]
[null,null,null,null,null,null,null,null,null,null,null,null,"LIMA HUAROCHIRI SAN PEDRO DE CASTA",0,"LIMA","HUAROCHIRI","SAN PEDRO DE CASTA","C150724"]
[null,null,null,null,null,null,null,null,null,null,null,null,"LIMA HUAROCHIRI SAN PEDRO DE HUANCAYRE",0,"LIMA","HUAROCHIRI","SAN PEDRO DE HUANCAYRE","C150725"]
[null,null,null,null,null,null,null,null,null,null,null,null,"LIMA HUAROCHIRI SANGALLAYA",0,"LIMA","HUAROCHIRI","SANGALLAYA","C150726"]
[null,null,null,null,null,null,null,null,null,null,null,null,"LIMA HUAROCHIRI SANTA CRUZ DE COCACHACRA",0,"LIMA","HUAROCHIRI","SANTA CRUZ DE COCACHACRA","C150727"]
[null,null,null,null,null,null,null,null,null,null,null,null,"LIMA HUAROCHIRI SANTA EULALIA",0,"LIMA","HUAROCHIRI","SANTA EULALIA","C150728"]
[null,null,null,null,null,null,null,null,null,null,null,null,"LIMA HUAROCHIRI SANTIAGO DE ANCHUCAYA",0,"LIMA","HUAROCHIRI","SANTIAGO DE ANCHUCAYA","C150729"]
[null,null,null,null,null,null,null,null,null,null,null,null,"LIMA HUAROCHIRI SANTIAGO DE TUNA",0,"LIMA","HUAROCHIRI","SANTIAGO DE TUNA","C150730"]
[null,null,null,null,null,null,null,null,null,null,null,null,{"$f":"O1347&\" \"&P1347&\" \"&Q1347","v":"LIMA HUAROCHIRI SANTO DOMINGO DE LOS OLLEROS"},{"$f":"IF(AND($D$9=O1347,$D$10=P1347),N1346+1,0)","v":0},"LIMA","HUAROCHIRI","SANTO DOMINGO DE LOS OLLEROS","C150731"]
[null,null,null,null,null,null,null,null,null,null,null,null,"LIMA HUAROCHIRI SURCO",0,"LIMA","HUAROCHIRI","SURCO","C150732"]
[null,null,null,null,null,null,null,null,null,null,null,null,"LIMA HUAURA AMBAR",0,"LIMA","HUAURA","AMBAR","C150802"]
[null,null,null,null,null,null,null,null,null,null,null,null,"LIMA HUAURA CALETA DE CARQUIN",0,"LIMA","HUAURA","CALETA DE CARQUIN","C150803"]
[null,null,null,null,null,null,null,null,null,null,null,null,"LIMA HUAURA CHECRAS",0,"LIMA","HUAURA","CHECRAS","C150804"]
[null,null,null,null,null,null,null,null,null,null,null,null,"LIMA HUAURA HUACHO",0,"LIMA","HUAURA","HUACHO","C150801"]
[null,null,null,null,null,null,null,null,null,null,null,null,"LIMA HUAURA HUALMAY",0,"LIMA","HUAURA","HUALMAY","C150805"]
[null,null,null,null,null,null,null,null,null,null,null,null,"LIMA HUAURA HUAURA",0,"LIMA","HUAURA","HUAURA","C150806"]
[null,null,null,null,null,null,null,null,null,null,null,null,"LIMA HUAURA LEONCIO PRADO",0,"LIMA","HUAURA","LEONCIO PRADO","C150807"]
[null,null,null,null,null,null,null,null,null,null,null,null,"LIMA HUAURA PACCHO",0,"LIMA","HUAURA","PACCHO","C150808"]
[null,null,null,null,null,null,null,null,null,null,null,null,"LIMA HUAURA SANTA LEONOR",0,"LIMA","HUAURA","SANTA LEONOR","C150809"]
[null,null,null,null,null,null,null,null,null,null,null,null,"LIMA HUAURA SANTA MARIA",0,"LIMA","HUAURA","SANTA MARIA","C150810"]
[null,null,null,null,null,null,null,null,null,null,null,null,"LIMA HUAURA SAYAN",0,"LIMA","HUAURA","SAYAN","C150811"]
[null,null,null,null,null,null,null,null,null,null,null,null,"LIMA HUAURA VEGUETA",0,"LIMA","HUAURA","VEGUETA","C150812"]
[null,null,null,null,null,null,null,null,null,null,null,null,"LIMA LIMA ANCON",0,"LIMA","LIMA","ANCON","C150102"]
[null,null,null,null,null,null,null,null,null,null,null,null,"LIMA LIMA ATE",0,"LIMA","LIMA","ATE","C150103"]
[null,null,null,null,null,null,null,null,null,null,null,null,"LIMA LIMA BARRANCO",0,"LIMA","LIMA","BARRANCO","C150104"]
[null,null,null,null,null,null,null,null,null,null,null,null,"LIMA LIMA BREÑA",0,"LIMA","LIMA","BREÑA","C150105"]
[null,null,null,null,null,null,null,null,null,null,null,null,"LIMA LIMA CARABAYLLO",0,"LIMA","LIMA","CARABAYLLO","C150106"]
[null,null,null,null,null,null,null,null,null,null,null,null,"LIMA LIMA CHACLACAYO",0,"LIMA","LIMA","CHACLACAYO","C150107"]
[null,null,null,null,null,null,null,null,null,null,null,null,"LIMA LIMA CHORRILLOS",0,"LIMA","LIMA","CHORRILLOS","C150108"]
[null,null,null,null,null,null,null,null,null,null,null,null,"LIMA LIMA CIENEGUILLA",0,"LIMA","LIMA","CIENEGUILLA","C150109"]
[null,null,null,null,null,null,null,null,null,null,null,null,"LIMA LIMA COMAS",0,"LIMA","LIMA","COMAS","C150110"]
[null,null,null,null,null,null,null,null,null,null,null,null,"LIMA LIMA EL AGUSTINO",0,"LIMA","LIMA","EL AGUSTINO","C150111"]
[null,null,null,null,null,null,null,null,null,null,null,null,"LIMA LIMA INDEPENDENCIA",0,"LIMA","LIMA","INDEPENDENCIA","C150112"]
[null,null,null,null,null,null,null,null,null,null,null,null,"LIMA LIMA JESUS MARIA",0,"LIMA","LIMA","JESUS MARIA","C150113"]
[null,null,null,null,null,null,null,null,null,null,null,null,"LIMA LIMA LA MOLINA",0,"LIMA","LIMA","LA MOLINA","C150114"]
[null,null,null,null,null,null,null,null,null,null,null,null,"LIMA LIMA LA VICTORIA",0,"LIMA","LIMA","LA VICTORIA","C150115"]
[null,null,null,null,null,null,null,null,null,null,null,null,"LIMA LIMA LIMA",0,"LIMA","LIMA","LIMA","C150101"]
[null,null,null,null,null,null,null,null,null,null,null,null,"LIMA LIMA LINCE",0,"LIMA","LIMA","LINCE","C150116"]
[null,null,null,null,null,null,null,null,null,null,null,null,"LIMA LIMA LOS OLIVOS",0,"LIMA","LIMA","LOS OLIVOS","C150117"]
[null,null,null,null,null,null,null,null,null,null,null,null,"LIMA LIMA LURIGANCHO",0,"LIMA","LIMA","LURIGANCHO","C150118"]
[null,null,null,null,null,null,null,null,null,null,null,null,"LIMA LIMA LURIN",0,"LIMA","LIMA","LURIN","C150119"]
[null,null,null,null,null,null,null,null,null,null,null,null,"LIMA LIMA MAGDALENA DEL MAR",0,"LIMA","LIMA","MAGDALENA DEL MAR","C150120"]
[null,null,null,null,null,null,null,null,null,null,null,null,"LIMA LIMA MIRAFLORES",0,"LIMA","LIMA","MIRAFLORES","C150122"]
[null,null,null,null,null,null,null,null,null,null,null,null,"LIMA LIMA PACHACAMAC",0,"LIMA","LIMA","PACHACAMAC","C150123"]
[null,null,null,null,null,null,null,null,null,null,null,null,"LIMA LIMA PUCUSANA",0,"LIMA","LIMA","PUCUSANA","C150124"]
[null,null,null,null,null,null,null,null,null,null,null,null,"LIMA LIMA PUEBLO LIBRE",0,"LIMA","LIMA","PUEBLO LIBRE","C150121"]
[null,null,null,null,null,null,null,null,null,null,null,null,"LIMA LIMA PUENTE PIEDRA",0,"LIMA","LIMA","PUENTE PIEDRA","C150125"]
[null,null,null,null,null,null,null,null,null,null,null,null,"LIMA LIMA PUNTA HERMOSA",0,"LIMA","LIMA","PUNTA HERMOSA","C150126"]
[null,null,null,null,null,null,null,null,null,null,null,null,"LIMA LIMA PUNTA NEGRA",0,"LIMA","LIMA","PUNTA NEGRA","C150127"]
[null,null,null,null,null,null,null,null,null,null,null,null,"LIMA LIMA RIMAC",0,"LIMA","LIMA","RIMAC","C150128"]
[null,null,null,null,null,null,null,null,null,null,null,null,"LIMA LIMA SAN BARTOLO",0,"LIMA","LIMA","SAN BARTOLO","C150129"]
[null,null,null,null,null,null,null,null,null,null,null,null,"LIMA LIMA SAN BORJA",0,"LIMA","LIMA","SAN BORJA","C150130"]
[null,null,null,null,null,null,null,null,null,null,null,null,"LIMA LIMA SAN ISIDRO",0,"LIMA","LIMA","SAN ISIDRO","C150131"]
[null,null,null,null,null,null,null,null,null,null,null,null,"LIMA LIMA SAN JUAN DE LURIGANCHO",0,"LIMA","LIMA","SAN JUAN DE LURIGANCHO","C150132"]
[null,null,null,null,null,null,null,null,null,null,null,null,"LIMA LIMA SAN JUAN DE MIRAFLORES",0,"LIMA","LIMA","SAN JUAN DE MIRAFLORES","C150133"]
[null,null,null,null,null,null,null,null,null,null,null,null,"LIMA LIMA SAN LUIS",0,"LIMA","LIMA","SAN LUIS","C150134"]
[null,null,null,null,null,null,null,null,null,null,null,null,"LIMA LIMA SAN MARTIN DE PORRES",0,"LIMA","LIMA","SAN MARTIN DE PORRES","C150135"]
[null,null,null,null,null,null,null,null,null,null,null,null,"LIMA LIMA SAN MIGUEL",0,"LIMA","LIMA","SAN MIGUEL","C150136"]
[null,null,null,null,null,null,null,null,null,null,null,null,"LIMA LIMA SANTA ANITA",0,"LIMA","LIMA","SANTA ANITA","C150137"]
[null,null,null,null,null,null,null,null,null,null,null,null,"LIMA LIMA SANTA MARIA DEL MAR",0,"LIMA","LIMA","SANTA MARIA DEL MAR","C150138"]
[null,null,null,null,null,null,null,null,null,null,null,null,"LIMA LIMA SANTA ROSA",0,"LIMA","LIMA","SANTA ROSA","C150139"]
[null,null,null,null,null,null,null,null,null,null,null,null,"LIMA LIMA SANTIAGO DE SURCO",0,"LIMA","LIMA","SANTIAGO DE SURCO","C150140"]
[null,null,null,null,null,null,null,null,null,null,null,null,"LIMA LIMA SURQUILLO",0,"LIMA","LIMA","SURQUILLO","C150141"]
[null,null,null,null,null,null,null,null,null,null,null,null,"LIMA LIMA VILLA EL SALVADOR",0,"LIMA","LIMA","VILLA EL SALVADOR","C150142"]
[null,null,null,null,null,null,null,null,null,null,null,null,"LIMA LIMA VILLA MARIA DEL TRIUNFO",0,"LIMA","LIMA","VILLA MARIA DEL TRIUNFO","C150143"]
[null,null,null,null,null,null,null,null,null,null,null,null,"LIMA OYON ANDAJES",0,"LIMA","OYON","ANDAJES","C150902"]
[null,null,null,null,null,null,null,null,null,null,null,null,"LIMA OYON CAUJUL",0,"LIMA","OYON","CAUJUL","C150903"]
[null,null,null,null,null,null,null,null,null,null,null,null,"LIMA OYON COCHAMARCA",0,"LIMA","OYON","COCHAMARCA","C150904"]
[null,null,null,null,null,null,null,null,null,null,null,null,"LIMA OYON NAVAN",0,"LIMA","OYON","NAVAN","C150905"]
[null,null,null,null,null,null,null,null,null,null,null,null,"LIMA OYON OYON",0,"LIMA","OYON","OYON","C150901"]
[null,null,null,null,null,null,null,null,null,null,null,null,"LIMA OYON PACHANGARA",0,"LIMA","OYON","PACHANGARA","C150906"]
[null,null,null,null,null,null,null,null,null,null,null,null,"LIMA YAUYOS ALIS",0,"LIMA","YAUYOS","ALIS","C151002"]
[null,null,null,null,null,null,null,null,null,null,null,null,{"$f":"O1411&\" \"&P1411&\" \"&Q1411","v":"LIMA YAUYOS ALLAUCA"},{"$f":"IF(AND($D$9=O1411,$D$10=P1411),N1410+1,0)","v":0},"LIMA","YAUYOS","ALLAUCA","C151003"]
[null,null,null,null,null,null,null,null,null,null,null,null,"LIMA YAUYOS AYAVIRI",0,"LIMA","YAUYOS","AYAVIRI","C151004"]
[null,null,null,null,null,null,null,null,null,null,null,null,"LIMA YAUYOS AZANGARO",0,"LIMA","YAUYOS","AZANGARO","C151005"]
[null,null,null,null,null,null,null,null,null,null,null,null,"LIMA YAUYOS CACRA",0,"LIMA","YAUYOS","CACRA","C151006"]
[null,null,null,null,null,null,null,null,null,null,null,null,"LIMA YAUYOS CARANIA",0,"LIMA","YAUYOS","CARANIA","C151007"]
[null,null,null,null,null,null,null,null,null,null,null,null,"LIMA YAUYOS CATAHUASI",0,"LIMA","YAUYOS","CATAHUASI","C151008"]
[null,null,null,null,null,null,null,null,null,null,null,null,"LIMA YAUYOS CHOCOS",0,"LIMA","YAUYOS","CHOCOS","C151009"]
[null,null,null,null,null,null,null,null,null,null,null,null,"LIMA YAUYOS COCHAS",0,"LIMA","YAUYOS","COCHAS","C151010"]
[null,null,null,null,null,null,null,null,null,null,null,null,"LIMA YAUYOS COLONIA",0,"LIMA","YAUYOS","COLONIA","C151011"]
[null,null,null,null,null,null,null,null,null,null,null,null,"LIMA YAUYOS HONGOS",0,"LIMA","YAUYOS","HONGOS","C151012"]
[null,null,null,null,null,null,null,null,null,null,null,null,"LIMA YAUYOS HUAMPARA",0,"LIMA","YAUYOS","HUAMPARA","C151013"]
[null,null,null,null,null,null,null,null,null,null,null,null,"LIMA YAUYOS HUANCAYA",0,"LIMA","YAUYOS","HUANCAYA","C151014"]
[null,null,null,null,null,null,null,null,null,null,null,null,"LIMA YAUYOS HUANGASCAR",0,"LIMA","YAUYOS","HUANGASCAR","C151015"]
[null,null,null,null,null,null,null,null,null,null,null,null,"LIMA YAUYOS HUANTAN",0,"LIMA","YAUYOS","HUANTAN","C151016"]
[null,null,null,null,null,null,null,null,null,null,null,null,"LIMA YAUYOS HUAÑEC",0,"LIMA","YAUYOS","HUAÑEC","C151016"]
[null,null,null,null,null,null,null,null,null,null,null,null,"LIMA YAUYOS LARAOS",0,"LIMA","YAUYOS","LARAOS","C151018"]
[null,null,null,null,null,null,null,null,null,null,null,null,"LIMA YAUYOS LINCHA",0,"LIMA","YAUYOS","LINCHA","C151019"]
[null,null,null,null,null,null,null,null,null,null,null,null,"LIMA YAUYOS MADEAN",0,"LIMA","YAUYOS","MADEAN","C151020"]
[null,null,null,null,null,null,null,null,null,null,null,null,"LIMA YAUYOS MIRAFLORES",0,"LIMA","YAUYOS","MIRAFLORES","C151021"]
[null,null,null,null,null,null,null,null,null,null,null,null,"LIMA YAUYOS OMAS",0,"LIMA","YAUYOS","OMAS","C151022"]
[null,null,null,null,null,null,null,null,null,null,null,null,"LIMA YAUYOS PUTINZA",0,"LIMA","YAUYOS","PUTINZA","C151023"]
[null,null,null,null,null,null,null,null,null,null,null,null,"LIMA YAUYOS QUINCHES",0,"LIMA","YAUYOS","QUINCHES","C151024"]
[null,null,null,null,null,null,null,null,null,null,null,null,"LIMA YAUYOS QUINOCAY",0,"LIMA","YAUYOS","QUINOCAY","C151025"]
[null,null,null,null,null,null,null,null,null,null,null,null,"LIMA YAUYOS SAN JOAQUIN",0,"LIMA","YAUYOS","SAN JOAQUIN","C151026"]
[null,null,null,null,null,null,null,null,null,null,null,null,"LIMA YAUYOS SAN PEDRO DE PILAS",0,"LIMA","YAUYOS","SAN PEDRO DE PILAS","C151027"]
[null,null,null,null,null,null,null,null,null,null,null,null,"LIMA YAUYOS TANTA",0,"LIMA","YAUYOS","TANTA","C151028"]
[null,null,null,null,null,null,null,null,null,null,null,null,"LIMA YAUYOS TAURIPAMPA",0,"LIMA","YAUYOS","TAURIPAMPA","C151029"]
[null,null,null,null,null,null,null,null,null,null,null,null,"LIMA YAUYOS TOMAS",0,"LIMA","YAUYOS","TOMAS","C151030"]
[null,null,null,null,null,null,null,null,null,null,null,null,"LIMA YAUYOS TUPE",0,"LIMA","YAUYOS","TUPE","C151031"]
[null,null,null,null,null,null,null,null,null,null,null,null,"LIMA YAUYOS VIÑAC",0,"LIMA","YAUYOS","VIÑAC","C151032"]
[null,null,null,null,null,null,null,null,null,null,null,null,"LIMA YAUYOS VITIS",0,"LIMA","YAUYOS","VITIS","C151033"]
[null,null,null,null,null,null,null,null,null,null,null,null,"LIMA YAUYOS YAUYOS",0,"LIMA","YAUYOS","YAUYOS","C151001"]
[null,null,null,null,null,null,null,null,null,null,null,null,"LORETO ALTO AMAZONAS BALSAPUERTO",0,"LORETO","ALTO AMAZONAS","BALSAPUERTO","C160202"]
[null,null,null,null,null,null,null,null,null,null,null,null,"LORETO ALTO AMAZONAS JEBEROS",0,"LORETO","ALTO AMAZONAS","JEBEROS","C160205"]
[null,null,null,null,null,null,null,null,null,null,null,null,"LORETO ALTO AMAZONAS LAGUNAS",0,"LORETO","ALTO AMAZONAS","LAGUNAS","C160206"]
[null,null,null,null,null,null,null,null,null,null,null,null,"LORETO ALTO AMAZONAS SANTA CRUZ",0,"LORETO","ALTO AMAZONAS","SANTA CRUZ","C160210"]
[null,null,null,null,null,null,null,null,null,null,null,null,"LORETO ALTO AMAZONAS TENIENTE CESAR LOPEZ ROJAS",0,"LORETO","ALTO AMAZONAS","TENIENTE CESAR LOPEZ ROJAS","C160211"]
[null,null,null,null,null,null,null,null,null,null,null,null,"LORETO ALTO AMAZONAS YURIMAGUAS",0,"LORETO","ALTO AMAZONAS","YURIMAGUAS","C160201"]
[null,null,null,null,null,null,null,null,null,null,null,null,"LORETO DATEM DEL MARAÑON ANDOAS",0,"LORETO","DATEM DEL MARAÑON","ANDOAS","C160706"]
[null,null,null,null,null,null,null,null,null,null,null,null,"LORETO DATEM DEL MARAÑON BARRANCA",0,"LORETO","DATEM DEL MARAÑON","BARRANCA","C160701"]
[null,null,null,null,null,null,null,null,null,null,null,null,"LORETO DATEM DEL MARAÑON CAHUAPANAS",0,"LORETO","DATEM DEL MARAÑON","CAHUAPANAS","C160702"]
[null,null,null,null,null,null,null,null,null,null,null,null,"LORETO DATEM DEL MARAÑON MANSERICHE",0,"LORETO","DATEM DEL MARAÑON","MANSERICHE","C160703"]
[null,null,null,null,null,null,null,null,null,null,null,null,"LORETO DATEM DEL MARAÑON MORONA",0,"LORETO","DATEM DEL MARAÑON","MORONA","C160704"]
[null,null,null,null,null,null,null,null,null,null,null,null,"LORETO DATEM DEL MARAÑON PASTAZA",0,"LORETO","DATEM DEL MARAÑON","PASTAZA","C160705"]
[null,null,null,null,null,null,null,null,null,null,null,null,"LORETO LORETO NAUTA",0,"LORETO","LORETO","NAUTA","C160301"]
[null,null,null,null,null,null,null,null,null,null,null,null,"LORETO LORETO PARINARI",0,"LORETO","LORETO","PARINARI","C160302"]
[null,null,null,null,null,null,null,null,null,null,null,null,"LORETO LORETO TIGRE",0,"LORETO","LORETO","TIGRE","C160303"]
[null,null,null,null,null,null,null,null,null,null,null,null,"LORETO LORETO TROMPETEROS",0,"LORETO","LORETO","TROMPETEROS","C160304"]
[null,null,null,null,null,null,null,null,null,null,null,null,"LORETO LORETO URARINAS",0,"LORETO","LORETO","URARINAS","C160305"]
[null,null,null,null,null,null,null,null,null,null,null,null,"LORETO MARISCAL RAMON CASTILLA PEBAS",0,"LORETO","MARISCAL RAMON CASTILLA","PEBAS","C160402"]
[null,null,null,null,null,null,null,null,null,null,null,null,"LORETO MARISCAL RAMON CASTILLA RAMON CASTILLA",0,"LORETO","MARISCAL RAMON CASTILLA","RAMON CASTILLA","C160401"]
[null,null,null,null,null,null,null,null,null,null,null,null,"LORETO MARISCAL RAMON CASTILLA SAN PABLO",0,"LORETO","MARISCAL RAMON CASTILLA","SAN PABLO","C160404"]
[null,null,null,null,null,null,null,null,null,null,null,null,"LORETO MARISCAL RAMON CASTILLA YAVARI",0,"LORETO","MARISCAL RAMON CASTILLA","YAVARI","C160403"]
[null,null,null,null,null,null,null,null,null,null,null,null,"LORETO MAYNAS ALTO NANAY",0,"LORETO","MAYNAS","ALTO NANAY","C160102"]
[null,null,null,null,null,null,null,null,null,null,null,null,"LORETO MAYNAS BELEN",0,"LORETO","MAYNAS","BELEN","C160112"]
[null,null,null,null,null,null,null,null,null,null,null,null,"LORETO MAYNAS FERNANDO LORES",0,"LORETO","MAYNAS","FERNANDO LORES","C160103"]
[null,null,null,null,null,null,null,null,null,null,null,null,"LORETO MAYNAS INDIANA",0,"LORETO","MAYNAS","INDIANA","C160104"]
[null,null,null,null,null,null,null,null,null,null,null,null,"LORETO MAYNAS IQUITOS",0,"LORETO","MAYNAS","IQUITOS","C160101"]
[null,null,null,null,null,null,null,null,null,null,null,null,"LORETO MAYNAS LAS AMAZONAS",0,"LORETO","MAYNAS","LAS AMAZONAS","C160105"]
[null,null,null,null,null,null,null,null,null,null,null,null,"LORETO MAYNAS MAZAN",0,"LORETO","MAYNAS","MAZAN","C160106"]
[null,null,null,null,null,null,null,null,null,null,null,null,"LORETO MAYNAS NAPO",0,"LORETO","MAYNAS","NAPO","C160107"]
[null,null,null,null,null,null,null,null,null,null,null,null,"LORETO MAYNAS PUNCHANA",0,"LORETO","MAYNAS","PUNCHANA","C160108"]
[null,null,null,null,null,null,null,null,null,null,null,null,"LORETO MAYNAS SAN JUAN BAUTISTA",0,"LORETO","MAYNAS","SAN JUAN BAUTISTA","C160113"]
[null,null,null,null,null,null,null,null,null,null,null,null,"LORETO MAYNAS TORRES CAUSANA",0,"LORETO","MAYNAS","TORRES CAUSANA","C160110"]
[null,null,null,null,null,null,null,null,null,null,null,null,{"$f":"O1475&\" \"&P1475&\" \"&Q1475","v":"LORETO PUTUMAYO PUTUMAYO"},{"$f":"IF(AND($D$9=O1475,$D$10=P1475),N1474+1,0)","v":0},"LORETO","PUTUMAYO","PUTUMAYO","C160801"]
[null,null,null,null,null,null,null,null,null,null,null,null,"LORETO PUTUMAYO ROSA PANDURO",0,"LORETO","PUTUMAYO","ROSA PANDURO","C160802"]
[null,null,null,null,null,null,null,null,null,null,null,null,"LORETO PUTUMAYO TENIENTE MANUEL CLAVERO",0,"LORETO","PUTUMAYO","TENIENTE MANUEL CLAVERO","C160803"]
[null,null,null,null,null,null,null,null,null,null,null,null,"LORETO PUTUMAYO YAGUAS",0,"LORETO","PUTUMAYO","YAGUAS","C160804"]
[null,null,null,null,null,null,null,null,null,null,null,null,"LORETO REQUENA ALTO TAPICHE",0,"LORETO","REQUENA","ALTO TAPICHE","C160502"]
[null,null,null,null,null,null,null,null,null,null,null,null,"LORETO REQUENA CAPELO",0,"LORETO","REQUENA","CAPELO","C160503"]
[null,null,null,null,null,null,null,null,null,null,null,null,"LORETO REQUENA EMILIO SAN MARTIN",0,"LORETO","REQUENA","EMILIO SAN MARTIN","C160504"]
[null,null,null,null,null,null,null,null,null,null,null,null,"LORETO REQUENA JENARO HERRERA",0,"LORETO","REQUENA","JENARO HERRERA","C160510"]
[null,null,null,null,null,null,null,null,null,null,null,null,"LORETO REQUENA MAQUIA",0,"LORETO","REQUENA","MAQUIA","C160505"]
[null,null,null,null,null,null,null,null,null,null,null,null,"LORETO REQUENA PUINAHUA",0,"LORETO","REQUENA","PUINAHUA","C160506"]
[null,null,null,null,null,null,null,null,null,null,null,null,"LORETO REQUENA REQUENA",0,"LORETO","REQUENA","REQUENA","C160501"]
[null,null,null,null,null,null,null,null,null,null,null,null,"LORETO REQUENA SAQUENA",0,"LORETO","REQUENA","SAQUENA","C160507"]
[null,null,null,null,null,null,null,null,null,null,null,null,"LORETO REQUENA SOPLIN",0,"LORETO","REQUENA","SOPLIN","C160508"]
[null,null,null,null,null,null,null,null,null,null,null,null,"LORETO REQUENA TAPICHE",0,"LORETO","REQUENA","TAPICHE","C160509"]
[null,null,null,null,null,null,null,null,null,null,null,null,"LORETO REQUENA YAQUERANA",0,"LORETO","REQUENA","YAQUERANA","C160511"]
[null,null,null,null,null,null,null,null,null,null,null,null,"LORETO UCAYALI CONTAMANA",0,"LORETO","UCAYALI","CONTAMANA","C160601"]
[null,null,null,null,null,null,null,null,null,null,null,null,"LORETO UCAYALI INAHUAYA",0,"LORETO","UCAYALI","INAHUAYA","C160602"]
[null,null,null,null,null,null,null,null,null,null,null,null,"LORETO UCAYALI PADRE MARQUEZ",0,"LORETO","UCAYALI","PADRE MARQUEZ","C160603"]
[null,null,null,null,null,null,null,null,null,null,null,null,"LORETO UCAYALI PAMPA HERMOSA",0,"LORETO","UCAYALI","PAMPA HERMOSA","C160604"]
[null,null,null,null,null,null,null,null,null,null,null,null,"LORETO UCAYALI SARAYACU",0,"LORETO","UCAYALI","SARAYACU","C160605"]
[null,null,null,null,null,null,null,null,null,null,null,null,"LORETO UCAYALI VARGAS GUERRA",0,"LORETO","UCAYALI","VARGAS GUERRA","C160606"]
[null,null,null,null,null,null,null,null,null,null,null,null,"MADRE DE DIOS MANU FITZCARRALD",0,"MADRE DE DIOS","MANU","FITZCARRALD","C170202"]
[null,null,null,null,null,null,null,null,null,null,null,null,"MADRE DE DIOS MANU HUEPETUHE",0,"MADRE DE DIOS","MANU","HUEPETUHE","C170204"]
[null,null,null,null,null,null,null,null,null,null,null,null,"MADRE DE DIOS MANU MADRE DE DIOS",0,"MADRE DE DIOS","MANU","MADRE DE DIOS","C170203"]
[null,null,null,null,null,null,null,null,null,null,null,null,"MADRE DE DIOS MANU MANU",0,"MADRE DE DIOS","MANU","MANU","C170201"]
[null,null,null,null,null,null,null,null,null,null,null,null,"MADRE DE DIOS TAHUAMANU IBERIA",0,"MADRE DE DIOS","TAHUAMANU","IBERIA","C170302"]
[null,null,null,null,null,null,null,null,null,null,null,null,"MADRE DE DIOS TAHUAMANU IÑAPARI",0,"MADRE DE DIOS","TAHUAMANU","IÑAPARI","C170301"]
[null,null,null,null,null,null,null,null,null,null,null,null,"MADRE DE DIOS TAHUAMANU TAHUAMANU",0,"MADRE DE DIOS","TAHUAMANU","TAHUAMANU","C170303"]
[null,null,null,null,null,null,null,null,null,null,null,null,"MADRE DE DIOS TAMBOPATA INAMBARI",0,"MADRE DE DIOS","TAMBOPATA","INAMBARI","C170102"]
[null,null,null,null,null,null,null,null,null,null,null,null,"MADRE DE DIOS TAMBOPATA LABERINTO",0,"MADRE DE DIOS","TAMBOPATA","LABERINTO","C170104"]
[null,null,null,null,null,null,null,null,null,null,null,null,"MADRE DE DIOS TAMBOPATA LAS PIEDRAS",0,"MADRE DE DIOS","TAMBOPATA","LAS PIEDRAS","C170103"]
[null,null,null,null,null,null,null,null,null,null,null,null,"MADRE DE DIOS TAMBOPATA TAMBOPATA",0,"MADRE DE DIOS","TAMBOPATA","TAMBOPATA","C170101"]
[null,null,null,null,null,null,null,null,null,null,null,null,"MOQUEGUA GENERAL SANCHEZ CERRO CHOJATA",0,"MOQUEGUA","GENERAL SANCHEZ CERRO","CHOJATA","C180202"]
[null,null,null,null,null,null,null,null,null,null,null,null,"MOQUEGUA GENERAL SANCHEZ CERRO COALAQUE",0,"MOQUEGUA","GENERAL SANCHEZ CERRO","COALAQUE","C180203"]
[null,null,null,null,null,null,null,null,null,null,null,null,"MOQUEGUA GENERAL SANCHEZ CERRO ICHUÑA",0,"MOQUEGUA","GENERAL SANCHEZ CERRO","ICHUÑA","C180204"]
[null,null,null,null,null,null,null,null,null,null,null,null,"MOQUEGUA GENERAL SANCHEZ CERRO LA CAPILLA",0,"MOQUEGUA","GENERAL SANCHEZ CERRO","LA CAPILLA","C180205"]
[null,null,null,null,null,null,null,null,null,null,null,null,"MOQUEGUA GENERAL SANCHEZ CERRO LLOQUE",0,"MOQUEGUA","GENERAL SANCHEZ CERRO","LLOQUE","C180206"]
[null,null,null,null,null,null,null,null,null,null,null,null,"MOQUEGUA GENERAL SANCHEZ CERRO MATALAQUE",0,"MOQUEGUA","GENERAL SANCHEZ CERRO","MATALAQUE","C180207"]
[null,null,null,null,null,null,null,null,null,null,null,null,"MOQUEGUA GENERAL SANCHEZ CERRO OMATE",0,"MOQUEGUA","GENERAL SANCHEZ CERRO","OMATE","C180201"]
[null,null,null,null,null,null,null,null,null,null,null,null,"MOQUEGUA GENERAL SANCHEZ CERRO PUQUINA",0,"MOQUEGUA","GENERAL SANCHEZ CERRO","PUQUINA","C180208"]
[null,null,null,null,null,null,null,null,null,null,null,null,"MOQUEGUA GENERAL SANCHEZ CERRO QUINISTAQUILLAS",0,"MOQUEGUA","GENERAL SANCHEZ CERRO","QUINISTAQUILLAS","C180209"]
[null,null,null,null,null,null,null,null,null,null,null,null,"MOQUEGUA GENERAL SANCHEZ CERRO UBINAS",0,"MOQUEGUA","GENERAL SANCHEZ CERRO","UBINAS","C180210"]
[null,null,null,null,null,null,null,null,null,null,null,null,"MOQUEGUA GENERAL SANCHEZ CERRO YUNGA",0,"MOQUEGUA","GENERAL SANCHEZ CERRO","YUNGA","C180211"]
[null,null,null,null,null,null,null,null,null,null,null,null,"MOQUEGUA ILO EL ALGARROBAL",0,"MOQUEGUA","ILO","EL ALGARROBAL","C180302"]
[null,null,null,null,null,null,null,null,null,null,null,null,"MOQUEGUA ILO ILO",0,"MOQUEGUA","ILO","ILO","C180301"]
[null,null,null,null,null,null,null,null,null,null,null,null,"MOQUEGUA ILO PACOCHA",0,"MOQUEGUA","ILO","PACOCHA","C180303"]
[null,null,null,null,null,null,null,null,null,null,null,null,"MOQUEGUA MARISCAL NIETO CARUMAS",0,"MOQUEGUA","MARISCAL NIETO","CARUMAS","C180102"]
[null,null,null,null,null,null,null,null,null,null,null,null,"MOQUEGUA MARISCAL NIETO CUCHUMBAYA",0,"MOQUEGUA","MARISCAL NIETO","CUCHUMBAYA","C180103"]
[null,null,null,null,null,null,null,null,null,null,null,null,"MOQUEGUA MARISCAL NIETO MOQUEGUA",0,"MOQUEGUA","MARISCAL NIETO","MOQUEGUA","C180101"]
[null,null,null,null,null,null,null,null,null,null,null,null,"MOQUEGUA MARISCAL NIETO SAMEGUA",0,"MOQUEGUA","MARISCAL NIETO","SAMEGUA","C180104"]
[null,null,null,null,null,null,null,null,null,null,null,null,"MOQUEGUA MARISCAL NIETO SAN CRISTOBAL",0,"MOQUEGUA","MARISCAL NIETO","SAN CRISTOBAL","C180105"]
[null,null,null,null,null,null,null,null,null,null,null,null,"MOQUEGUA MARISCAL NIETO TORATA",0,"MOQUEGUA","MARISCAL NIETO","TORATA","C180106"]
[null,null,null,null,null,null,null,null,null,null,null,null,"PASCO DANIEL ALCIDES CARRION CHACAYAN",0,"PASCO","DANIEL ALCIDES CARRION","CHACAYAN","C190202"]
[null,null,null,null,null,null,null,null,null,null,null,null,"PASCO DANIEL ALCIDES CARRION GOYLLARISQUIZGA",0,"PASCO","DANIEL ALCIDES CARRION","GOYLLARISQUIZGA","C190203"]
[null,null,null,null,null,null,null,null,null,null,null,null,"PASCO DANIEL ALCIDES CARRION PAUCAR",0,"PASCO","DANIEL ALCIDES CARRION","PAUCAR","C190204"]
[null,null,null,null,null,null,null,null,null,null,null,null,"PASCO DANIEL ALCIDES CARRION SAN PEDRO DE PILLAO",0,"PASCO","DANIEL ALCIDES CARRION","SAN PEDRO DE PILLAO","C190205"]
[null,null,null,null,null,null,null,null,null,null,null,null,"PASCO DANIEL ALCIDES CARRION SANTA ANA DE TUSI",0,"PASCO","DANIEL ALCIDES CARRION","SANTA ANA DE TUSI","C190206"]
[null,null,null,null,null,null,null,null,null,null,null,null,"PASCO DANIEL ALCIDES CARRION TAPUC",0,"PASCO","DANIEL ALCIDES CARRION","TAPUC","C190207"]
[null,null,null,null,null,null,null,null,null,null,null,null,"PASCO DANIEL ALCIDES CARRION VILCABAMBA",0,"PASCO","DANIEL ALCIDES CARRION","VILCABAMBA","C190208"]
[null,null,null,null,null,null,null,null,null,null,null,null,"PASCO DANIEL ALCIDES CARRION YANAHUANCA",0,"PASCO","DANIEL ALCIDES CARRION","YANAHUANCA","C190201"]
[null,null,null,null,null,null,null,null,null,null,null,null,"PASCO OXAPAMPA CHONTABAMBA",0,"PASCO","OXAPAMPA","CHONTABAMBA","C190302"]
[null,null,null,null,null,null,null,null,null,null,null,null,"PASCO OXAPAMPA CONSTITUCIÓN",0,"PASCO","OXAPAMPA","CONSTITUCIÓN","C190308"]
[null,null,null,null,null,null,null,null,null,null,null,null,"PASCO OXAPAMPA HUANCABAMBA",0,"PASCO","OXAPAMPA","HUANCABAMBA","C190303"]
[null,null,null,null,null,null,null,null,null,null,null,null,"PASCO OXAPAMPA OXAPAMPA",0,"PASCO","OXAPAMPA","OXAPAMPA","C190301"]
[null,null,null,null,null,null,null,null,null,null,null,null,{"$f":"O1539&\" \"&P1539&\" \"&Q1539","v":"PASCO OXAPAMPA PALCAZU"},{"$f":"IF(AND($D$9=O1539,$D$10=P1539),N1538+1,0)","v":0},"PASCO","OXAPAMPA","PALCAZU","C190304"]
[null,null,null,null,null,null,null,null,null,null,null,null,"PASCO OXAPAMPA POZUZO",0,"PASCO","OXAPAMPA","POZUZO","C190305"]
[null,null,null,null,null,null,null,null,null,null,null,null,"PASCO OXAPAMPA PUERTO BERMUDEZ",0,"PASCO","OXAPAMPA","PUERTO BERMUDEZ","C190306"]
[null,null,null,null,null,null,null,null,null,null,null,null,"PASCO OXAPAMPA VILLA RICA",0,"PASCO","OXAPAMPA","VILLA RICA","C190307"]
[null,null,null,null,null,null,null,null,null,null,null,null,"PASCO PASCO CHAUPIMARCA",0,"PASCO","PASCO","CHAUPIMARCA","C190101"]
[null,null,null,null,null,null,null,null,null,null,null,null,"PASCO PASCO HUACHON",0,"PASCO","PASCO","HUACHON","C190102"]
[null,null,null,null,null,null,null,null,null,null,null,null,"PASCO PASCO HUARIACA",0,"PASCO","PASCO","HUARIACA","C190103"]
[null,null,null,null,null,null,null,null,null,null,null,null,"PASCO PASCO HUAYLLAY",0,"PASCO","PASCO","HUAYLLAY","C190104"]
[null,null,null,null,null,null,null,null,null,null,null,null,"PASCO PASCO NINACACA",0,"PASCO","PASCO","NINACACA","C190105"]
[null,null,null,null,null,null,null,null,null,null,null,null,"PASCO PASCO PALLANCHACRA",0,"PASCO","PASCO","PALLANCHACRA","C190106"]
[null,null,null,null,null,null,null,null,null,null,null,null,"PASCO PASCO PAUCARTAMBO",0,"PASCO","PASCO","PAUCARTAMBO","C190107"]
[null,null,null,null,null,null,null,null,null,null,null,null,"PASCO PASCO SAN FRANCISCO DE ASIS DE YARUSYACAN",0,"PASCO","PASCO","SAN FRANCISCO DE ASIS DE YARUSYACAN","C190108"]
[null,null,null,null,null,null,null,null,null,null,null,null,"PASCO PASCO SIMON BOLIVAR",0,"PASCO","PASCO","SIMON BOLIVAR","C190109"]
[null,null,null,null,null,null,null,null,null,null,null,null,"PASCO PASCO TICLACAYAN",0,"PASCO","PASCO","TICLACAYAN","C190110"]
[null,null,null,null,null,null,null,null,null,null,null,null,"PASCO PASCO TINYAHUARCO",0,"PASCO","PASCO","TINYAHUARCO","C190111"]
[null,null,null,null,null,null,null,null,null,null,null,null,"PASCO PASCO VICCO",0,"PASCO","PASCO","VICCO","C190112"]
[null,null,null,null,null,null,null,null,null,null,null,null,"PASCO PASCO YANACANCHA",0,"PASCO","PASCO","YANACANCHA","C190113"]
[null,null,null,null,null,null,null,null,null,null,null,null,"PIURA AYABACA AYABACA",0,"PIURA","AYABACA","AYABACA","C200201"]
[null,null,null,null,null,null,null,null,null,null,null,null,"PIURA AYABACA FRIAS",0,"PIURA","AYABACA","FRIAS","C200202"]
[null,null,null,null,null,null,null,null,null,null,null,null,"PIURA AYABACA JILILI",0,"PIURA","AYABACA","JILILI","C200203"]
[null,null,null,null,null,null,null,null,null,null,null,null,"PIURA AYABACA LAGUNAS",0,"PIURA","AYABACA","LAGUNAS","C200204"]
[null,null,null,null,null,null,null,null,null,null,null,null,"PIURA AYABACA MONTERO",0,"PIURA","AYABACA","MONTERO","C200205"]
[null,null,null,null,null,null,null,null,null,null,null,null,"PIURA AYABACA PACAIPAMPA",0,"PIURA","AYABACA","PACAIPAMPA","C200206"]
[null,null,null,null,null,null,null,null,null,null,null,null,"PIURA AYABACA PAIMAS",0,"PIURA","AYABACA","PAIMAS","C200207"]
[null,null,null,null,null,null,null,null,null,null,null,null,"PIURA AYABACA SAPILLICA",0,"PIURA","AYABACA","SAPILLICA","C200208"]
[null,null,null,null,null,null,null,null,null,null,null,null,"PIURA AYABACA SICCHEZ",0,"PIURA","AYABACA","SICCHEZ","C200209"]
[null,null,null,null,null,null,null,null,null,null,null,null,"PIURA AYABACA SUYO",0,"PIURA","AYABACA","SUYO","C200210"]
[null,null,null,null,null,null,null,null,null,null,null,null,"PIURA HUANCABAMBA CANCHAQUE",0,"PIURA","HUANCABAMBA","CANCHAQUE","C200302"]
[null,null,null,null,null,null,null,null,null,null,null,null,"PIURA HUANCABAMBA EL CARMEN DE LA FRONTERA",0,"PIURA","HUANCABAMBA","EL CARMEN DE LA FRONTERA","C200303"]
[null,null,null,null,null,null,null,null,null,null,null,null,"PIURA HUANCABAMBA HUANCABAMBA",0,"PIURA","HUANCABAMBA","HUANCABAMBA","C200301"]
[null,null,null,null,null,null,null,null,null,null,null,null,"PIURA HUANCABAMBA HUARMACA",0,"PIURA","HUANCABAMBA","HUARMACA","C200304"]
[null,null,null,null,null,null,null,null,null,null,null,null,"PIURA HUANCABAMBA LALAQUIZ",0,"PIURA","HUANCABAMBA","LALAQUIZ","C200305"]
[null,null,null,null,null,null,null,null,null,null,null,null,"PIURA HUANCABAMBA SAN MIGUEL DE EL FAIQUE",0,"PIURA","HUANCABAMBA","SAN MIGUEL DE EL FAIQUE","C200306"]
[null,null,null,null,null,null,null,null,null,null,null,null,"PIURA HUANCABAMBA SONDOR",0,"PIURA","HUANCABAMBA","SONDOR","C200307"]
[null,null,null,null,null,null,null,null,null,null,null,null,"PIURA HUANCABAMBA SONDORILLO",0,"PIURA","HUANCABAMBA","SONDORILLO","C200308"]
[null,null,null,null,null,null,null,null,null,null,null,null,"PIURA MORROPON BUENOS AIRES",0,"PIURA","MORROPON","BUENOS AIRES","C200402"]
[null,null,null,null,null,null,null,null,null,null,null,null,"PIURA MORROPON CHALACO",0,"PIURA","MORROPON","CHALACO","C200403"]
[null,null,null,null,null,null,null,null,null,null,null,null,"PIURA MORROPON CHULUCANAS",0,"PIURA","MORROPON","CHULUCANAS","C200401"]
[null,null,null,null,null,null,null,null,null,null,null,null,"PIURA MORROPON LA MATANZA",0,"PIURA","MORROPON","LA MATANZA","C200404"]
[null,null,null,null,null,null,null,null,null,null,null,null,"PIURA MORROPON MORROPON",0,"PIURA","MORROPON","MORROPON","C200405"]
[null,null,null,null,null,null,null,null,null,null,null,null,"PIURA MORROPON SALITRAL",0,"PIURA","MORROPON","SALITRAL","C200406"]
[null,null,null,null,null,null,null,null,null,null,null,null,"PIURA MORROPON SAN JUAN DE BIGOTE",0,"PIURA","MORROPON","SAN JUAN DE BIGOTE","C200407"]
[null,null,null,null,null,null,null,null,null,null,null,null,"PIURA MORROPON SANTA CATALINA DE MOSSA",0,"PIURA","MORROPON","SANTA CATALINA DE MOSSA","C200408"]
[null,null,null,null,null,null,null,null,null,null,null,null,"PIURA MORROPON SANTO DOMINGO",0,"PIURA","MORROPON","SANTO DOMINGO","C200409"]
[null,null,null,null,null,null,null,null,null,null,null,null,"PIURA MORROPON YAMANGO",0,"PIURA","MORROPON","YAMANGO","C200410"]
[null,null,null,null,null,null,null,null,null,null,null,null,"PIURA PAITA AMOTAPE",0,"PIURA","PAITA","AMOTAPE","C200502"]
[null,null,null,null,null,null,null,null,null,null,null,null,"PIURA PAITA ARENAL",0,"PIURA","PAITA","ARENAL","C200503"]
[null,null,null,null,null,null,null,null,null,null,null,null,"PIURA PAITA COLAN",0,"PIURA","PAITA","COLAN","C200504"]
[null,null,null,null,null,null,null,null,null,null,null,null,"PIURA PAITA LA HUACA",0,"PIURA","PAITA","LA HUACA","C200505"]
[null,null,null,null,null,null,null,null,null,null,null,null,"PIURA PAITA PAITA",0,"PIURA","PAITA","PAITA","C200501"]
[null,null,null,null,null,null,null,null,null,null,null,null,"PIURA PAITA TAMARINDO",0,"PIURA","PAITA","TAMARINDO","C200506"]
[null,null,null,null,null,null,null,null,null,null,null,null,"PIURA PAITA VICHAYAL",0,"PIURA","PAITA","VICHAYAL","C200507"]
[null,null,null,null,null,null,null,null,null,null,null,null,"PIURA PIURA CASTILLA",0,"PIURA","PIURA","CASTILLA","C200104"]
[null,null,null,null,null,null,null,null,null,null,null,null,"PIURA PIURA CATACAOS",0,"PIURA","PIURA","CATACAOS","C200105"]
[null,null,null,null,null,null,null,null,null,null,null,null,"PIURA PIURA CURA MORI",0,"PIURA","PIURA","CURA MORI","C200107"]
[null,null,null,null,null,null,null,null,null,null,null,null,"PIURA PIURA EL TALLÁN",0,"PIURA","PIURA","EL TALLÁN","C200108"]
[null,null,null,null,null,null,null,null,null,null,null,null,"PIURA PIURA LA ARENA",0,"PIURA","PIURA","LA ARENA","C200109"]
[null,null,null,null,null,null,null,null,null,null,null,null,"PIURA PIURA LA UNION",0,"PIURA","PIURA","LA UNION","C200110"]
[null,null,null,null,null,null,null,null,null,null,null,null,"PIURA PIURA LAS LOMAS",0,"PIURA","PIURA","LAS LOMAS","C200111"]
[null,null,null,null,null,null,null,null,null,null,null,null,"PIURA PIURA PIURA",0,"PIURA","PIURA","PIURA","C200101"]
[null,null,null,null,null,null,null,null,null,null,null,null,"PIURA PIURA TAMBO GRANDE",0,"PIURA","PIURA","TAMBO GRANDE","C200114"]
[null,null,null,null,null,null,null,null,null,null,null,null,"PIURA PIURA VEINTISÉIS DE OCTUBRE",0,"PIURA","PIURA","VEINTISÉIS DE OCTUBRE","C200115"]
[null,null,null,null,null,null,null,null,null,null,null,null,"PIURA SECHURA BELLAVISTA DE LA UNION",0,"PIURA","SECHURA","BELLAVISTA DE LA UNION","C200802"]
[null,null,null,null,null,null,null,null,null,null,null,null,"PIURA SECHURA BERNAL",0,"PIURA","SECHURA","BERNAL","C200803"]
[null,null,null,null,null,null,null,null,null,null,null,null,{"$f":"O1603&\" \"&P1603&\" \"&Q1603","v":"PIURA SECHURA CRISTO NOS VALGA"},{"$f":"IF(AND($D$9=O1603,$D$10=P1603),N1602+1,0)","v":0},"PIURA","SECHURA","CRISTO NOS VALGA","C200804"]
[null,null,null,null,null,null,null,null,null,null,null,null,"PIURA SECHURA RINCONADA LLICUAR",0,"PIURA","SECHURA","RINCONADA LLICUAR","C200806"]
[null,null,null,null,null,null,null,null,null,null,null,null,"PIURA SECHURA SECHURA",0,"PIURA","SECHURA","SECHURA","C200801"]
[null,null,null,null,null,null,null,null,null,null,null,null,"PIURA SECHURA VICE",0,"PIURA","SECHURA","VICE","C200805"]
[null,null,null,null,null,null,null,null,null,null,null,null,"PIURA SULLANA BELLAVISTA",0,"PIURA","SULLANA","BELLAVISTA","C200602"]
[null,null,null,null,null,null,null,null,null,null,null,null,"PIURA SULLANA IGNACIO ESCUDERO",0,"PIURA","SULLANA","IGNACIO ESCUDERO","C200603"]
[null,null,null,null,null,null,null,null,null,null,null,null,"PIURA SULLANA LANCONES",0,"PIURA","SULLANA","LANCONES","C200604"]
[null,null,null,null,null,null,null,null,null,null,null,null,"PIURA SULLANA MARCAVELICA",0,"PIURA","SULLANA","MARCAVELICA","C200605"]
[null,null,null,null,null,null,null,null,null,null,null,null,"PIURA SULLANA MIGUEL CHECA",0,"PIURA","SULLANA","MIGUEL CHECA","C200606"]
[null,null,null,null,null,null,null,null,null,null,null,null,"PIURA SULLANA QUERECOTILLO",0,"PIURA","SULLANA","QUERECOTILLO","C200607"]
[null,null,null,null,null,null,null,null,null,null,null,null,"PIURA SULLANA SALITRAL",0,"PIURA","SULLANA","SALITRAL","C200608"]
[null,null,null,null,null,null,null,null,null,null,null,null,"PIURA SULLANA SULLANA",0,"PIURA","SULLANA","SULLANA","C200601"]
[null,null,null,null,null,null,null,null,null,null,null,null,"PIURA TALARA EL ALTO",0,"PIURA","TALARA","EL ALTO","C200702"]
[null,null,null,null,null,null,null,null,null,null,null,null,"PIURA TALARA LA BREA",0,"PIURA","TALARA","LA BREA","C200703"]
[null,null,null,null,null,null,null,null,null,null,null,null,"PIURA TALARA LOBITOS",0,"PIURA","TALARA","LOBITOS","C200704"]
[null,null,null,null,null,null,null,null,null,null,null,null,"PIURA TALARA LOS ORGANOS",0,"PIURA","TALARA","LOS ORGANOS","C200705"]
[null,null,null,null,null,null,null,null,null,null,null,null,"PIURA TALARA MANCORA",0,"PIURA","TALARA","MANCORA","C200706"]
[null,null,null,null,null,null,null,null,null,null,null,null,"PIURA TALARA PARIÑAS",0,"PIURA","TALARA","PARIÑAS","C200701"]
[null,null,null,null,null,null,null,null,null,null,null,null,"PUNO AZANGARO ACHAYA",0,"PUNO","AZANGARO","ACHAYA","C210202"]
[null,null,null,null,null,null,null,null,null,null,null,null,"PUNO AZANGARO ARAPA",0,"PUNO","AZANGARO","ARAPA","C210203"]
[null,null,null,null,null,null,null,null,null,null,null,null,"PUNO AZANGARO ASILLO",0,"PUNO","AZANGARO","ASILLO","C210204"]
[null,null,null,null,null,null,null,null,null,null,null,null,"PUNO AZANGARO AZANGARO",0,"PUNO","AZANGARO","AZANGARO","C210201"]
[null,null,null,null,null,null,null,null,null,null,null,null,"PUNO AZANGARO CAMINACA",0,"PUNO","AZANGARO","CAMINACA","C210205"]
[null,null,null,null,null,null,null,null,null,null,null,null,"PUNO AZANGARO CHUPA",0,"PUNO","AZANGARO","CHUPA","C210206"]
[null,null,null,null,null,null,null,null,null,null,null,null,"PUNO AZANGARO JOSE DOMINGO CHOQUEHUANCA",0,"PUNO","AZANGARO","JOSE DOMINGO CHOQUEHUANCA","C210207"]
[null,null,null,null,null,null,null,null,null,null,null,null,"PUNO AZANGARO MUÑANI",0,"PUNO","AZANGARO","MUÑANI","C210208"]
[null,null,null,null,null,null,null,null,null,null,null,null,"PUNO AZANGARO POTONI",0,"PUNO","AZANGARO","POTONI","C210209"]
[null,null,null,null,null,null,null,null,null,null,null,null,"PUNO AZANGARO SAMAN",0,"PUNO","AZANGARO","SAMAN","C210210"]
[null,null,null,null,null,null,null,null,null,null,null,null,"PUNO AZANGARO SAN ANTON",0,"PUNO","AZANGARO","SAN ANTON","C210211"]
[null,null,null,null,null,null,null,null,null,null,null,null,"PUNO AZANGARO SAN JOSE",0,"PUNO","AZANGARO","SAN JOSE","C210212"]
[null,null,null,null,null,null,null,null,null,null,null,null,"PUNO AZANGARO SAN JUAN DE SALINAS",0,"PUNO","AZANGARO","SAN JUAN DE SALINAS","C210213"]
[null,null,null,null,null,null,null,null,null,null,null,null,"PUNO AZANGARO SANTIAGO DE PUPUJA",0,"PUNO","AZANGARO","SANTIAGO DE PUPUJA","C210214"]
[null,null,null,null,null,null,null,null,null,null,null,null,"PUNO AZANGARO TIRAPATA",0,"PUNO","AZANGARO","TIRAPATA","C210215"]
[null,null,null,null,null,null,null,null,null,null,null,null,"PUNO CARABAYA AJOYANI",0,"PUNO","CARABAYA","AJOYANI","C210302"]
[null,null,null,null,null,null,null,null,null,null,null,null,"PUNO CARABAYA AYAPATA",0,"PUNO","CARABAYA","AYAPATA","C210303"]
[null,null,null,null,null,null,null,null,null,null,null,null,"PUNO CARABAYA COASA",0,"PUNO","CARABAYA","COASA","C210304"]
[null,null,null,null,null,null,null,null,null,null,null,null,"PUNO CARABAYA CORANI",0,"PUNO","CARABAYA","CORANI","C210305"]
[null,null,null,null,null,null,null,null,null,null,null,null,"PUNO CARABAYA CRUCERO",0,"PUNO","CARABAYA","CRUCERO","C210306"]
[null,null,null,null,null,null,null,null,null,null,null,null,"PUNO CARABAYA ITUATA",0,"PUNO","CARABAYA","ITUATA","C210307"]
[null,null,null,null,null,null,null,null,null,null,null,null,"PUNO CARABAYA MACUSANI",0,"PUNO","CARABAYA","MACUSANI","C210301"]
[null,null,null,null,null,null,null,null,null,null,null,null,"PUNO CARABAYA OLLACHEA",0,"PUNO","CARABAYA","OLLACHEA","C210308"]
[null,null,null,null,null,null,null,null,null,null,null,null,"PUNO CARABAYA SAN GABAN",0,"PUNO","CARABAYA","SAN GABAN","C210309"]
[null,null,null,null,null,null,null,null,null,null,null,null,"PUNO CARABAYA USICAYOS",0,"PUNO","CARABAYA","USICAYOS","C210310"]
[null,null,null,null,null,null,null,null,null,null,null,null,"PUNO CHUCUITO DESAGUADERO",0,"PUNO","CHUCUITO","DESAGUADERO","C210402"]
[null,null,null,null,null,null,null,null,null,null,null,null,"PUNO CHUCUITO HUACULLANI",0,"PUNO","CHUCUITO","HUACULLANI","C210403"]
[null,null,null,null,null,null,null,null,null,null,null,null,"PUNO CHUCUITO JULI",0,"PUNO","CHUCUITO","JULI","C210401"]
[null,null,null,null,null,null,null,null,null,null,null,null,"PUNO CHUCUITO KELLUYO",0,"PUNO","CHUCUITO","KELLUYO","C210404"]
[null,null,null,null,null,null,null,null,null,null,null,null,"PUNO CHUCUITO PISACOMA",0,"PUNO","CHUCUITO","PISACOMA","C210405"]
[null,null,null,null,null,null,null,null,null,null,null,null,"PUNO CHUCUITO POMATA",0,"PUNO","CHUCUITO","POMATA","C210406"]
[null,null,null,null,null,null,null,null,null,null,null,null,"PUNO CHUCUITO ZEPITA",0,"PUNO","CHUCUITO","ZEPITA","C210407"]
[null,null,null,null,null,null,null,null,null,null,null,null,"PUNO EL COLLAO CAPAZO",0,"PUNO","EL COLLAO","CAPAZO","C210502"]
[null,null,null,null,null,null,null,null,null,null,null,null,"PUNO EL COLLAO CONDURIRI",0,"PUNO","EL COLLAO","CONDURIRI","C210505"]
[null,null,null,null,null,null,null,null,null,null,null,null,"PUNO EL COLLAO ILAVE",0,"PUNO","EL COLLAO","ILAVE","C210501"]
[null,null,null,null,null,null,null,null,null,null,null,null,"PUNO EL COLLAO PILCUYO",0,"PUNO","EL COLLAO","PILCUYO","C210503"]
[null,null,null,null,null,null,null,null,null,null,null,null,"PUNO EL COLLAO SANTA ROSA",0,"PUNO","EL COLLAO","SANTA ROSA","C210504"]
[null,null,null,null,null,null,null,null,null,null,null,null,"PUNO HUANCANE COJATA",0,"PUNO","HUANCANE","COJATA","C210602"]
[null,null,null,null,null,null,null,null,null,null,null,null,"PUNO HUANCANE HUANCANE",0,"PUNO","HUANCANE","HUANCANE","C210601"]
[null,null,null,null,null,null,null,null,null,null,null,null,"PUNO HUANCANE HUATASANI",0,"PUNO","HUANCANE","HUATASANI","C210603"]
[null,null,null,null,null,null,null,null,null,null,null,null,"PUNO HUANCANE INCHUPALLA",0,"PUNO","HUANCANE","INCHUPALLA","C210604"]
[null,null,null,null,null,null,null,null,null,null,null,null,"PUNO HUANCANE PUSI",0,"PUNO","HUANCANE","PUSI","C210605"]
[null,null,null,null,null,null,null,null,null,null,null,null,"PUNO HUANCANE ROSASPATA",0,"PUNO","HUANCANE","ROSASPATA","C210606"]
[null,null,null,null,null,null,null,null,null,null,null,null,"PUNO HUANCANE TARACO",0,"PUNO","HUANCANE","TARACO","C210607"]
[null,null,null,null,null,null,null,null,null,null,null,null,"PUNO HUANCANE VILQUE CHICO",0,"PUNO","HUANCANE","VILQUE CHICO","C210608"]
[null,null,null,null,null,null,null,null,null,null,null,null,"PUNO LAMPA CABANILLA",0,"PUNO","LAMPA","CABANILLA","C210702"]
[null,null,null,null,null,null,null,null,null,null,null,null,{"$f":"O1667&\" \"&P1667&\" \"&Q1667","v":"PUNO LAMPA CALAPUJA"},{"$f":"IF(AND($D$9=O1667,$D$10=P1667),N1666+1,0)","v":0},"PUNO","LAMPA","CALAPUJA","C210703"]
[null,null,null,null,null,null,null,null,null,null,null,null,"PUNO LAMPA LAMPA",0,"PUNO","LAMPA","LAMPA","C210701"]
[null,null,null,null,null,null,null,null,null,null,null,null,"PUNO LAMPA NICASIO",0,"PUNO","LAMPA","NICASIO","C210704"]
[null,null,null,null,null,null,null,null,null,null,null,null,"PUNO LAMPA OCUVIRI",0,"PUNO","LAMPA","OCUVIRI","C210705"]
[null,null,null,null,null,null,null,null,null,null,null,null,"PUNO LAMPA PALCA",0,"PUNO","LAMPA","PALCA","C210706"]
[null,null,null,null,null,null,null,null,null,null,null,null,"PUNO LAMPA PARATIA",0,"PUNO","LAMPA","PARATIA","C210707"]
[null,null,null,null,null,null,null,null,null,null,null,null,"PUNO LAMPA PUCARA",0,"PUNO","LAMPA","PUCARA","C210708"]
[null,null,null,null,null,null,null,null,null,null,null,null,"PUNO LAMPA SANTA LUCIA",0,"PUNO","LAMPA","SANTA LUCIA","C210709"]
[null,null,null,null,null,null,null,null,null,null,null,null,"PUNO LAMPA VILAVILA",0,"PUNO","LAMPA","VILAVILA","C210710"]
[null,null,null,null,null,null,null,null,null,null,null,null,"PUNO MELGAR ANTAUTA",0,"PUNO","MELGAR","ANTAUTA","C210802"]
[null,null,null,null,null,null,null,null,null,null,null,null,"PUNO MELGAR AYAVIRI",0,"PUNO","MELGAR","AYAVIRI","C210801"]
[null,null,null,null,null,null,null,null,null,null,null,null,"PUNO MELGAR CUPI",0,"PUNO","MELGAR","CUPI","C210803"]
[null,null,null,null,null,null,null,null,null,null,null,null,"PUNO MELGAR LLALLI",0,"PUNO","MELGAR","LLALLI","C210804"]
[null,null,null,null,null,null,null,null,null,null,null,null,"PUNO MELGAR MACARI",0,"PUNO","MELGAR","MACARI","C210805"]
[null,null,null,null,null,null,null,null,null,null,null,null,"PUNO MELGAR NUÑOA",0,"PUNO","MELGAR","NUÑOA","C210806"]
[null,null,null,null,null,null,null,null,null,null,null,null,"PUNO MELGAR ORURILLO",0,"PUNO","MELGAR","ORURILLO","C210807"]
[null,null,null,null,null,null,null,null,null,null,null,null,"PUNO MELGAR SANTA ROSA",0,"PUNO","MELGAR","SANTA ROSA","C210808"]
[null,null,null,null,null,null,null,null,null,null,null,null,"PUNO MELGAR UMACHIRI",0,"PUNO","MELGAR","UMACHIRI","C210809"]
[null,null,null,null,null,null,null,null,null,null,null,null,"PUNO MOHO CONIMA",0,"PUNO","MOHO","CONIMA","C210902"]
[null,null,null,null,null,null,null,null,null,null,null,null,"PUNO MOHO HUAYRAPATA",0,"PUNO","MOHO","HUAYRAPATA","C210903"]
[null,null,null,null,null,null,null,null,null,null,null,null,"PUNO MOHO MOHO",0,"PUNO","MOHO","MOHO","C210901"]
[null,null,null,null,null,null,null,null,null,null,null,null,"PUNO MOHO TILALI",0,"PUNO","MOHO","TILALI","C210904"]
[null,null,null,null,null,null,null,null,null,null,null,null,"PUNO PUNO ACORA",0,"PUNO","PUNO","ACORA","C210102"]
[null,null,null,null,null,null,null,null,null,null,null,null,"PUNO PUNO AMANTANI",0,"PUNO","PUNO","AMANTANI","C210103"]
[null,null,null,null,null,null,null,null,null,null,null,null,"PUNO PUNO ATUNCOLLA",0,"PUNO","PUNO","ATUNCOLLA","C210104"]
[null,null,null,null,null,null,null,null,null,null,null,null,"PUNO PUNO CAPACHICA",0,"PUNO","PUNO","CAPACHICA","C210105"]
[null,null,null,null,null,null,null,null,null,null,null,null,"PUNO PUNO CHUCUITO",0,"PUNO","PUNO","CHUCUITO","C210106"]
[null,null,null,null,null,null,null,null,null,null,null,null,"PUNO PUNO COATA",0,"PUNO","PUNO","COATA","C210107"]
[null,null,null,null,null,null,null,null,null,null,null,null,"PUNO PUNO HUATA",0,"PUNO","PUNO","HUATA","C210108"]
[null,null,null,null,null,null,null,null,null,null,null,null,"PUNO PUNO MAÑAZO",0,"PUNO","PUNO","MAÑAZO","C210109"]
[null,null,null,null,null,null,null,null,null,null,null,null,"PUNO PUNO PAUCARCOLLA",0,"PUNO","PUNO","PAUCARCOLLA","C210110"]
[null,null,null,null,null,null,null,null,null,null,null,null,"PUNO PUNO PICHACANI",0,"PUNO","PUNO","PICHACANI","C210111"]
[null,null,null,null,null,null,null,null,null,null,null,null,"PUNO PUNO PLATERIA",0,"PUNO","PUNO","PLATERIA","C210112"]
[null,null,null,null,null,null,null,null,null,null,null,null,"PUNO PUNO PUNO",0,"PUNO","PUNO","PUNO","C210101"]
[null,null,null,null,null,null,null,null,null,null,null,null,"PUNO PUNO SAN ANTONIO",0,"PUNO","PUNO","SAN ANTONIO","C210113"]
[null,null,null,null,null,null,null,null,null,null,null,null,"PUNO PUNO TIQUILLACA",0,"PUNO","PUNO","TIQUILLACA","C210114"]
[null,null,null,null,null,null,null,null,null,null,null,null,"PUNO PUNO VILQUE",0,"PUNO","PUNO","VILQUE","C210115"]
[null,null,null,null,null,null,null,null,null,null,null,null,"PUNO SAN ANTONIO DE PUTINA ANANEA",0,"PUNO","SAN ANTONIO DE PUTINA","ANANEA","C211002"]
[null,null,null,null,null,null,null,null,null,null,null,null,"PUNO SAN ANTONIO DE PUTINA PEDRO VILCA APAZA",0,"PUNO","SAN ANTONIO DE PUTINA","PEDRO VILCA APAZA","C211003"]
[null,null,null,null,null,null,null,null,null,null,null,null,"PUNO SAN ANTONIO DE PUTINA PUTINA",0,"PUNO","SAN ANTONIO DE PUTINA","PUTINA","C211001"]
[null,null,null,null,null,null,null,null,null,null,null,null,"PUNO SAN ANTONIO DE PUTINA QUILCAPUNCU",0,"PUNO","SAN ANTONIO DE PUTINA","QUILCAPUNCU","C211004"]
[null,null,null,null,null,null,null,null,null,null,null,null,"PUNO SAN ANTONIO DE PUTINA SINA",0,"PUNO","SAN ANTONIO DE PUTINA","SINA","C211005"]
[null,null,null,null,null,null,null,null,null,null,null,null,"PUNO SAN ROMAN CABANA",0,"PUNO","SAN ROMAN","CABANA","C211102"]
[null,null,null,null,null,null,null,null,null,null,null,null,"PUNO SAN ROMAN CABANILLAS",0,"PUNO","SAN ROMAN","CABANILLAS","C211103"]
[null,null,null,null,null,null,null,null,null,null,null,null,"PUNO SAN ROMAN CARACOTO",0,"PUNO","SAN ROMAN","CARACOTO","C211104"]
[null,null,null,null,null,null,null,null,null,null,null,null,"PUNO SAN ROMAN JULIACA",0,"PUNO","SAN ROMAN","JULIACA","C211101"]
[null,null,null,null,null,null,null,null,null,null,null,null,"PUNO SANDIA ALTO INAMBARI",0,"PUNO","SANDIA","ALTO INAMBARI","C211209"]
[null,null,null,null,null,null,null,null,null,null,null,null,"PUNO SANDIA CUYOCUYO",0,"PUNO","SANDIA","CUYOCUYO","C211202"]
[null,null,null,null,null,null,null,null,null,null,null,null,"PUNO SANDIA LIMBANI",0,"PUNO","SANDIA","LIMBANI","C211203"]
[null,null,null,null,null,null,null,null,null,null,null,null,"PUNO SANDIA PATAMBUCO",0,"PUNO","SANDIA","PATAMBUCO","C211204"]
[null,null,null,null,null,null,null,null,null,null,null,null,"PUNO SANDIA PHARA",0,"PUNO","SANDIA","PHARA","C211205"]
[null,null,null,null,null,null,null,null,null,null,null,null,"PUNO SANDIA QUIACA",0,"PUNO","SANDIA","QUIACA","C211206"]
[null,null,null,null,null,null,null,null,null,null,null,null,"PUNO SANDIA SAN JUAN DEL ORO",0,"PUNO","SANDIA","SAN JUAN DEL ORO","C211207"]
[null,null,null,null,null,null,null,null,null,null,null,null,"PUNO SANDIA SAN PEDRO DE PUTINA PUNCO",0,"PUNO","SANDIA","SAN PEDRO DE PUTINA PUNCO","C211210"]
[null,null,null,null,null,null,null,null,null,null,null,null,"PUNO SANDIA SANDIA",0,"PUNO","SANDIA","SANDIA","C211201"]
[null,null,null,null,null,null,null,null,null,null,null,null,"PUNO SANDIA YANAHUAYA",0,"PUNO","SANDIA","YANAHUAYA","C211208"]
[null,null,null,null,null,null,null,null,null,null,null,null,"PUNO YUNGUYO ANAPIA",0,"PUNO","YUNGUYO","ANAPIA","C211302"]
[null,null,null,null,null,null,null,null,null,null,null,null,"PUNO YUNGUYO COPANI",0,"PUNO","YUNGUYO","COPANI","C211303"]
[null,null,null,null,null,null,null,null,null,null,null,null,"PUNO YUNGUYO CUTURAPI",0,"PUNO","YUNGUYO","CUTURAPI","C211304"]
[null,null,null,null,null,null,null,null,null,null,null,null,"PUNO YUNGUYO OLLARAYA",0,"PUNO","YUNGUYO","OLLARAYA","C211305"]
[null,null,null,null,null,null,null,null,null,null,null,null,"PUNO YUNGUYO TINICACHI",0,"PUNO","YUNGUYO","TINICACHI","C211306"]
[null,null,null,null,null,null,null,null,null,null,null,null,"PUNO YUNGUYO UNICACHI",0,"PUNO","YUNGUYO","UNICACHI","C211307"]
[null,null,null,null,null,null,null,null,null,null,null,null,"PUNO YUNGUYO YUNGUYO",0,"PUNO","YUNGUYO","YUNGUYO","C211301"]
[null,null,null,null,null,null,null,null,null,null,null,null,"SAN MARTIN BELLAVISTA ALTO BIAVO",0,"SAN MARTIN","BELLAVISTA","ALTO BIAVO","C220202"]
[null,null,null,null,null,null,null,null,null,null,null,null,{"$f":"O1731&\" \"&P1731&\" \"&Q1731","v":"SAN MARTIN BELLAVISTA BAJO BIAVO"},{"$f":"IF(AND($D$9=O1731,$D$10=P1731),N1730+1,0)","v":0},"SAN MARTIN","BELLAVISTA","BAJO BIAVO","C220203"]
[null,null,null,null,null,null,null,null,null,null,null,null,"SAN MARTIN BELLAVISTA BELLAVISTA",0,"SAN MARTIN","BELLAVISTA","BELLAVISTA","C220201"]
[null,null,null,null,null,null,null,null,null,null,null,null,"SAN MARTIN BELLAVISTA HUALLAGA",0,"SAN MARTIN","BELLAVISTA","HUALLAGA","C220204"]
[null,null,null,null,null,null,null,null,null,null,null,null,"SAN MARTIN BELLAVISTA SAN PABLO",0,"SAN MARTIN","BELLAVISTA","SAN PABLO","C220205"]
[null,null,null,null,null,null,null,null,null,null,null,null,"SAN MARTIN BELLAVISTA SAN RAFAEL",0,"SAN MARTIN","BELLAVISTA","SAN RAFAEL","C220206"]
[null,null,null,null,null,null,null,null,null,null,null,null,"SAN MARTIN EL DORADO AGUA BLANCA",0,"SAN MARTIN","EL DORADO","AGUA BLANCA","C220302"]
[null,null,null,null,null,null,null,null,null,null,null,null,"SAN MARTIN EL DORADO SAN JOSE DE SISA",0,"SAN MARTIN","EL DORADO","SAN JOSE DE SISA","C220301"]
[null,null,null,null,null,null,null,null,null,null,null,null,"SAN MARTIN EL DORADO SAN MARTIN",0,"SAN MARTIN","EL DORADO","SAN MARTIN","C220303"]
[null,null,null,null,null,null,null,null,null,null,null,null,"SAN MARTIN EL DORADO SANTA ROSA",0,"SAN MARTIN","EL DORADO","SANTA ROSA","C220304"]
[null,null,null,null,null,null,null,null,null,null,null,null,"SAN MARTIN EL DORADO SHATOJA",0,"SAN MARTIN","EL DORADO","SHATOJA","C220305"]
[null,null,null,null,null,null,null,null,null,null,null,null,"SAN MARTIN HUALLAGA ALTO SAPOSOA",0,"SAN MARTIN","HUALLAGA","ALTO SAPOSOA","C220402"]
[null,null,null,null,null,null,null,null,null,null,null,null,"SAN MARTIN HUALLAGA EL ESLABON",0,"SAN MARTIN","HUALLAGA","EL ESLABON","C220403"]
[null,null,null,null,null,null,null,null,null,null,null,null,"SAN MARTIN HUALLAGA PISCOYACU",0,"SAN MARTIN","HUALLAGA","PISCOYACU","C220404"]
[null,null,null,null,null,null,null,null,null,null,null,null,"SAN MARTIN HUALLAGA SACANCHE",0,"SAN MARTIN","HUALLAGA","SACANCHE","C220405"]
[null,null,null,null,null,null,null,null,null,null,null,null,"SAN MARTIN HUALLAGA SAPOSOA",0,"SAN MARTIN","HUALLAGA","SAPOSOA","C220401"]
[null,null,null,null,null,null,null,null,null,null,null,null,"SAN MARTIN HUALLAGA TINGO DE SAPOSOA",0,"SAN MARTIN","HUALLAGA","TINGO DE SAPOSOA","C220406"]
[null,null,null,null,null,null,null,null,null,null,null,null,"SAN MARTIN LAMAS ALONSO DE ALVARADO",0,"SAN MARTIN","LAMAS","ALONSO DE ALVARADO","C220502"]
[null,null,null,null,null,null,null,null,null,null,null,null,"SAN MARTIN LAMAS BARRANQUITA",0,"SAN MARTIN","LAMAS","BARRANQUITA","C220503"]
[null,null,null,null,null,null,null,null,null,null,null,null,"SAN MARTIN LAMAS CAYNARACHI",0,"SAN MARTIN","LAMAS","CAYNARACHI","C220504"]
[null,null,null,null,null,null,null,null,null,null,null,null,"SAN MARTIN LAMAS CUÑUMBUQUI",0,"SAN MARTIN","LAMAS","CUÑUMBUQUI","C220505"]
[null,null,null,null,null,null,null,null,null,null,null,null,"SAN MARTIN LAMAS LAMAS",0,"SAN MARTIN","LAMAS","LAMAS","C220501"]
[null,null,null,null,null,null,null,null,null,null,null,null,"SAN MARTIN LAMAS PINTO RECODO",0,"SAN MARTIN","LAMAS","PINTO RECODO","C220506"]
[null,null,null,null,null,null,null,null,null,null,null,null,"SAN MARTIN LAMAS RUMISAPA",0,"SAN MARTIN","LAMAS","RUMISAPA","C220507"]
[null,null,null,null,null,null,null,null,null,null,null,null,"SAN MARTIN LAMAS SAN ROQUE DE CUMBAZA",0,"SAN MARTIN","LAMAS","SAN ROQUE DE CUMBAZA","C220508"]
[null,null,null,null,null,null,null,null,null,null,null,null,"SAN MARTIN LAMAS SHANAO",0,"SAN MARTIN","LAMAS","SHANAO","C220509"]
[null,null,null,null,null,null,null,null,null,null,null,null,"SAN MARTIN LAMAS TABALOSOS",0,"SAN MARTIN","LAMAS","TABALOSOS","C220510"]
[null,null,null,null,null,null,null,null,null,null,null,null,"SAN MARTIN LAMAS ZAPATERO",0,"SAN MARTIN","LAMAS","ZAPATERO","C220511"]
[null,null,null,null,null,null,null,null,null,null,null,null,"SAN MARTIN MARISCAL CACERES CAMPANILLA",0,"SAN MARTIN","MARISCAL CACERES","CAMPANILLA","C220602"]
[null,null,null,null,null,null,null,null,null,null,null,null,"SAN MARTIN MARISCAL CACERES HUICUNGO",0,"SAN MARTIN","MARISCAL CACERES","HUICUNGO","C220603"]
[null,null,null,null,null,null,null,null,null,null,null,null,"SAN MARTIN MARISCAL CACERES JUANJUI",0,"SAN MARTIN","MARISCAL CACERES","JUANJUI","C220601"]
[null,null,null,null,null,null,null,null,null,null,null,null,"SAN MARTIN MARISCAL CACERES PACHIZA",0,"SAN MARTIN","MARISCAL CACERES","PACHIZA","C220604"]
[null,null,null,null,null,null,null,null,null,null,null,null,"SAN MARTIN MARISCAL CACERES PAJARILLO",0,"SAN MARTIN","MARISCAL CACERES","PAJARILLO","C220605"]
[null,null,null,null,null,null,null,null,null,null,null,null,"SAN MARTIN MOYOBAMBA CALZADA",0,"SAN MARTIN","MOYOBAMBA","CALZADA","C220102"]
[null,null,null,null,null,null,null,null,null,null,null,null,"SAN MARTIN MOYOBAMBA HABANA",0,"SAN MARTIN","MOYOBAMBA","HABANA","C220103"]
[null,null,null,null,null,null,null,null,null,null,null,null,"SAN MARTIN MOYOBAMBA JEPELACIO",0,"SAN MARTIN","MOYOBAMBA","JEPELACIO","C220104"]
[null,null,null,null,null,null,null,null,null,null,null,null,"SAN MARTIN MOYOBAMBA MOYOBAMBA",0,"SAN MARTIN","MOYOBAMBA","MOYOBAMBA","C220101"]
[null,null,null,null,null,null,null,null,null,null,null,null,"SAN MARTIN MOYOBAMBA SORITOR",0,"SAN MARTIN","MOYOBAMBA","SORITOR","C220105"]
[null,null,null,null,null,null,null,null,null,null,null,null,"SAN MARTIN MOYOBAMBA YANTALO",0,"SAN MARTIN","MOYOBAMBA","YANTALO","C220106"]
[null,null,null,null,null,null,null,null,null,null,null,null,"SAN MARTIN PICOTA BUENOS AIRES",0,"SAN MARTIN","PICOTA","BUENOS AIRES","C220702"]
[null,null,null,null,null,null,null,null,null,null,null,null,"SAN MARTIN PICOTA CASPISAPA",0,"SAN MARTIN","PICOTA","CASPISAPA","C220703"]
[null,null,null,null,null,null,null,null,null,null,null,null,"SAN MARTIN PICOTA PICOTA",0,"SAN MARTIN","PICOTA","PICOTA","C220701"]
[null,null,null,null,null,null,null,null,null,null,null,null,"SAN MARTIN PICOTA PILLUANA",0,"SAN MARTIN","PICOTA","PILLUANA","C220704"]
[null,null,null,null,null,null,null,null,null,null,null,null,"SAN MARTIN PICOTA PUCACACA",0,"SAN MARTIN","PICOTA","PUCACACA","C220705"]
[null,null,null,null,null,null,null,null,null,null,null,null,"SAN MARTIN PICOTA SAN CRISTOBAL",0,"SAN MARTIN","PICOTA","SAN CRISTOBAL","C220706"]
[null,null,null,null,null,null,null,null,null,null,null,null,"SAN MARTIN PICOTA SAN HILARION",0,"SAN MARTIN","PICOTA","SAN HILARION","C220707"]
[null,null,null,null,null,null,null,null,null,null,null,null,"SAN MARTIN PICOTA SHAMBOYACU",0,"SAN MARTIN","PICOTA","SHAMBOYACU","C220708"]
[null,null,null,null,null,null,null,null,null,null,null,null,"SAN MARTIN PICOTA TINGO DE PONASA",0,"SAN MARTIN","PICOTA","TINGO DE PONASA","C220709"]
[null,null,null,null,null,null,null,null,null,null,null,null,"SAN MARTIN PICOTA TRES UNIDOS",0,"SAN MARTIN","PICOTA","TRES UNIDOS","C220710"]
[null,null,null,null,null,null,null,null,null,null,null,null,"SAN MARTIN RIOJA AWAJUN",0,"SAN MARTIN","RIOJA","AWAJUN","C220802"]
[null,null,null,null,null,null,null,null,null,null,null,null,"SAN MARTIN RIOJA ELIAS SOPLIN VARGAS",0,"SAN MARTIN","RIOJA","ELIAS SOPLIN VARGAS","C220803"]
[null,null,null,null,null,null,null,null,null,null,null,null,"SAN MARTIN RIOJA NUEVA CAJAMARCA",0,"SAN MARTIN","RIOJA","NUEVA CAJAMARCA","C220804"]
[null,null,null,null,null,null,null,null,null,null,null,null,"SAN MARTIN RIOJA PARDO MIGUEL",0,"SAN MARTIN","RIOJA","PARDO MIGUEL","C220805"]
[null,null,null,null,null,null,null,null,null,null,null,null,"SAN MARTIN RIOJA POSIC",0,"SAN MARTIN","RIOJA","POSIC","C220806"]
[null,null,null,null,null,null,null,null,null,null,null,null,"SAN MARTIN RIOJA RIOJA",0,"SAN MARTIN","RIOJA","RIOJA","C220801"]
[null,null,null,null,null,null,null,null,null,null,null,null,"SAN MARTIN RIOJA SAN FERNANDO",0,"SAN MARTIN","RIOJA","SAN FERNANDO","C220807"]
[null,null,null,null,null,null,null,null,null,null,null,null,"SAN MARTIN RIOJA YORONGOS",0,"SAN MARTIN","RIOJA","YORONGOS","C220808"]
[null,null,null,null,null,null,null,null,null,null,null,null,"SAN MARTIN RIOJA YURACYACU",0,"SAN MARTIN","RIOJA","YURACYACU","C220809"]
[null,null,null,null,null,null,null,null,null,null,null,null,"SAN MARTIN SAN MARTIN ALBERTO LEVEAU",0,"SAN MARTIN","SAN MARTIN","ALBERTO LEVEAU","C220902"]
[null,null,null,null,null,null,null,null,null,null,null,null,"SAN MARTIN SAN MARTIN CACATACHI",0,"SAN MARTIN","SAN MARTIN","CACATACHI","C220903"]
[null,null,null,null,null,null,null,null,null,null,null,null,"SAN MARTIN SAN MARTIN CHAZUTA",0,"SAN MARTIN","SAN MARTIN","CHAZUTA","C220904"]
[null,null,null,null,null,null,null,null,null,null,null,null,"SAN MARTIN SAN MARTIN CHIPURANA",0,"SAN MARTIN","SAN MARTIN","CHIPURANA","C220905"]
[null,null,null,null,null,null,null,null,null,null,null,null,"SAN MARTIN SAN MARTIN EL PORVENIR",0,"SAN MARTIN","SAN MARTIN","EL PORVENIR","C220906"]
[null,null,null,null,null,null,null,null,null,null,null,null,"SAN MARTIN SAN MARTIN HUIMBAYOC",0,"SAN MARTIN","SAN MARTIN","HUIMBAYOC","C220907"]
[null,null,null,null,null,null,null,null,null,null,null,null,"SAN MARTIN SAN MARTIN JUAN GUERRA",0,"SAN MARTIN","SAN MARTIN","JUAN GUERRA","C220908"]
[null,null,null,null,null,null,null,null,null,null,null,null,{"$f":"O1795&\" \"&P1795&\" \"&Q1795","v":"SAN MARTIN SAN MARTIN LA BANDA DE SHILCAYO"},{"$f":"IF(AND($D$9=O1795,$D$10=P1795),N1794+1,0)","v":0},"SAN MARTIN","SAN MARTIN","LA BANDA DE SHILCAYO","C220909"]
[null,null,null,null,null,null,null,null,null,null,null,null,"SAN MARTIN SAN MARTIN MORALES",0,"SAN MARTIN","SAN MARTIN","MORALES","C220910"]
[null,null,null,null,null,null,null,null,null,null,null,null,"SAN MARTIN SAN MARTIN PAPAPLAYA",0,"SAN MARTIN","SAN MARTIN","PAPAPLAYA","C220911"]
[null,null,null,null,null,null,null,null,null,null,null,null,"SAN MARTIN SAN MARTIN SAN ANTONIO",0,"SAN MARTIN","SAN MARTIN","SAN ANTONIO","C220912"]
[null,null,null,null,null,null,null,null,null,null,null,null,"SAN MARTIN SAN MARTIN SAUCE",0,"SAN MARTIN","SAN MARTIN","SAUCE","C220913"]
[null,null,null,null,null,null,null,null,null,null,null,null,"SAN MARTIN SAN MARTIN SHAPAJA",0,"SAN MARTIN","SAN MARTIN","SHAPAJA","C220914"]
[null,null,null,null,null,null,null,null,null,null,null,null,"SAN MARTIN SAN MARTIN TARAPOTO",0,"SAN MARTIN","SAN MARTIN","TARAPOTO","C220901"]
[null,null,null,null,null,null,null,null,null,null,null,null,"SAN MARTIN TOCACHE NUEVO PROGRESO",0,"SAN MARTIN","TOCACHE","NUEVO PROGRESO","C221002"]
[null,null,null,null,null,null,null,null,null,null,null,null,"SAN MARTIN TOCACHE POLVORA",0,"SAN MARTIN","TOCACHE","POLVORA","C221003"]
[null,null,null,null,null,null,null,null,null,null,null,null,"SAN MARTIN TOCACHE SHUNTE",0,"SAN MARTIN","TOCACHE","SHUNTE","C221004"]
[null,null,null,null,null,null,null,null,null,null,null,null,"SAN MARTIN TOCACHE TOCACHE",0,"SAN MARTIN","TOCACHE","TOCACHE","C221001"]
[null,null,null,null,null,null,null,null,null,null,null,null,"SAN MARTIN TOCACHE UCHIZA",0,"SAN MARTIN","TOCACHE","UCHIZA","C221005"]
[null,null,null,null,null,null,null,null,null,null,null,null,"TACNA CANDARAVE CAIRANI",0,"TACNA","CANDARAVE","CAIRANI","C230202"]
[null,null,null,null,null,null,null,null,null,null,null,null,"TACNA CANDARAVE CAMILACA",0,"TACNA","CANDARAVE","CAMILACA","C230203"]
[null,null,null,null,null,null,null,null,null,null,null,null,"TACNA CANDARAVE CANDARAVE",0,"TACNA","CANDARAVE","CANDARAVE","C230201"]
[null,null,null,null,null,null,null,null,null,null,null,null,"TACNA CANDARAVE CURIBAYA",0,"TACNA","CANDARAVE","CURIBAYA","C230204"]
[null,null,null,null,null,null,null,null,null,null,null,null,"TACNA CANDARAVE HUANUARA",0,"TACNA","CANDARAVE","HUANUARA","C230205"]
[null,null,null,null,null,null,null,null,null,null,null,null,"TACNA CANDARAVE QUILAHUANI",0,"TACNA","CANDARAVE","QUILAHUANI","C230206"]
[null,null,null,null,null,null,null,null,null,null,null,null,"TACNA JORGE BASADRE ILABAYA",0,"TACNA","JORGE BASADRE","ILABAYA","C230302"]
[null,null,null,null,null,null,null,null,null,null,null,null,"TACNA JORGE BASADRE ITE",0,"TACNA","JORGE BASADRE","ITE","C230303"]
[null,null,null,null,null,null,null,null,null,null,null,null,"TACNA JORGE BASADRE LOCUMBA",0,"TACNA","JORGE BASADRE","LOCUMBA","C230301"]
[null,null,null,null,null,null,null,null,null,null,null,null,"TACNA TACNA ALTO DE LA ALIANZA",0,"TACNA","TACNA","ALTO DE LA ALIANZA","C230102"]
[null,null,null,null,null,null,null,null,null,null,null,null,"TACNA TACNA CALANA",0,"TACNA","TACNA","CALANA","C230103"]
[null,null,null,null,null,null,null,null,null,null,null,null,"TACNA TACNA CIUDAD NUEVA",0,"TACNA","TACNA","CIUDAD NUEVA","C230104"]
[null,null,null,null,null,null,null,null,null,null,null,null,"TACNA TACNA CORONEL GREGORIO ALBARRACIN LANCHIPA",0,"TACNA","TACNA","CORONEL GREGORIO ALBARRACIN LANCHIPA","C230110"]
[null,null,null,null,null,null,null,null,null,null,null,null,"TACNA TACNA INCLAN",0,"TACNA","TACNA","INCLAN","C230105"]
[null,null,null,null,null,null,null,null,null,null,null,null,"TACNA TACNA LA YARADA LOS PALOS",0,"TACNA","TACNA","LA YARADA LOS PALOS","C230111"]
[null,null,null,null,null,null,null,null,null,null,null,null,"TACNA TACNA PACHIA",0,"TACNA","TACNA","PACHIA","C230106"]
[null,null,null,null,null,null,null,null,null,null,null,null,"TACNA TACNA PALCA",0,"TACNA","TACNA","PALCA","C230107"]
[null,null,null,null,null,null,null,null,null,null,null,null,"TACNA TACNA POCOLLAY",0,"TACNA","TACNA","POCOLLAY","C230108"]
[null,null,null,null,null,null,null,null,null,null,null,null,"TACNA TACNA SAMA",0,"TACNA","TACNA","SAMA","C230109"]
[null,null,null,null,null,null,null,null,null,null,null,null,"TACNA TACNA TACNA",0,"TACNA","TACNA","TACNA","C230101"]
[null,null,null,null,null,null,null,null,null,null,null,null,"TACNA TARATA ESTIQUE",0,"TACNA","TARATA","ESTIQUE","C230403"]
[null,null,null,null,null,null,null,null,null,null,null,null,"TACNA TARATA ESTIQUE-PAMPA",0,"TACNA","TARATA","ESTIQUE-PAMPA","C230404"]
[null,null,null,null,null,null,null,null,null,null,null,null,"TACNA TARATA HEROES ALBARRACIN",0,"TACNA","TARATA","HEROES ALBARRACIN","C230402"]
[null,null,null,null,null,null,null,null,null,null,null,null,"TACNA TARATA SITAJARA",0,"TACNA","TARATA","SITAJARA","C230405"]
[null,null,null,null,null,null,null,null,null,null,null,null,"TACNA TARATA SUSAPAYA",0,"TACNA","TARATA","SUSAPAYA","C230406"]
[null,null,null,null,null,null,null,null,null,null,null,null,"TACNA TARATA TARATA",0,"TACNA","TARATA","TARATA","C230401"]
[null,null,null,null,null,null,null,null,null,null,null,null,"TACNA TARATA TARUCACHI",0,"TACNA","TARATA","TARUCACHI","C230407"]
[null,null,null,null,null,null,null,null,null,null,null,null,"TACNA TARATA TICACO",0,"TACNA","TARATA","TICACO","C230408"]
[null,null,null,null,null,null,null,null,null,null,null,null,"TUMBES CONTRALMIRANTE VILLAR CANOAS DE PUNTA SAL",0,"TUMBES","CONTRALMIRANTE VILLAR","CANOAS DE PUNTA SAL","C240203"]
[null,null,null,null,null,null,null,null,null,null,null,null,"TUMBES CONTRALMIRANTE VILLAR CASITAS",0,"TUMBES","CONTRALMIRANTE VILLAR","CASITAS","C240202"]
[null,null,null,null,null,null,null,null,null,null,null,null,"TUMBES CONTRALMIRANTE VILLAR ZORRITOS",0,"TUMBES","CONTRALMIRANTE VILLAR","ZORRITOS","C240201"]
[null,null,null,null,null,null,null,null,null,null,null,null,"TUMBES TUMBES CORRALES",0,"TUMBES","TUMBES","CORRALES","C240102"]
[null,null,null,null,null,null,null,null,null,null,null,null,"TUMBES TUMBES LA CRUZ",0,"TUMBES","TUMBES","LA CRUZ","C240103"]
[null,null,null,null,null,null,null,null,null,null,null,null,"TUMBES TUMBES PAMPAS DE HOSPITAL",0,"TUMBES","TUMBES","PAMPAS DE HOSPITAL","C240104"]
[null,null,null,null,null,null,null,null,null,null,null,null,"TUMBES TUMBES SAN JACINTO",0,"TUMBES","TUMBES","SAN JACINTO","C240105"]
[null,null,null,null,null,null,null,null,null,null,null,null,"TUMBES TUMBES SAN JUAN DE LA VIRGEN",0,"TUMBES","TUMBES","SAN JUAN DE LA VIRGEN","C240106"]
[null,null,null,null,null,null,null,null,null,null,null,null,"TUMBES TUMBES TUMBES",0,"TUMBES","TUMBES","TUMBES","C240101"]
[null,null,null,null,null,null,null,null,null,null,null,null,"TUMBES ZARUMILLA AGUAS VERDES",0,"TUMBES","ZARUMILLA","AGUAS VERDES","C240302"]
[null,null,null,null,null,null,null,null,null,null,null,null,"TUMBES ZARUMILLA MATAPALO",0,"TUMBES","ZARUMILLA","MATAPALO","C240303"]
[null,null,null,null,null,null,null,null,null,null,null,null,"TUMBES ZARUMILLA PAPAYAL",0,"TUMBES","ZARUMILLA","PAPAYAL","C240304"]
[null,null,null,null,null,null,null,null,null,null,null,null,"TUMBES ZARUMILLA ZARUMILLA",0,"TUMBES","ZARUMILLA","ZARUMILLA","C240301"]
[null,null,null,null,null,null,null,null,null,null,null,null,"UCAYALI ATALAYA RAYMONDI",0,"UCAYALI","ATALAYA","RAYMONDI","C250201"]
[null,null,null,null,null,null,null,null,null,null,null,null,"UCAYALI ATALAYA SEPAHUA",0,"UCAYALI","ATALAYA","SEPAHUA","C250202"]
[null,null,null,null,null,null,null,null,null,null,null,null,"UCAYALI ATALAYA TAHUANIA",0,"UCAYALI","ATALAYA","TAHUANIA","C250203"]
[null,null,null,null,null,null,null,null,null,null,null,null,"UCAYALI ATALAYA YURUA",0,"UCAYALI","ATALAYA","YURUA","C250204"]
[null,null,null,null,null,null,null,null,null,null,null,null,"UCAYALI CORONEL PORTILLO CALLERIA",0,"UCAYALI","CORONEL PORTILLO","CALLERIA","C250101"]
[null,null,null,null,null,null,null,null,null,null,null,null,"UCAYALI CORONEL PORTILLO CAMPOVERDE",0,"UCAYALI","CORONEL PORTILLO","CAMPOVERDE","C250102"]
[null,null,null,null,null,null,null,null,null,null,null,null,"UCAYALI CORONEL PORTILLO IPARIA",0,"UCAYALI","CORONEL PORTILLO","IPARIA","C250103"]
[null,null,null,null,null,null,null,null,null,null,null,null,"UCAYALI CORONEL PORTILLO MANANTAY",0,"UCAYALI","CORONEL PORTILLO","MANANTAY","C250107"]
[null,null,null,null,null,null,null,null,null,null,null,null,"UCAYALI CORONEL PORTILLO MASISEA",0,"UCAYALI","CORONEL PORTILLO","MASISEA","C250104"]
[null,null,null,null,null,null,null,null,null,null,null,null,"UCAYALI CORONEL PORTILLO NUEVA REQUENA",0,"UCAYALI","CORONEL PORTILLO","NUEVA REQUENA","C250106"]
[null,null,null,null,null,null,null,null,null,null,null,null,"UCAYALI CORONEL PORTILLO YARINACOCHA",0,"UCAYALI","CORONEL PORTILLO","YARINACOCHA","C250105"]
[null,null,null,null,null,null,null,null,null,null,null,null,{"$f":"O1859&\" \"&P1859&\" \"&Q1859","v":"UCAYALI PADRE ABAD ALEXANDER VON HUMBOLDT"},{"$f":"IF(AND($D$9=O1859,$D$10=P1859),N1858+1,0)","v":0},"UCAYALI","PADRE ABAD","ALEXANDER VON HUMBOLDT","C250305"]
[null,null,null,null,null,null,null,null,null,null,null,null,"UCAYALI PADRE ABAD CURIMANA",0,"UCAYALI","PADRE ABAD","CURIMANA","C250303"]
[null,null,null,null,null,null,null,null,null,null,null,null,"UCAYALI PADRE ABAD IRAZOLA",0,"UCAYALI","PADRE ABAD","IRAZOLA","C250302"]
[null,null,null,null,null,null,null,null,null,null,null,null,"UCAYALI PADRE ABAD NESHUYA",0,"UCAYALI","PADRE ABAD","NESHUYA","C250304"]
[null,null,null,null,null,null,null,null,null,null,null,null,"UCAYALI PADRE ABAD PADRE ABAD",0,"UCAYALI","PADRE ABAD","PADRE ABAD","C250301"]
[null,null,null,null,null,null,null,null,null,null,null,null,"UCAYALI PURUS PURUS",0,"UCAYALI","PURUS","PURUS","C250401"]