{"text_format":"1","workbook":"xlsx","n_sheets":13,"sheets":["ING","DECLA","ADI","MATRIZ","MOD1","MOD2","MOD3","MOD4","MOD5","MOD6","CONFIRM","LISTAS","ENVIO"],"not_rendered":{"charts":0,"images":8,"macros":1,"external_links":0,"defined_names":13,"comments":0,"pivot_tables":0},"unopened":[],"bounds":{"document_bytes":16777216,"sheet_cells":100000,"rows_first":2000,"rows_last":500,"rows_between":2000,"halvings":0,"cell_chars":16384,"cell_head_chars":4096},"cells_cut":0,"cells_raw":0,"read":"whole","date_system":"1900"}

{"sheet":"ING","index":0,"n_rows":43,"n_cols":51,"rows_kept":43,"cut":false,"hidden":false,"merged":[[6,48,6,49],[29,43,29,48],[29,3,29,42],[26,10,27,31],[17,48,18,49],[7,48,7,49],[10,3,10,18],[10,21,10,36],[13,39,13,48],[13,21,13,36],[23,3,23,36],[26,3,27,9],[26,37,26,42],[26,43,26,48],[10,39,10,48],[27,46,27,48],[27,43,27,45],[27,37,27,39],[27,40,27,42],[39,44,40,45],[39,46,40,47],[28,46,28,48],[30,3,30,42],[30,43,30,48],[28,3,28,9],[28,43,28,45],[28,37,28,39],[28,40,28,42],[32,3,32,36],[36,11,36,16],[36,19,36,24],[20,3,20,18],[20,21,20,36],[39,18,40,19],[39,20,40,21],[39,22,40,23],[39,24,40,25],[39,36,40,37],[39,26,40,27],[39,28,40,29],[39,12,40,13],[26,32,27,36],[28,32,28,36],[28,10,28,31],[36,27,36,32],[36,4,36,8],[4,2,4,49],[39,2,40,3],[39,4,40,5],[39,6,40,7],[39,8,40,9],[39,10,40,11],[39,30,40,31],[39,32,40,33],[39,34,40,35],[39,14,40,15],[39,16,40,17],[13,3,13,18],[39,48,40,49],[39,38,40,39],[39,40,40,41],[39,42,40,43]]}
[{"$f":"NOT(OR(IIEE_G=\"Seleccionar\",IIEE_N=\"Seleccionar\",IIEE_T=\"Seleccionar\"))","v":true}]
[]
[]
[]
[null,null,"BIENVENIDO"]
[]
[null,null,null,null,null,null,null,null,null,null,null,null,null,null,null,null,null,null,null,null,null,null,null,null,null,null,null,null,null,null,null,null,null,null,null,null,null,null,null,null,null,null,null,null,null,null,null,null,{"$f":"IF(AND($D$11<>\"\",$AA$11<>\"\",$V$14<>\"\",$I$14<>\"\"),CHAR(97),\"\")","v":""}]
[null,null,"Datos del director de la Institución Educativa:",null,null,null,null,null,null,null,null,null,null,null,null,null,null,null,null,null,null,null,null,null,null,null,null,null,null,null,null,null,null,null,null,null,null,null,null,null,null,null,null,null,null,null,null,null,{"$f":"IF(AND($D$11<>\"\",$AA$11<>\"\",$V$14<>\"\",$I$14<>\"\"),CHAR(97),\"\")","v":""}]
{"$rows_left_out":36}
{"sheet":"DECLA","index":1,"n_rows":35,"n_cols":127,"rows_kept":35,"cut":false,"hidden":true,"merged":[[10,2,30,34],[6,2,7,34]]}
[]
[null,null,null,null,null,null,null,null,null,null,null,null,null,null,null,null,null,null,null,null,null,null,null,null,null,null,null,null,null,null,null,null,null,null,null,null,null,null,null,null,null,null,null,null,null,null,null,null,null,null,null,null,null,null,null,null,null,null,null,null,null,null,null,null,null,null,null,null,null,null,null,null,null,null,null,null,null,null,null,null,null,null,null,null,null,null,null,null,null,null,null,null,null,null,null,null,null,null,null,null,null,null,null,null,null,null,null,null,null,null,null,null,null,null,null,null,null,null,null,null,null,null,null,null,null,null,{"$f":"DECLA!P27","v":0}]
[]
[]
[]
[]
[null,null,"DECLARACIÓN JURADA"]
[]
{"$rows_left_out":28}
{"sheet":"ADI","index":2,"n_rows":45,"n_cols":45,"rows_kept":45,"cut":false,"hidden":true,"merged":[[41,33,42,34],[10,32,23,37],[10,38,23,43],[25,38,38,43],[25,32,38,37],[24,32,24,37],[24,38,24,43],[24,2,24,31],[9,32,9,37],[44,42,45,43],[44,40,45,41],[44,38,45,39],[44,36,45,37],[44,34,45,35],[44,30,45,31],[44,18,45,19],[44,20,45,21],[44,22,45,23],[44,24,45,25],[44,26,45,27],[44,28,45,29],[9,38,9,43],[44,32,45,33],[41,2,42,31],[44,2,45,3],[44,4,45,5],[44,6,45,7],[44,8,45,9],[44,10,45,11],[44,12,45,13],[44,14,45,15],[44,16,45,17],[35,2,38,7],[35,8,38,13],[35,14,38,19],[35,20,38,25],[35,26,38,31],[33,8,34,13],[33,14,34,19],[33,20,34,25],[33,26,34,31],[25,2,34,7],[25,8,32,13],[25,14,32,19],[25,20,32,25],[25,26,32,31],[20,2,23,7],[20,8,23,13],[20,14,23,19],[20,20,23,25],[20,26,23,31],[7,2,8,43],[18,8,19,13],[18,14,19,19],[18,20,19,25],[18,26,19,31],[10,2,19,7],[10,8,17,13],[10,14,17,19],[10,20,17,25],[10,26,17,31],[9,2,9,31]]}
[{"$f":"IF(AM10=1,IF(AM25=1,COUNTIF(I19:AF20,\"SI\")+COUNTIF(I19:AF20,\"NO\")+COUNTIF(I34:AF35,\"SI\")+COUNTIF(I34:AF35,\"NO\"),COUNTIF(I19:AF20,\"SI\")+COUNTIF(I19:AF20,\"NO\")),IF(AM25=1,COUNTIF(I34:AF35,\"SI\")+COUNTIF(I34:AF35,\"NO\"),0))=IF(AM10=1,IF(AM25=1,8,4),IF(AM25=1,4,100))","v":false}]
[null,null,null,null,null,null,null,null,null,null,null,null,null,null,null,null,null,null,null,null,null,null,null,null,null,null,null,null,null,null,null,null,null,null,null,null,null,null,null,null,null,null,null,null,{"$f":"IF(ING!$AY$2=\"\",\"\",ING!$AY$2)","v":""}]
[]
[]
[]
[]
[]
[null,null,"Antes de completar la matriz, sírvase a contestar las siguientes dos preguntas (no forman parte de la evaluación final)"]
{"$rows_left_out":38}
{"sheet":"MATRIZ","index":3,"n_rows":50,"n_cols":51,"rows_kept":50,"cut":false,"hidden":true,"merged":[[40,47,41,48],[25,15,26,16],[40,19,41,30],[40,31,41,32],[25,47,26,48],[25,3,26,14],[40,3,41,14],[40,15,41,16],[25,19,26,30],[25,35,26,46],[40,35,41,46],[8,2,9,49],[10,3,12,48],[25,31,26,32],[46,38,47,39],[46,16,47,17],[46,18,47,19],[46,20,47,21],[46,22,47,23],[46,26,47,27],[46,28,47,29],[46,30,47,31],[46,32,47,33],[46,34,47,35],[46,36,47,37],[46,2,47,3],[46,4,47,5],[46,6,47,7],[46,8,47,9],[46,24,47,25],[46,12,47,13],[46,14,47,15],[46,10,47,11],[43,41,44,48],[46,46,47,47],[46,48,47,49],[46,40,47,41],[46,42,47,43],[46,44,47,45]]}
[{"$f":"LEN(P26&AF26&AV26&P41&AF41&AV41)=6","v":false}]
[null,null,null,null,null,null,null,null,null,null,null,null,null,null,null,null,null,null,null,null,null,null,null,null,null,null,null,null,null,null,null,null,null,null,null,null,null,null,null,null,null,null,null,null,null,null,null,null,null,null,{"$f":"IF(ING!$AY$2=\"\",\"\",ING!$AY$2)","v":""}]
[]
[]
[]
[]
[]
[]
{"$rows_left_out":43}
{"sheet":"MOD1","index":4,"n_rows":63,"n_cols":47,"rows_kept":63,"cut":false,"hidden":true,"merged":[[11,14,18,19],[11,26,18,31],[19,26,20,31],[11,20,18,25],[19,20,20,25],[62,40,63,41],[62,42,63,43],[62,44,63,45],[62,32,63,33],[62,34,63,35],[62,36,63,37],[62,38,63,39],[59,33,60,34],[21,38,24,45],[11,32,24,37],[11,38,20,45],[43,32,56,37],[43,38,52,45],[53,38,56,45],[27,32,40,37],[27,38,36,45],[37,38,40,45],[41,32,42,37],[41,38,42,45],[62,2,63,3],[62,4,63,5],[62,6,63,7],[62,8,63,9],[62,10,63,11],[21,14,24,19],[21,20,24,25],[59,2,60,31],[21,2,24,7],[21,26,24,31],[43,2,52,7],[43,8,50,13],[43,14,50,19],[43,20,50,25],[43,26,50,31],[51,8,52,13],[51,14,52,19],[51,20,52,25],[51,26,52,31],[53,2,56,7],[53,8,56,13],[62,28,63,29],[62,30,63,31],[7,2,8,45],[11,2,20,7],[9,38,10,45],[9,2,10,7],[10,8,10,13],[10,14,10,19],[10,20,10,25],[9,8,9,31],[10,26,10,31],[9,32,10,37],[19,14,20,19],[11,8,18,13],[19,8,20,13],[21,8,24,13],[62,12,63,13],[62,14,63,15],[62,16,63,17],[62,26,63,27],[62,24,63,25],[62,20,63,21],[62,22,63,23],[62,18,63,19],[53,14,56,19],[53,20,56,25],[53,26,56,31],[37,2,40,7],[37,8,40,15],[37,16,40,23],[37,24,40,31],[41,2,42,7],[41,8,41,31],[42,8,42,13],[42,14,42,19],[42,20,42,25],[42,26,42,31],[27,2,36,7],[27,8,34,15],[27,16,34,23],[27,24,34,31],[35,8,36,15],[35,16,36,23],[35,24,36,31],[25,2,26,7],[25,8,25,31],[25,32,26,37],[25,38,26,45],[26,8,26,15],[26,16,26,23],[26,24,26,31]]}
[{"$f":"COUNTIF(I20:AF21,\"SI\")+COUNTIF(I20:AF21,\"NO\")+COUNTIF(I36:AF37,\"SI\")+COUNTIF(I36:AF37,\"NO\")+COUNTIF(I52:AF53,\"SI\")+COUNTIF(I52:AF53,\"NO\")=11","v":false}]
[null,null,null,null,null,null,null,null,null,null,null,null,null,null,null,null,null,null,null,null,null,null,null,null,null,null,null,null,null,null,null,null,null,null,null,null,null,null,null,null,null,null,null,null,null,null,{"$f":"IF(ING!$AY$2=\"\",\"\",ING!$AY$2)","v":""}]
[]
[]
[]
[]
[]
[null,null,"Componentes de Gestión Escolar: Gestión Institucional y Gestión Pedagógica"]
{"$rows_left_out":56}
{"sheet":"MOD2","index":5,"n_rows":31,"n_cols":56,"rows_kept":31,"cut":false,"hidden":true,"merged":[[30,44,31,45],[30,32,31,33],[30,34,31,35],[30,36,31,37],[30,38,31,39],[30,40,31,41],[30,42,31,43],[30,26,31,27],[30,28,31,29],[30,30,31,31],[30,14,31,15],[30,16,31,17],[30,18,31,19],[30,20,31,21],[30,22,31,23],[30,24,31,25],[21,38,24,45],[27,2,28,31],[27,33,28,34],[30,2,31,3],[30,4,31,5],[30,6,31,7],[30,8,31,9],[30,10,31,11],[30,12,31,13],[21,2,24,7],[21,8,24,13],[21,14,24,19],[21,20,24,25],[21,26,24,31],[11,32,24,37],[11,38,20,45],[19,8,20,13],[19,14,20,19],[19,20,20,25],[19,26,20,31],[11,2,20,7],[11,8,18,13],[11,14,18,19],[11,20,18,25],[11,26,18,31],[7,2,8,45],[9,2,10,7],[9,8,9,31],[9,32,10,37],[9,38,10,45],[10,8,10,13],[10,14,10,19],[10,20,10,25],[10,26,10,31]]}
[{"$f":"COUNTIF(I20:AF21,\"SI\")+COUNTIF(I20:AF21,\"NO\")=4","v":false}]
[null,null,null,null,null,null,null,null,null,null,null,null,null,null,null,null,null,null,null,null,null,null,null,null,null,null,null,null,null,null,null,null,null,null,null,null,null,null,null,null,null,null,null,null,null,null,{"$f":"IF(ING!$AY$2=\"\",\"\",ING!$AY$2)","v":""}]
[]
[]
[]
[]
[]
[null,null,"Componente de Cambio Climático"]
{"$rows_left_out":24}
{"sheet":"MOD3","index":6,"n_rows":79,"n_cols":47,"rows_kept":79,"cut":false,"hidden":true,"merged":[[78,26,79,27],[21,38,24,45],[75,2,76,31],[75,33,76,34],[78,2,79,3],[37,14,40,19],[37,20,40,25],[37,26,40,31],[27,2,36,7],[27,8,34,13],[27,14,34,19],[27,20,34,25],[27,26,34,31],[26,26,26,31],[37,38,40,45],[25,2,26,7],[25,8,25,31],[25,32,26,37],[25,38,26,45],[26,8,26,13],[26,14,26,19],[26,20,26,25],[27,38,36,45],[35,8,36,13],[78,40,79,41],[78,42,79,43],[78,44,79,45],[78,28,79,29],[78,30,79,31],[78,32,79,33],[78,34,79,35],[78,36,79,37],[78,38,79,39],[78,14,79,15],[11,38,20,45],[21,2,24,7],[11,2,20,7],[11,32,24,37],[78,4,79,5],[78,6,79,7],[78,8,79,9],[78,10,79,11],[78,12,79,13],[78,16,79,17],[78,18,79,19],[78,20,79,21],[78,22,79,23],[78,24,79,25],[11,8,18,13],[11,14,18,19],[11,20,18,25],[11,26,18,31],[19,8,20,13],[19,14,20,19],[19,20,20,25],[19,26,20,31],[21,8,24,13],[7,2,8,45],[9,2,10,7],[9,8,9,31],[9,32,10,37],[9,38,10,45],[10,8,10,13],[10,14,10,19],[10,20,10,25],[10,26,10,31],[57,2,58,7],[57,8,57,31],[57,32,58,37],[57,38,58,45],[58,8,58,13],[58,14,58,19],[58,20,58,25],[58,26,58,31],[21,20,24,25],[21,26,24,31],[41,2,42,7],[41,8,41,31],[41,32,42,37],[21,14,24,19],[27,32,40,37],[35,14,36,19],[35,20,36,25],[35,26,36,31],[37,2,40,7],[37,8,40,13],[41,38,42,45],[42,8,42,15],[42,16,42,23],[42,24,42,31],[43,2,52,7],[43,8,50,15],[43,16,50,23],[43,24,50,31],[43,32,56,37],[43,38,52,45],[51,8,52,15],[51,16,52,23],[51,24,52,31],[53,2,56,7],[53,8,56,15],[53,16,56,23],[53,24,56,31],[53,38,56,45],[69,2,72,7],[69,8,72,13],[69,14,72,19],[69,20,72,25],[69,26,72,31],[59,32,72,37],[59,38,68,45],[67,8,68,13],[67,14,68,19],[67,20,68,25],[67,26,68,31],[69,38,72,45],[59,2,68,7],[59,8,66,13],[59,14,66,19],[59,20,66,25],[59,26,66,31]]}
[{"$f":"COUNTIF(I20:AF21,\"SI\")+COUNTIF(I20:AF21,\"NO\")+COUNTIF(I36:AF37,\"SI\")+COUNTIF(I36:AF37,\"NO\")+COUNTIF(I52:AF53,\"SI\")+COUNTIF(I52:AF53,\"NO\")+COUNTIF(I68:AF69,\"SI\")+COUNTIF(I68:AF69,\"NO\")=15","v":false}]
[null,null,null,null,null,null,null,null,null,null,null,null,null,null,null,null,null,null,null,null,null,null,null,null,null,null,null,null,null,null,null,null,null,null,null,null,null,null,null,null,null,null,null,null,null,null,{"$f":"IF(ING!$AY$2=\"\",\"\",ING!$AY$2)","v":""}]
[]
[]
[]
[]
[]
[null,null,"Componente de Ecoeficiencia"]
{"$rows_left_out":72}
{"sheet":"MOD4","index":7,"n_rows":79,"n_cols":47,"rows_kept":79,"cut":false,"hidden":true,"merged":[[59,8,66,13],[59,14,66,19],[59,20,66,25],[59,26,66,31],[67,8,68,13],[67,14,68,19],[67,20,68,25],[67,26,68,31],[69,8,72,13],[69,14,72,19],[69,20,72,25],[69,26,72,31],[75,2,76,31],[25,2,26,7],[25,8,25,31],[59,2,68,7],[37,2,40,7],[27,8,34,13],[27,14,34,19],[37,38,40,45],[57,2,58,7],[57,8,57,31],[57,32,58,37],[57,38,58,45],[25,32,26,37],[25,38,26,45],[27,2,36,7],[27,32,40,37],[27,38,36,45],[43,32,56,37],[43,38,52,45],[53,2,56,7],[59,32,72,37],[59,38,68,45],[69,2,72,7],[69,38,72,45],[78,34,79,35],[78,36,79,37],[78,38,79,39],[78,16,79,17],[78,18,79,19],[78,20,79,21],[78,22,79,23],[78,24,79,25],[78,26,79,27],[75,33,76,34],[78,2,79,3],[78,4,79,5],[78,6,79,7],[78,8,79,9],[78,10,79,11],[78,12,79,13],[78,14,79,15],[11,38,20,45],[21,2,24,7],[11,2,20,7],[11,32,24,37],[53,38,56,45],[78,40,79,41],[78,42,79,43],[78,44,79,45],[41,2,42,7],[41,8,41,31],[41,32,42,37],[41,38,42,45],[43,2,52,7],[78,28,79,29],[78,30,79,31],[78,32,79,33],[7,2,8,45],[9,2,10,7],[9,8,9,31],[9,32,10,37],[9,38,10,45],[21,38,24,45],[11,8,18,13],[11,14,18,19],[11,20,18,25],[11,26,18,31],[19,8,20,13],[19,14,20,19],[19,20,20,25],[19,26,20,31],[21,8,24,13],[21,14,24,19],[21,20,24,25],[21,26,24,31],[10,8,10,13],[10,14,10,19],[53,20,56,25],[53,26,56,31],[27,20,34,25],[27,26,34,31],[35,8,36,13],[35,14,36,19],[35,20,36,25],[35,26,36,31],[37,8,40,13],[37,14,40,19],[37,20,40,25],[37,26,40,31],[58,8,58,13],[58,14,58,19],[58,20,58,25],[58,26,58,31],[10,20,10,25],[10,26,10,31],[26,8,26,13],[26,14,26,19],[26,20,26,25],[26,26,26,31],[42,8,42,13],[42,14,42,19],[42,20,42,25],[42,26,42,31],[43,8,50,13],[43,14,50,19],[43,20,50,25],[43,26,50,31],[51,8,52,13],[51,14,52,19],[51,20,52,25],[51,26,52,31],[53,8,56,13],[53,14,56,19]]}
[{"$f":"COUNTIF(I20:AF21,\"SI\")+COUNTIF(I20:AF21,\"NO\")+COUNTIF(I36:AF37,\"SI\")+COUNTIF(I36:AF37,\"NO\")+COUNTIF(I52:AF53,\"SI\")+COUNTIF(I52:AF53,\"NO\")+COUNTIF(I68:AF69,\"SI\")+COUNTIF(I68:AF69,\"NO\")=16","v":false}]
[null,null,null,null,null,null,null,null,null,null,null,null,null,null,null,null,null,null,null,null,null,null,null,null,null,null,null,null,null,null,null,null,null,null,null,null,null,null,null,null,null,null,null,null,null,null,{"$f":"IF(ING!$AY$2=\"\",\"\",ING!$AY$2)","v":""}]
[]
[]
[]
[]
[]
[null,null,"Componente de Salud"]
{"$rows_left_out":72}
{"sheet":"MOD5","index":8,"n_rows":31,"n_cols":47,"rows_kept":31,"cut":false,"hidden":true,"merged":[[11,38,20,45],[19,8,20,13],[30,22,31,23],[30,24,31,25],[30,26,31,27],[19,14,20,19],[19,20,20,25],[19,26,20,31],[11,32,24,37],[30,28,31,29],[30,30,31,31],[30,32,31,33],[30,34,31,35],[30,36,31,37],[30,8,31,9],[30,10,31,11],[30,40,31,41],[30,42,31,43],[30,44,31,45],[21,38,24,45],[27,2,28,31],[27,33,28,34],[30,2,31,3],[30,4,31,5],[30,6,31,7],[30,14,31,15],[30,12,31,13],[30,38,31,39],[30,16,31,17],[30,18,31,19],[30,20,31,21],[21,2,24,7],[21,8,24,13],[21,14,24,19],[21,20,24,25],[21,26,24,31],[11,2,20,7],[11,8,18,13],[11,14,18,19],[11,20,18,25],[11,26,18,31],[7,2,8,45],[9,2,10,7],[9,8,9,31],[9,32,10,37],[9,38,10,45],[10,8,10,13],[10,14,10,19],[10,20,10,25],[10,26,10,31]]}
[{"$f":"COUNTIF(I20:AF21,\"SI\")+COUNTIF(I20:AF21,\"NO\")=4","v":false}]
[null,null,null,null,null,null,null,null,null,null,null,null,null,null,null,null,null,null,null,null,null,null,null,null,null,null,null,null,null,null,null,null,null,null,null,null,null,null,null,null,null,null,null,null,null,null,{"$f":"IF(ING!$AY$2=\"\",\"\",ING!$AY$2)","v":""}]
[]
[]
[]
[]
[]
[null,null,"Componente de Gestión del Riesgo de Desastres"]
{"$rows_left_out":24}
{"sheet":"MOD6","index":9,"n_rows":55,"n_cols":51,"rows_kept":55,"cut":false,"hidden":true,"merged":[[43,4,44,25],[43,26,44,29],[43,30,44,33],[43,34,44,37],[43,38,44,41],[31,48,33,49],[34,48,36,49],[31,42,33,47],[16,34,18,37],[16,38,18,41],[19,48,21,49],[22,48,24,49],[25,48,27,49],[28,48,30,49],[25,34,27,37],[25,38,27,41],[25,42,27,47],[28,38,30,41],[28,34,30,37],[15,42,18,47],[28,42,30,47],[31,38,33,41],[15,4,18,21],[25,26,27,29],[22,26,24,29],[28,26,30,29],[16,26,18,29],[22,22,24,25],[25,22,27,25],[28,22,30,25],[19,4,21,21],[22,4,24,21],[25,4,27,21],[28,4,30,21],[15,26,15,41],[19,22,21,25],[15,22,18,25],[16,30,18,33],[8,2,9,49],[10,3,12,48],[51,24,52,25],[51,2,52,3],[51,4,52,5],[51,6,52,7],[51,8,52,9],[51,10,52,11],[51,12,52,13],[51,14,52,15],[51,16,52,17],[51,18,52,19],[51,20,52,21],[34,34,36,37],[34,38,36,41],[51,28,52,29],[22,42,24,47],[19,26,21,29],[19,42,21,47],[25,30,27,33],[22,30,24,33],[22,34,24,37],[22,38,24,41],[28,30,30,33],[19,50,21,50],[22,50,24,50],[25,50,27,50],[28,50,30,50],[31,50,33,50],[51,22,52,23],[51,48,52,49],[51,26,52,27],[34,50,36,50],[51,42,52,43],[51,44,52,45],[51,46,52,47],[51,30,52,31],[51,32,52,33],[51,34,52,35],[51,36,52,37],[51,38,52,39],[51,40,52,41],[34,42,36,47],[34,22,36,25],[19,30,21,33],[19,34,21,37],[19,38,21,41],[31,34,33,37],[31,4,33,21],[34,10,36,21],[34,26,36,29],[31,26,33,29],[31,30,33,33],[34,30,36,33],[31,22,33,25],[34,2,36,3],[19,2,21,3],[22,2,24,3],[25,2,27,3],[28,2,30,3],[31,2,33,3],[34,4,36,9],[40,50,42,50],[37,2,39,3],[37,4,39,9],[37,10,39,21],[37,22,39,25],[37,26,39,29],[37,30,39,33],[37,34,39,37],[37,38,39,41],[37,42,39,47],[37,48,39,49],[37,50,39,50],[40,30,42,33],[40,34,42,37],[40,38,42,41],[40,42,42,47],[40,48,42,49],[40,2,42,3],[40,4,42,9],[40,10,42,21],[40,22,42,25],[40,26,42,29]]}
[{"$f":"COUNTIF(W20:Z34,\"SI\")+COUNTIF(W20:Z34,\"NO\")=5","v":false}]
[null,null,null,null,null,null,null,null,null,null,null,null,null,null,null,null,null,null,null,null,null,null,null,null,null,null,null,null,null,null,null,null,null,null,null,null,null,null,null,null,null,null,null,null,null,null,null,null,null,null,{"$f":"IF(ING!$AY$2=\"\",\"\",ING!$AY$2)","v":""}]
[]
[]
[]
[]
[]
[]
{"$rows_left_out":48}
{"sheet":"CONFIRM","index":10,"n_rows":137,"n_cols":127,"rows_kept":137,"cut":false,"hidden":true,"merged":[[74,32,74,34],[77,32,77,34],[78,32,78,34],[80,32,80,34],[134,32,134,34],[125,32,125,34],[126,32,126,34],[127,32,127,34],[128,2,128,31],[129,32,129,34],[130,32,130,34],[131,32,131,34],[132,32,132,34],[133,32,133,34],[132,2,132,31],[133,2,133,31],[131,2,131,31],[125,2,125,31],[126,2,126,31],[127,2,127,31],[129,2,129,31],[130,2,130,31],[111,32,111,34],[120,32,120,34],[121,32,121,34],[113,32,113,34],[114,32,114,34],[115,32,115,34],[116,32,116,34],[115,2,115,31],[116,2,116,31],[117,2,117,31],[118,2,118,31],[119,2,119,31],[120,2,120,31],[121,2,121,31],[98,2,98,31],[99,2,99,31],[100,2,100,31],[101,2,101,31],[102,2,102,31],[103,2,103,31],[104,2,104,31],[105,2,105,31],[124,32,124,34],[122,2,122,31],[123,2,123,31],[124,2,124,31],[106,2,106,31],[107,2,107,31],[108,2,108,31],[109,2,109,31],[110,2,110,31],[111,2,111,31],[112,2,112,31],[113,2,113,31],[114,2,114,31],[110,32,110,34],[118,32,118,34],[119,32,119,34],[70,2,70,31],[71,2,71,31],[72,2,72,31],[73,2,73,31],[74,2,74,31],[75,2,75,31],[76,2,76,31],[77,2,77,31],[78,2,78,31],[65,32,65,34],[67,32,67,34],[68,32,68,34],[71,32,71,34],[72,32,72,34],[73,32,73,34],[109,32,109,34],[97,32,97,34],[98,32,98,34],[103,32,103,34],[88,32,88,34],[90,32,90,34],[91,32,91,34],[93,32,93,34],[94,32,94,34],[69,32,69,34],[79,32,79,34],[84,32,84,34],[85,32,85,34],[89,32,89,34],[99,32,99,34],[100,32,100,34],[95,32,95,34],[106,32,106,34],[104,32,104,34],[105,32,105,34],[108,32,108,34],[94,2,94,31],[83,32,83,34],[86,32,86,34],[79,2,79,31],[80,2,80,31],[81,2,81,31],[82,2,82,31],[83,2,83,31],[84,2,84,31],[85,2,85,31],[86,2,86,31],[87,2,87,31],[88,2,88,31],[89,2,89,31],[90,2,90,31],[91,2,91,31],[92,2,92,31],[93,2,93,31],[95,2,95,31],[96,2,96,31],[97,2,97,31],[61,2,61,31],[62,2,62,31],[63,2,63,31],[64,2,64,31],[62,32,62,34],[63,32,63,34],[64,32,64,34],[54,21,54,34],[55,21,55,34],[68,2,68,31],[69,2,69,31],[28,32,28,34],[43,29,43,34],[43,19,43,28],[33,2,33,14],[33,15,33,17],[33,19,33,31],[33,32,33,34],[35,2,36,17],[35,19,36,34],[37,2,37,14],[37,15,37,17],[37,19,37,31],[37,32,37,34],[38,2,38,14],[38,15,38,17],[38,19,38,31],[38,32,38,34],[41,2,42,34],[43,2,43,14],[54,4,54,17],[55,4,55,17],[60,2,60,31],[6,2,7,34],[9,18,9,34],[14,8,14,34],[15,8,15,34],[16,8,16,34],[27,15,27,17],[30,2,31,17],[30,19,31,34],[32,2,32,14],[32,15,32,17],[32,19,32,31],[32,32,32,34],[19,8,19,34],[17,8,17,34],[20,8,20,34],[18,8,18,34],[25,2,26,17],[25,19,26,34],[28,15,28,17],[27,2,27,14],[28,2,28,14],[27,19,27,31],[27,32,27,34],[28,19,28,31],[136,32,136,34],[135,32,135,34],[134,2,134,7],[134,8,134,31],[135,2,135,7],[135,8,135,31],[136,2,136,7],[136,8,136,31],[43,15,43,17],[48,4,48,17],[49,4,49,17],[50,4,50,17],[51,4,51,17],[52,4,52,17],[53,4,53,17],[48,21,48,34],[49,21,49,34],[50,21,50,34],[51,21,51,34],[52,21,52,34],[53,21,53,34],[65,2,65,31],[66,2,66,31],[67,2,67,31]]}
[]
[null,null,null,null,null,null,null,null,null,null,null,null,null,null,null,null,null,null,null,null,null,null,null,null,null,null,null,null,null,null,null,null,null,null,null,null,null,null,null,null,null,null,null,null,null,null,null,null,null,null,null,null,null,null,null,null,null,null,null,null,null,null,null,null,null,null,null,null,null,null,null,null,null,null,null,null,null,null,null,null,null,null,null,null,null,null,null,null,null,null,null,null,null,null,null,null,null,null,null,null,null,null,null,null,null,null,null,null,null,null,null,null,null,null,null,null,null,null,null,null,null,null,null,null,null,null,{"$f":"CONFIRM!P29","v":0}]
[]
[]
[]
[]
[null,null,"CONFIRMACIÓN DE ENVÍO DE DATOS"]
[]
{"$rows_left_out":130}
{"sheet":"LISTAS","index":11,"n_rows":1875,"n_cols":27,"rows_kept":1875,"cut":false,"hidden":true,"merged":[]}
[null,"DEPAR",null,0,"DEPARTAMENTO","PROVINCIA",null,{"$f":"J1&\" \"&K1&\" \"&L1","v":"DEPARTAMENTO PROVINCIA DISTRITO"},0,"DEPARTAMENTO","PROVINCIA","DISTRITO","ID_DISTRITO",null,0,"REGION","UNIDAD EJECUTORA","UGEL",null,0,"UGEL",null,0,"PROVI",null,0,"DISTR"]
[null,"AMAZONAS",null,{"$f":"IF(ING!$D$21=E2,D1+1,0)","v":0},"AMAZONAS","BAGUA",null,{"$f":"J2&\" \"&K2&\" \"&L2","v":"AMAZONAS BAGUA ARAMANGO"},{"$f":"IF(AND(ING!$D$21=J2,ING!$V$21=K2),I1+1,0)","v":0},"AMAZONAS","BAGUA","ARAMANGO","010202",null,{"$f":"IF($T$1=P2,O1+1,0)","v":0},"AMAZONAS","303. EDUCACION BAGUA CAPITAL","UGEL BAGUA",null,1,{"$f":"IFERROR(VLOOKUP(T2,O1:R222,4,FALSE),\"\")","v":""},null,1,{"$f":"IFERROR(VLOOKUP(W2,$D$1:$F$197,3,FALSE),\"\")","v":"CAJABAMBA"},null,1,{"$f":"IFERROR(VLOOKUP(Z2,$I:$M,4,FALSE),\"\")","v":"CHIRINOS"}]
[null,"ANCASH",null,{"$f":"IF(ING!$D$21=E3,D2+1,0)","v":0},"AMAZONAS","BONGARA",null,{"$f":"J3&\" \"&K3&\" \"&L3","v":"AMAZONAS BAGUA BAGUA"},{"$f":"IF(AND(ING!$D$21=J3,ING!$V$21=K3),I2+1,0)","v":0},"AMAZONAS","BAGUA","BAGUA","010201",null,{"$f":"IF($T$1=P3,O2+1,0)","v":0},"AMAZONAS","300. EDUCACION AMAZONAS","UGEL BONGARA",null,2,{"$f":"IFERROR(VLOOKUP(T3,O2:R223,4,FALSE),\"\")","v":""},null,2,{"$f":"IFERROR(VLOOKUP(W3,$D$1:$F$197,3,FALSE),\"\")","v":"CAJAMARCA"},null,2,{"$f":"IFERROR(VLOOKUP(Z3,$I:$M,4,FALSE),\"\")","v":"HUARANGO"}]
[null,"APURÍMAC",null,{"$f":"IF(ING!$D$21=E4,D3+1,0)","v":0},"AMAZONAS","CHACHAPOYAS",null,"AMAZONAS BAGUA COPALLIN",{"$f":"IF(AND(ING!$D$21=J4,ING!$V$21=K4),I3+1,0)","v":0},"AMAZONAS","BAGUA","COPALLIN","010203",null,0,"AMAZONAS","300. EDUCACION AMAZONAS","UGEL CHACHAPOYAS",null,3,"",null,3,"CELENDIN",null,3,"LA COIPA"]
[null,"AREQUIPA",null,{"$f":"IF(ING!$D$21=E5,D4+1,0)","v":0},"AMAZONAS","CONDORCANQUI",null,"AMAZONAS BAGUA EL PARCO",{"$f":"IF(AND(ING!$D$21=J5,ING!$V$21=K5),I4+1,0)","v":0},"AMAZONAS","BAGUA","EL PARCO","010204",null,0,"AMAZONAS","302. EDUCACION CONDORCANQUI","UGEL CONDORCANQUI",null,4,"",null,4,"CHOTA",null,4,"NAMBALLE"]
[null,"AYACUCHO",null,{"$f":"IF(ING!$D$21=E6,D5+1,0)","v":0},"AMAZONAS","LUYA",null,"AMAZONAS BAGUA IMAZA",{"$f":"IF(AND(ING!$D$21=J6,ING!$V$21=K6),I5+1,0)","v":0},"AMAZONAS","BAGUA","IMAZA","010205",null,0,"AMAZONAS","303. EDUCACION BAGUA CAPITAL","UGEL IBIR-IMAZA",null,5,"",null,5,"CONTUMAZA",null,5,"SAN IGNACIO"]
[null,"CAJAMARCA",null,{"$f":"IF(ING!$D$21=E7,D6+1,0)","v":0},"AMAZONAS","RODRIGUEZ DE MENDOZA",null,"AMAZONAS BAGUA LA PECA",{"$f":"IF(AND(ING!$D$21=J7,ING!$V$21=K7),I6+1,0)","v":0},"AMAZONAS","BAGUA","LA PECA","010206",null,0,"AMAZONAS","300. EDUCACION AMAZONAS","UGEL LUYA",null,6,"",null,6,"CUTERVO",null,6,"SAN JOSE DE LOURDES"]
[null,"CALLAO",null,{"$f":"IF(ING!$D$21=E8,D7+1,0)","v":0},"AMAZONAS","UTCUBAMBA",null,"AMAZONAS BONGARA CHISQUILLA",{"$f":"IF(AND(ING!$D$21=J8,ING!$V$21=K8),I7+1,0)","v":0},"AMAZONAS","BONGARA","CHISQUILLA","010302",null,0,"AMAZONAS","300. EDUCACION AMAZONAS","UGEL RODRIGUEZ DE MENDOZA",null,7,"",null,7,"HUALGAYOC",null,7,"TABACONAS"]
{"$rows_left_out":1868}
{"sheet":"ENVIO","index":12,"n_rows":13,"n_cols":150,"rows_kept":13,"cut":false,"hidden":true,"merged":[]}
[null,"Servidor","198.37.116.16",null,null,135]
[null,"Usuario","ADMINGI",null,null,"AHORA"]
[null,"Contraseña","2016MineduGI",null,null,"2017-11-08T15:39:14.317"]
[null,"Base de datos","GIMINEDU2017"]
[]
[]
[null,"QUERY_TRAE"]
["select CONCAT(IIEE,' (',CODA,')') AS COLE,CODA, COD_MODULAR, ANEXO, COD_LOCAL, IIEE, ESTADO_IIEE, DESC_SEXO, DESC_CAR, COD_UGEL, ESTADO_IIEE, UGEL, DRE, ID_DISTRITO, DISTRITO, PROVINCIA, DEPARTAMENTO, ID_AREA, AREA, ID_NIVEL, NIVEL, ID_GESTION, GESTION, DIRECCION_IIEE, LATITUD, LONGITUD, TALUM_HOM, TALUM_MUJ, TDOCENTE, DESC_TURNO, EIB from IIEE where ID_DISTRITO='",{"$f":"A8&VLOOKUP(IIEE_D&\" \"&IIEE_P&\" \"&IIEE_T,LISTAS!H:M,6,FALSE)&\"' and ID_NIVEL like '\"&VLOOKUP(IIEE_N,LISTAS!B37:C41,2,FALSE)&\"_' and ID_GESTION\"&VLOOKUP(IIEE_G,LISTAS!B31:C32,2,FALSE)&\"3\"","v":"select CONCAT(IIEE,' (',CODA,')') AS COLE,CODA, COD_MODULAR, ANEXO, COD_LOCAL, IIEE, ESTADO_IIEE, DESC_SEXO, DESC_CAR, COD_UGEL, ESTADO_IIEE, UGEL, DRE, ID_DISTRITO, DISTRITO, PROVINCIA, DEPARTAMENTO, ID_AREA, AREA, ID_NIVEL, NIVEL, ID_GESTION, GESTION, DIRECCION_IIEE, LATITUD, LONGITUD, TALUM_HOM, TALUM_MUJ, TDOCENTE, DESC_TURNO, EIB from IIEE where ID_DISTRITO='060901' and ID_NIVEL like 'B_' and ID_GESTION<>3"}]
{"$rows_left_out":5}