{"text_format":"1","workbook":"xlsx","n_sheets":13,"sheets":["ING","DECLA","ADI","MATRIZ","MOD1","MOD2","MOD3","MOD4","MOD5","MOD6","CONFIRM","LISTAS","ENVIO"],"not_rendered":{"charts":0,"images":8,"macros":1,"external_links":0,"defined_names":13,"comments":0,"pivot_tables":0},"unopened":[],"bounds":{"document_bytes":16777216,"sheet_cells":100000,"rows_first":2000,"rows_last":500,"rows_between":2000,"halvings":0,"cell_chars":16384,"cell_head_chars":4096},"cells_cut":0,"cells_raw":0,"read":"whole","date_system":"1900"}

{"sheet":"ING","index":0,"n_rows":43,"n_cols":51,"rows_kept":43,"cut":false,"hidden":false,"merged":[[6,48,6,49],[29,43,29,48],[29,3,29,42],[26,10,27,31],[17,48,18,49],[7,48,7,49],[10,3,10,18],[10,21,10,36],[13,39,13,48],[13,21,13,36],[23,3,23,36],[26,3,27,9],[26,37,26,42],[26,43,26,48],[10,39,10,48],[27,46,27,48],[27,43,27,45],[27,37,27,39],[27,40,27,42],[39,44,40,45],[39,46,40,47],[28,46,28,48],[30,3,30,42],[30,43,30,48],[28,3,28,9],[28,43,28,45],[28,37,28,39],[28,40,28,42],[32,3,32,36],[36,11,36,16],[36,19,36,24],[20,3,20,18],[20,21,20,36],[39,18,40,19],[39,20,40,21],[39,22,40,23],[39,24,40,25],[39,36,40,37],[39,26,40,27],[39,28,40,29],[39,12,40,13],[26,32,27,36],[28,32,28,36],[28,10,28,31],[36,27,36,32],[36,4,36,8],[4,2,4,49],[39,2,40,3],[39,4,40,5],[39,6,40,7],[39,8,40,9],[39,10,40,11],[39,30,40,31],[39,32,40,33],[39,34,40,35],[39,14,40,15],[39,16,40,17],[13,3,13,18],[39,48,40,49],[39,38,40,39],[39,40,40,41],[39,42,40,43]]}
[{"$f":"NOT(OR(IIEE_G=\"Seleccionar\",IIEE_N=\"Seleccionar\",IIEE_T=\"Seleccionar\"))","v":true}]
[]
[]
[]
[null,null,"BIENVENIDO"]
[]
[null,null,null,null,null,null,null,null,null,null,null,null,null,null,null,null,null,null,null,null,null,null,null,null,null,null,null,null,null,null,null,null,null,null,null,null,null,null,null,null,null,null,null,null,null,null,null,null,{"$f":"IF(AND($D$11<>\"\",$AA$11<>\"\",$V$14<>\"\",$I$14<>\"\"),CHAR(97),\"\")","v":""}]
[null,null,"Datos del director de la Institución Educativa:",null,null,null,null,null,null,null,null,null,null,null,null,null,null,null,null,null,null,null,null,null,null,null,null,null,null,null,null,null,null,null,null,null,null,null,null,null,null,null,null,null,null,null,null,null,{"$f":"IF(AND($D$11<>\"\",$AA$11<>\"\",$V$14<>\"\",$I$14<>\"\"),CHAR(97),\"\")","v":""}]
[]
[null,null,null,"Apellidos:",null,null,null,null,null,null,null,null,null,null,null,null,null,null,null,null,null,"Nombres:",null,null,null,null,null,null,null,null,null,null,null,null,null,null,null,null,null,"Gestión de la IE:"]
[null,null,null,"LUDEÑA QUINDE",null,null,null,null,null,null,null,null,null,null,null,null,null,null,null,null,null,"IVETH",null,null,null,null,null,null,null,null,null,null,null,null,null,null,null,null,null,"PÚBLICA"]
[]
[null,null,null,"Teléfonos:",null,null,null,null,null,null,null,null,null,null,null,null,null,null,null,null,null,"Correo electrónico:",null,null,null,null,null,null,null,null,null,null,null,null,null,null,null,null,null,"Nivel Educativo de la IE:"]
[null,null,null,970031089,null,null,null,null,null,null,null,null,null,null,null,null,null,null,null,null,null,"ivecita_869@hotmail.com",null,null,null,null,null,null,null,null,null,null,null,null,null,null,null,null,null,"PRIMARIA"]
[]
[]
[]
[null,null,"Mi Institución Educativa está ubicada en...",null,null,null,null,null,null,null,null,null,null,null,null,null,null,null,null,null,null,null,null,null,null,null,null,null,null,null,null,null,null,null,null,null,null,null,null,null,null,null,null,null,null,null,null,null,{"$f":"IF(OR($D$21=\"\",$D$21=\"Seleccionar\",$S$21=\"\",$S$21=\"Seleccionar\",$D$24=\"\",$D$24=\"Seleccionar\"),\"\",CHAR(97))","v":""}]
[]
[null,null,null,"El departamento de:",null,null,null,null,null,null,null,null,null,null,null,null,null,null,null,null,null,"La provincia de:"]
[null,null,null,"CAJAMARCA",null,null,null,null,null,null,null,null,null,null,null,null,null,null,null,null,null,"SAN IGNACIO"]
[]
[null,null,null,"El distrito de:"]
[null,null,null,"SAN IGNACIO"]
[]
[]
[null,null,null,"Código Modular",null,null,null,null,null,null,"Nombre de Institución Educativa - ESCALE",null,null,null,null,null,null,null,null,null,null,null,null,null,null,null,null,null,null,null,null,null,"Zona",null,null,null,null,"Estudiantes",null,null,null,null,null,"Docentes"]
[null,null,null,null,null,null,null,null,null,null,null,null,null,null,null,null,null,null,null,null,null,null,null,null,null,null,null,null,null,null,null,null,null,null,null,null,null,"H",null,null,"M",null,null,"H",null,null,"M"]
[null,null,null,{"$f":"IF(A1=FALSE,\"\",IFERROR(VLOOKUP(LISTAS!AC3,LISTAS!AE:BI,3,FALSE),\"\"))","v":""},null,null,null,null,null,null,{"$f":"IF(A1=FALSE,\"\",IFERROR(VLOOKUP(LISTAS!AC3,LISTAS!AE:BI,6,FALSE),\"\"))","v":""},null,null,null,null,null,null,null,null,null,null,null,null,null,null,null,null,null,null,null,null,null,{"$f":"IF(A1=FALSE,\"\",IFERROR(VLOOKUP(LISTAS!AC3,LISTAS!AE:BI,19,FALSE),\"\"))","v":""},null,null,null,null,9,null,null,8,null,null,0,null,null,1]
[null,null,null,"Direccion",null,null,null,null,null,null,null,null,null,null,null,null,null,null,null,null,null,null,null,null,null,null,null,null,null,null,null,null,null,null,null,null,null,null,null,null,null,null,null,"¿Es EIB?"]
[null,null,null,{"$f":"IF(A1=FALSE,\"\",IFERROR(VLOOKUP(LISTAS!AC3,LISTAS!AE:BI,24,FALSE),\"\"))","v":""},null,null,null,null,null,null,null,null,null,null,null,null,null,null,null,null,null,null,null,null,null,null,null,null,null,null,null,null,null,null,null,null,null,null,null,null,null,null,null,{"$f":"IF(A1=FALSE,\"\",IF(IFERROR(VLOOKUP(LISTAS!AC3,LISTAS!AE:BI,31,FALSE),\"\")=1,\"SI\",\"NO\"))","v":"NO"}]
[]
[null,null,null,"¿La Institución Educativa está presentando la Matriz de Logros Ambientales conjuntamente con otros niveles de la misma IE? Indicar qué niveles y sus respectivos códigos modulares.",null,null,null,null,null,null,null,null,null,null,null,null,null,null,null,null,null,null,null,null,null,null,null,null,null,null,null,null,null,null,null,null,null,null,null,null,null,null,0]
[]
[]
[]
[null,null,null,null,"Código Modular",null,null,null,null,null,null,null,null,null,null,null,null,false,null,null,null,null,null,null,null,false,null,null,null,null,null,null,null,false]
[]
[null,null,null,{"$f":"IF(OR(IIEE_D=\"Seleccionar\",IIEE_P=\"Seleccionar\",IIEE_T=\"Seleccionar\"),\"Debe de llenar los campos solicitados para pasar a la siguiente fase.\",\"Todos los datos deben ser llenados y selecionados correctamente.\")","v":"Todos los datos deben ser llenados y selecionados correctamente."}]
[null,null,"%",null,"&",null,"N",null,"O",null,"Y",null,"b",null,"h",null,"Š",null,"\u008f",null,"§",null,"¨",null,"þ",null,"H",null,"J",null,"M",null,"P",null,"Q",null,"z",null,"~",null,"á",null,"%",null,"&",null,"N",null,"O"]
[]
[]
[null,{"$f":"IF(VALUE(INFO(\"VERSION\"))<14,\"  Probablemente la herramienta no pueda operar correctamente por ser una versión muy antigua de MS-Excel, comuníquese con Gestión de la Información!\",IF(ISERROR(CONCATENATE(\"  Versión del Sistema Operativo: \",INFO(\"VERSIONSO\"),\",     Versión de MS-Excel: \",INFO(\"VERSION\"))),\"Probablemente la herramienta no pueda operar correctamente, comuníquese con Gestión de la Información!\",CONCATENATE(\"Versión del Sistema Operativo: \",INFO(\"VERSIONSO\"),\",     Versión de MS-Excel: \",INFO(\"VERSION\"))))","v":{"$error":"#VALUE!"}},null,null,null,null,null,null,null,null,null,null,null,null,null,null,null,null,null,null,null,null,null,null,null,null,null,null,null,null,null,null,null,null,null,null,null,null,null,null,null,null,null,null,null,null,null,null,null,null,{"$f":"IF($B$43=\"\",\"\",\"Gestión de la Información EBR Vs 4.0  \")","v":{"$error":"#VALUE!"}}]

{"sheet":"DECLA","index":1,"n_rows":35,"n_cols":127,"rows_kept":35,"cut":false,"hidden":true,"merged":[[10,2,30,34],[6,2,7,34]]}
[]
[null,null,null,null,null,null,null,null,null,null,null,null,null,null,null,null,null,null,null,null,null,null,null,null,null,null,null,null,null,null,null,null,null,null,null,null,null,null,null,null,null,null,null,null,null,null,null,null,null,null,null,null,null,null,null,null,null,null,null,null,null,null,null,null,null,null,null,null,null,null,null,null,null,null,null,null,null,null,null,null,null,null,null,null,null,null,null,null,null,null,null,null,null,null,null,null,null,null,null,null,null,null,null,null,null,null,null,null,null,null,null,null,null,null,null,null,null,null,null,null,null,null,null,null,null,null,{"$f":"DECLA!P27","v":0}]
[]
[]
[]
[]
[null,null,"DECLARACIÓN JURADA"]
[]
[]
[]
[null,null,"Mediante el presente, yo como Director o representante de esta Institución Educativa, declaro bajo juramento ser responsable de la veracidad de la información que presento en este reporte, y en caso de incumplimiento me someto a las sanciones correspondientes de acuerdo a la normativa vigente.\n"]
[]
[]
[]
[]
[]
[]
[]
[]
[]
[]
[]
[]
[]
[]
[]
[]
[]
[]
[]
[]
[]
[]
[]
[null," "]

{"sheet":"ADI","index":2,"n_rows":45,"n_cols":45,"rows_kept":45,"cut":false,"hidden":true,"merged":[[41,33,42,34],[10,32,23,37],[10,38,23,43],[25,38,38,43],[25,32,38,37],[24,32,24,37],[24,38,24,43],[24,2,24,31],[9,32,9,37],[44,42,45,43],[44,40,45,41],[44,38,45,39],[44,36,45,37],[44,34,45,35],[44,30,45,31],[44,18,45,19],[44,20,45,21],[44,22,45,23],[44,24,45,25],[44,26,45,27],[44,28,45,29],[9,38,9,43],[44,32,45,33],[41,2,42,31],[44,2,45,3],[44,4,45,5],[44,6,45,7],[44,8,45,9],[44,10,45,11],[44,12,45,13],[44,14,45,15],[44,16,45,17],[35,2,38,7],[35,8,38,13],[35,14,38,19],[35,20,38,25],[35,26,38,31],[33,8,34,13],[33,14,34,19],[33,20,34,25],[33,26,34,31],[25,2,34,7],[25,8,32,13],[25,14,32,19],[25,20,32,25],[25,26,32,31],[20,2,23,7],[20,8,23,13],[20,14,23,19],[20,20,23,25],[20,26,23,31],[7,2,8,43],[18,8,19,13],[18,14,19,19],[18,20,19,25],[18,26,19,31],[10,2,19,7],[10,8,17,13],[10,14,17,19],[10,20,17,25],[10,26,17,31],[9,2,9,31]]}
[{"$f":"IF(AM10=1,IF(AM25=1,COUNTIF(I19:AF20,\"SI\")+COUNTIF(I19:AF20,\"NO\")+COUNTIF(I34:AF35,\"SI\")+COUNTIF(I34:AF35,\"NO\"),COUNTIF(I19:AF20,\"SI\")+COUNTIF(I19:AF20,\"NO\")),IF(AM25=1,COUNTIF(I34:AF35,\"SI\")+COUNTIF(I34:AF35,\"NO\"),0))=IF(AM10=1,IF(AM25=1,8,4),IF(AM25=1,4,100))","v":false}]
[null,null,null,null,null,null,null,null,null,null,null,null,null,null,null,null,null,null,null,null,null,null,null,null,null,null,null,null,null,null,null,null,null,null,null,null,null,null,null,null,null,null,null,null,{"$f":"IF(ING!$AY$2=\"\",\"\",ING!$AY$2)","v":""}]
[]
[]
[]
[]
[]
[null,null,"Antes de completar la matriz, sírvase a contestar las siguientes dos preguntas (no forman parte de la evaluación final)"]
[]
[null,null,"¿La IIEE cuenta con Plan de Salud Escolar?, si responde que sí, llene los siguientes hitos:",null,null,null,null,null,null,null,null,null,null,null,null,null,null,null,null,null,null,null,null,null,null,null,null,null,null,null,null,null,null,null,null,null,null,null,0]
[null,null,"La I.E. cuenta con una Plan de Salud Escolar",null,null,null,null,null,"La I.E. ha incluido las actividades del Plan de Salud Escolar en el PAT.",null,null,null,null,null,"La I.E. entregó al establecimiento de Salud los Consentimientos Informados firmados del Plan de Salud Escolar que fueron entregados a los padres de familia.",null,null,null,null,null,"La I.E. preparó los espacios para las actividades del Plan de Salud Escolar",null,null,null,null,null,"La IE ha coordinado con el Establecimiento de Salud el cronograma para desarrollar las acciones de salud. ",null,null,null,null,null,"N° de hitos de aplicación del enfoque ambiental puestos en práctica en la institucionalización del Comité Ambiental. ",null,null,null,null,null,{"$f":"COUNTIF(I19:AF20,\"SI\")","v":0}]
[]
[]
[]
[]
[]
[]
[]
[]
[]
[null,null,"Medios de verificación",null,null,null,null,null,"Plan de Salud Escolar\nPAT",null,null,null,null,null,"Cargo de entrega\nConsentimientos informados firmados",null,null,null,null,null,"PAT",null,null,null,null,null,"Documentos administrativos: Cartas, Oficios, Memo \nActas, Convenios, Acuerdos"]
[]
[]
[]
[null,null,"¿La IIEE es usurario de Qali Warma?, si responde que sí, llene los siguientes hitos:"]
[null,null,"La I.E. implementa el servicio de alimentación provisto por Qali Warma",null,null,null,null,null,"La I.E. ha incluido las actividades de Qali Warma en el PAT.",null,null,null,null,null,"El Comité de Alimentación Escolar (CAE) está conformado y todos sus miembros han sido capacitados",null,null,null,null,null,"El CAE coordinó con el proveedor del servicio alimentario las fechas y horarios de entrega de alimentos a la IE",null,null,null,null,null,"El CAE organizó los turnos y roles en la IE para la recepción, preparación y servido de los alimentos",null,null,null,null,null,"N° de hitos de aplicación del enfoque ambiental puestos en práctica en la institucionalización del Comité Ambiental. ",null,null,null,null,null,{"$f":"COUNTIF(I34:AF35,\"SI\")","v":0}]
[]
[]
[]
[]
[]
[]
[]
[]
[]
[null,null,"Medios de verificación",null,null,null,null,null,"PAT",null,null,null,null,null,"Acta de conformación\nPAT",null,null,null,null,null,"PAT",null,null,null,null,null,"PAT"]
[]
[]
[]
[]
[]
[null,null,{"$f":"REPT(CHAR(73),IF(AM10=1,IF(AM25=1,24,48),IF(AM25=1,24,0))*(COUNTIF(I19:AF20,\"*\")+COUNTIF(I34:AF35,\"*\")))","v":""},null,null,null,null,null,null,null,null,null,null,null,null,null,null,null,null,null,null,null,null,null,null,null,null,null,null,null,null,null,null,{"$f":"IF(A1=TRUE,\"a\",\"\")","v":""}]
[]
[]
[null,null,"%",null,"&",null,"N",null,"O",null,"Y",null,"b",null,"h",null,"Š",null,"\u008f",null,"§",null,"¨",null,"þ",null,"H",null,"J",null,"M",null,"Y",null,"b",null,"h",null,"Š",null,"\u008f",null,"§"]

{"sheet":"MATRIZ","index":3,"n_rows":50,"n_cols":51,"rows_kept":50,"cut":false,"hidden":true,"merged":[[40,47,41,48],[25,15,26,16],[40,19,41,30],[40,31,41,32],[25,47,26,48],[25,3,26,14],[40,3,41,14],[40,15,41,16],[25,19,26,30],[25,35,26,46],[40,35,41,46],[8,2,9,49],[10,3,12,48],[25,31,26,32],[46,38,47,39],[46,16,47,17],[46,18,47,19],[46,20,47,21],[46,22,47,23],[46,26,47,27],[46,28,47,29],[46,30,47,31],[46,32,47,33],[46,34,47,35],[46,36,47,37],[46,2,47,3],[46,4,47,5],[46,6,47,7],[46,8,47,9],[46,24,47,25],[46,12,47,13],[46,14,47,15],[46,10,47,11],[43,41,44,48],[46,46,47,47],[46,48,47,49],[46,40,47,41],[46,42,47,43],[46,44,47,45]]}
[{"$f":"LEN(P26&AF26&AV26&P41&AF41&AV41)=6","v":false}]
[null,null,null,null,null,null,null,null,null,null,null,null,null,null,null,null,null,null,null,null,null,null,null,null,null,null,null,null,null,null,null,null,null,null,null,null,null,null,null,null,null,null,null,null,null,null,null,null,null,null,{"$f":"IF(ING!$AY$2=\"\",\"\",ING!$AY$2)","v":""}]
[]
[]
[]
[]
[]
[]
[null,null,"MATRIZ DE LOGROS AMBIENTALES"]
[]
[null,null,null,"La Matriz de Logros Ambientales es la herramienta de monitoreo, evaluación y reconocimiento de la aplicación del enfoque ambiental que a nivel de las II.EE. permite estimar el nivel de logro alcanzado en la aplicación transversal del enfoque ambiental en la gestión escolar."]
[]
[]
[]
[null,null,1,null,null,null,null,null,null,null,null,null,null,null,null,null,null,null,2,null,null,null,null,null,null,null,null,null,null,null,null,null,null,null,3]
[]
[]
[]
[]
[]
[]
[]
[]
[]
[]
[null,null,null,{"$f":"REPT(CHAR(73),9*(COUNTIF('MOD1'!I20:AF21,\"SI\")+COUNTIF('MOD1'!I36:AF37,\"SI\")+COUNTIF('MOD1'!I52:AF53,\"SI\")+COUNTIF('MOD1'!I20:AF21,\"NO\")+COUNTIF('MOD1'!I36:AF37,\"NO\")+COUNTIF('MOD1'!I52:AF53,\"NO\")))","v":""},null,null,null,null,null,null,null,null,null,null,null,{"$f":"IF('MOD1'!A1=TRUE,\"a\",\"\")","v":""},null,null,null,{"$f":"REPT(CHAR(73),24*(COUNTIF('MOD2'!I20:AF21,\"SI\")+COUNTIF('MOD2'!I20:AF21,\"NO\")))","v":""},null,null,null,null,null,null,null,null,null,null,null,{"$f":"IF('MOD2'!A1=TRUE,\"a\",\"\")","v":""},null,null,null,{"$f":"REPT(CHAR(73),6*(COUNTIF('MOD3'!I20:AF21,\"SI\")+COUNTIF('MOD3'!I36:AF37,\"SI\")+COUNTIF('MOD3'!I52:AF53,\"SI\")+COUNTIF('MOD3'!I68:AF69,\"SI\")+COUNTIF('MOD3'!I20:AF21,\"NO\")+COUNTIF('MOD3'!I36:AF37,\"NO\")+COUNTIF('MOD3'!I52:AF53,\"NO\")+COUNTIF('MOD3'!I68:AF69,\"NO\")))","v":""},null,null,null,null,null,null,null,null,null,null,null,{"$f":"IF('MOD3'!A1=TRUE,\"a\",\"\")","v":""}]
[]
[]
[]
[null,null,4,null,null,null,null,null,null,null,null,null,null,null,null,null,null,null,5,null,null,null,null,null,null,null,null,null,null,null,null,null,null,null,6]
[]
[]
[]
[]
[]
[]
[]
[]
[]
[]
[null,null,null,{"$f":"REPT(CHAR(73),6*(COUNTIF('MOD4'!I20:AF21,\"SI\")+COUNTIF('MOD4'!I36:AF37,\"SI\")+COUNTIF('MOD4'!I52:AF53,\"SI\")+COUNTIF('MOD4'!I68:AF69,\"SI\")+COUNTIF('MOD4'!I20:AF21,\"NO\")+COUNTIF('MOD4'!I36:AF37,\"NO\")+COUNTIF('MOD4'!I52:AF53,\"NO\")+COUNTIF('MOD4'!I68:AF69,\"NO\")))","v":""},null,null,null,null,null,null,null,null,null,null,null,{"$f":"IF('MOD4'!A1=TRUE,\"a\",\"\")","v":""},null,null,null,{"$f":"REPT(CHAR(73),24*(COUNTIF('MOD5'!I20:AF21,\"SI\")+COUNTIF('MOD5'!I20:AF21,\"NO\")))","v":""},null,null,null,null,null,null,null,null,null,null,null,{"$f":"IF('MOD5'!A1=TRUE,\"a\",\"\")","v":""},null,null,null,{"$f":"REPT(CHAR(73),18*(COUNTIF('MOD6'!W20:Z34,\"SI\")+COUNTIF('MOD6'!W20:Z34,\"NO\")))","v":""},null,null,null,null,null,null,null,null,null,null,null,{"$f":"IF('MOD6'!A1=TRUE,\"a\",\"\")","v":""}]
[]
[]
[]
[null,null,null,"Debe de llenar los campos solicitados para realizar el envio de los datos."]
[]
[null,null,"%",null,"&",null,"N",null,"O",null,"Y",null,"b",null,"h",null,"Š",null,"\u008f",null,"§",null,"¨",null,"þ",null,"H",null,"J",null,"M",null,"P",null,"Q",null,"z",null,"~",null,"á",null,"%",null,"&",null,"N",null,"O"]
[]
[]
[null,{"$f":"IF(VALUE(INFO(\"VERSION\"))<14,\"Probablemente la herramienta no pueda operar correctamente por ser una versión muy antigua de MS-Excel, comuníquese con Gestión de la Información!\",IF(ISERROR(CONCATENATE(\"Versión del Sistema Operativo: \",INFO(\"VERSIONSO\"),\",     Versión de MS-Excel: \",INFO(\"VERSION\"))),\"Probablemente la herramienta no pueda operar correctamente, comuníquese con Gestión de la Información!\",CONCATENATE(\"Versión del Sistema Operativo: \",INFO(\"VERSIONSO\"),\",     Versión de MS-Excel: \",INFO(\"VERSION\"))))","v":{"$error":"#VALUE!"}},null,null,null,null,null,null,null,null,null,null,null,null,null,null,null,null,null,null,null,null,null,null,null,null,null,null,null,null,null,null,null,null,null,null,null,null,null,null,null,null,null,null,null,null,null,null,null,null,{"$f":"IF(ING!$AY$43=\"\",\"\",ING!$AY$43)","v":{"$error":"#VALUE!"}}]

{"sheet":"MOD1","index":4,"n_rows":63,"n_cols":47,"rows_kept":63,"cut":false,"hidden":true,"merged":[[11,14,18,19],[11,26,18,31],[19,26,20,31],[11,20,18,25],[19,20,20,25],[62,40,63,41],[62,42,63,43],[62,44,63,45],[62,32,63,33],[62,34,63,35],[62,36,63,37],[62,38,63,39],[59,33,60,34],[21,38,24,45],[11,32,24,37],[11,38,20,45],[43,32,56,37],[43,38,52,45],[53,38,56,45],[27,32,40,37],[27,38,36,45],[37,38,40,45],[41,32,42,37],[41,38,42,45],[62,2,63,3],[62,4,63,5],[62,6,63,7],[62,8,63,9],[62,10,63,11],[21,14,24,19],[21,20,24,25],[59,2,60,31],[21,2,24,7],[21,26,24,31],[43,2,52,7],[43,8,50,13],[43,14,50,19],[43,20,50,25],[43,26,50,31],[51,8,52,13],[51,14,52,19],[51,20,52,25],[51,26,52,31],[53,2,56,7],[53,8,56,13],[62,28,63,29],[62,30,63,31],[7,2,8,45],[11,2,20,7],[9,38,10,45],[9,2,10,7],[10,8,10,13],[10,14,10,19],[10,20,10,25],[9,8,9,31],[10,26,10,31],[9,32,10,37],[19,14,20,19],[11,8,18,13],[19,8,20,13],[21,8,24,13],[62,12,63,13],[62,14,63,15],[62,16,63,17],[62,26,63,27],[62,24,63,25],[62,20,63,21],[62,22,63,23],[62,18,63,19],[53,14,56,19],[53,20,56,25],[53,26,56,31],[37,2,40,7],[37,8,40,15],[37,16,40,23],[37,24,40,31],[41,2,42,7],[41,8,41,31],[42,8,42,13],[42,14,42,19],[42,20,42,25],[42,26,42,31],[27,2,36,7],[27,8,34,15],[27,16,34,23],[27,24,34,31],[35,8,36,15],[35,16,36,23],[35,24,36,31],[25,2,26,7],[25,8,25,31],[25,32,26,37],[25,38,26,45],[26,8,26,15],[26,16,26,23],[26,24,26,31]]}
[{"$f":"COUNTIF(I20:AF21,\"SI\")+COUNTIF(I20:AF21,\"NO\")+COUNTIF(I36:AF37,\"SI\")+COUNTIF(I36:AF37,\"NO\")+COUNTIF(I52:AF53,\"SI\")+COUNTIF(I52:AF53,\"NO\")=11","v":false}]
[null,null,null,null,null,null,null,null,null,null,null,null,null,null,null,null,null,null,null,null,null,null,null,null,null,null,null,null,null,null,null,null,null,null,null,null,null,null,null,null,null,null,null,null,null,null,{"$f":"IF(ING!$AY$2=\"\",\"\",ING!$AY$2)","v":""}]
[]
[]
[]
[]
[]
[null,null,"Componentes de Gestión Escolar: Gestión Institucional y Gestión Pedagógica"]
[]
[null,null,"Actividades ambientales estandarizadas",null,null,null,null,null,"Hitos de aplicación del enfoque ambiental",null,null,null,null,null,null,null,null,null,null,null,null,null,null,null,null,null,null,null,null,null,null,null,"Indicador",null,null,null,null,null,"Describir principales aspectos, que facilitaron que la IE llegara a este logro, así como dificultades"]
[null,null,null,null,null,null,null,null,"A",null,null,null,null,null,"B",null,null,null,null,null,"C",null,null,null,null,null,"D"]
[null,null,"1.    La I.E. cuenta con un Comité Ambiental reconocido e institucionalizado.",null,null,null,null,null,"La Comisión Ambiental y de Gestión de Riesgos fue constituida y reconocida mediante resolución directoral.",null,null,null,null,null,"Las actividades de la Comisión están incluidas en el Plan Anual de Trabajo",null,null,null,null,null,"La Comisión Ambiental y de Gestión de Riesgos ha recibido capacitación sobre temas relacionados a cambio climático considerando su efecto en las poblaciones vulnerables y de género",null,null,null,null,null,"La Comisión Ambiental y de Gestión de Riesgos está conformado al menos por un (01) representante de la comunidad local (de instituciones privadas, públicas, organizaciones sociales, líderes y otros).",null,null,null,null,null,"N° de hitos de aplicación del enfoque ambiental puestos en práctica en la institucionalización del Comité Ambiental. "]
[]
[]
[]
[]
[]
[]
[]
[]
[]
[null,null,"Medios de verificación",null,null,null,null,null,"Resolución Directoral",null,null,null,null,null,"PAT",null,null,null,null,null,"Resolución Directoral",null,null,null,null,null,"Resolución Directoral",null,null,null,null,null,null,null,null,null,null,null,{"$f":"COUNTIF(I20:AF21,\"SI\")","v":0}]
[]
[]
[]
[null,null,"Actividades ambientales estandarizadas",null,null,null,null,null,"Hitos de aplicación del enfoque ambiental",null,null,null,null,null,null,null,null,null,null,null,null,null,null,null,null,null,null,null,null,null,null,null,"Indicador",null,null,null,null,null,"Describir principales aspectos, que facilitaron que la IE llegara a este logro, así como dificultades"]
[null,null,null,null,null,null,null,null,"A",null,null,null,null,null,null,null,"B",null,null,null,null,null,null,null,"C"]
[null,null,"2.    La I.E. actualizó y/o elaboró sus herramientas de gestión escolar con enfoque ambiental",null,null,null,null,null,"La I.E. incluyó el enfoque ambiental en el diagnóstico, visión, objetivos y/o metas del Proyecto Educativo Institucional.",null,null,null,null,null,null,null,"El Plan de Gestión del Riesgo de Desastres y Planes de Contingencia están incluidos en el PAT.",null,null,null,null,null,null,null,"La I.E. estableció en su Reglamento Interno las responsabilidades y funciones específicas para la Comisión Ambiental y de Gestión de Riesgos.",null,null,null,null,null,null,null,"N° de hitos de aplicación del enfoque ambiental puestos en práctica en la institucionalización del Comité Ambiental. "]
[]
[]
[]
[]
[]
[]
[]
[]
[]
[null,null,"Medios de verificación",null,null,null,null,null,"PEI",null,null,null,null,null,null,null,"PAT",null,null,null,null,null,null,null,"RI",null,null,null,null,null,null,null,null,null,null,null,null,null,{"$f":"COUNTIF(I36:AF37,\"SI\")","v":0}]
[]
[]
[]
[null,null,"Actividades ambientales estandarizadas",null,null,null,null,null,"Hitos de aplicación del enfoque ambiental",null,null,null,null,null,null,null,null,null,null,null,null,null,null,null,null,null,null,null,null,null,null,null,"Indicador",null,null,null,null,null,"Describir principales aspectos, que facilitaron que la IE llegara a este logro, así como dificultades"]
[null,null,null,null,null,null,null,null,"A",null,null,null,null,null,"B",null,null,null,null,null,"C",null,null,null,null,null,"D"]
[null,null,"3.    La I.E. incluyó en el PCI el enfoque ambiental y empleó recursos pedagógicos ambientales propios de la localidad.",null,null,null,null,null,"El PCI de la I.E. visibiliza la tranversavilidad del enfoque ambiental",null,null,null,null,null,"La I.E. transversalizó el enfoque ambiental en la programación curricular anual y unidades didácticas ",null,null,null,null,null,"La I.E. incluyó en las sesiones de aprendizaje las actividades del calendario ambiental nacional, local y/o comunal, así como los saberes y conocimientos ambientales locales.",null,null,null,null,null,"La I.E. incluyó en las sesiones de aprendizaje visitas pedagógicas a espacios naturales y culturales (áreas naturales protegidas, rutas de ecoturismo, proyectos de conservación, bosques comunitarios, playas locales, etc.)",null,null,null,null,null,"N° de hitos de aplicación del enfoque ambiental puestos en práctica en la institucionalización del Comité Ambiental. "]
[]
[]
[]
[]
[]
[]
[]
[]
[]
[null,null,"Medios de verificación",null,null,null,null,null,"PCI",null,null,null,null,null,"Programa Curricular Anual",null,null,null,null,null,"PCI / Unidades / Sesiones / evidencias en la producción de los estudiantes",null,null,null,null,null,"PCI / Unidades / Sesiones / evidencias en la producción de los estudiantes\nDocumentos de autorización de visitas y excursiones pedagógicas para el aprendizaje vivencial del enfoque ambiental.",null,null,null,null,null,null,null,null,null,null,null,{"$f":"COUNTIF(I52:AF53,\"SI\")","v":0}]
[]
[]
[]
[]
[]
[null,null,{"$f":"REPT(CHAR(73),18*(COUNTIF(I20:AF21,\"*\")+COUNTIF(I36:AF37,\"*\")+COUNTIF(I52:AF53,\"*\")))","v":""},null,null,null,null,null,null,null,null,null,null,null,null,null,null,null,null,null,null,null,null,null,null,null,null,null,null,null,null,null,null,{"$f":"IF(A1=TRUE,\"a\",\"\")","v":""}]
[]
[]
[null,null,"%",null,"&",null,"N",null,"O",null,"Y",null,"b",null,"h",null,"Š",null,"\u008f",null,"§",null,"¨",null,"þ",null,"H",null,"J",null,"M",null,"Y",null,"b",null,"h",null,"Š",null,"\u008f",null,"§",null,"¨"]

{"sheet":"MOD2","index":5,"n_rows":31,"n_cols":56,"rows_kept":31,"cut":false,"hidden":true,"merged":[[30,44,31,45],[30,32,31,33],[30,34,31,35],[30,36,31,37],[30,38,31,39],[30,40,31,41],[30,42,31,43],[30,26,31,27],[30,28,31,29],[30,30,31,31],[30,14,31,15],[30,16,31,17],[30,18,31,19],[30,20,31,21],[30,22,31,23],[30,24,31,25],[21,38,24,45],[27,2,28,31],[27,33,28,34],[30,2,31,3],[30,4,31,5],[30,6,31,7],[30,8,31,9],[30,10,31,11],[30,12,31,13],[21,2,24,7],[21,8,24,13],[21,14,24,19],[21,20,24,25],[21,26,24,31],[11,32,24,37],[11,38,20,45],[19,8,20,13],[19,14,20,19],[19,20,20,25],[19,26,20,31],[11,2,20,7],[11,8,18,13],[11,14,18,19],[11,20,18,25],[11,26,18,31],[7,2,8,45],[9,2,10,7],[9,8,9,31],[9,32,10,37],[9,38,10,45],[10,8,10,13],[10,14,10,19],[10,20,10,25],[10,26,10,31]]}
[{"$f":"COUNTIF(I20:AF21,\"SI\")+COUNTIF(I20:AF21,\"NO\")=4","v":false}]
[null,null,null,null,null,null,null,null,null,null,null,null,null,null,null,null,null,null,null,null,null,null,null,null,null,null,null,null,null,null,null,null,null,null,null,null,null,null,null,null,null,null,null,null,null,null,{"$f":"IF(ING!$AY$2=\"\",\"\",ING!$AY$2)","v":""}]
[]
[]
[]
[]
[]
[null,null,"Componente de Cambio Climático"]
[]
[null,null,"Actividades ambientales estandarizadas",null,null,null,null,null,"Hitos de aplicación del enfoque ambiental",null,null,null,null,null,null,null,null,null,null,null,null,null,null,null,null,null,null,null,null,null,null,null,"Indicador",null,null,null,null,null,"Describir principales aspectos, que facilitaron que la IE llegara a este logro, así como dificultades"]
[null,null,null,null,null,null,null,null,"A",null,null,null,null,null,"B",null,null,null,null,null,"C",null,null,null,null,null,"D"]
[null,null,"4.    La I.E. realizó actividades de mitigación y adaptación frente al Cambio climático.",null,null,null,null,null,"La I.E. crea, recupera y/o aprovecha áreas verdes y/o espacios naturales dentro de la I.E. como recurso pedagógico como acciones de mitigación frente al cambio climático. ",null,null,null,null,null,"La I.E. implementó actividades pedagógicas sobre la importancia y conservación de la diversidad biológica (flora y fauna, terrestre y acuática) y de los servicios ecosistémicos (lo servicios que el ambiente nos brinda), como aciones frente al cambio climático, para afianzar aprendizajes, valores y actitudes.",null,null,null,null,null," La I.E. implementó actividades pedagógicas de promoción de la producción y consumo responsables (valoración de prácticas compatibles con el cuidado del ambiente y los recursos naturales), como aciones de adaptación frente al cambio climático, para afianzar aprendizajes, valores y actitudes.",null,null,null,null,null,"La I.E. implementó actividades a favor de la recuperación y/o mantenimiento de espacios públicos y áreas verdes aledañas a la I.E. y en la comunidad local (jornadas de limpieza, el abono y/o sembrado de árboles, otras actividades), como acciones de mitigación frente al cambio climático. ",null,null,null,null,null,"N° de hitos de aplicación del enfoque ambiental puestos en práctica en la institucionalización del Comité Ambiental. "]
[null,null,null,null,null,null,null,null,null,null,null,null,null,null,null,null,null,null,null,null,null,null,null,null,null,null,null,null,null,null,null,null,null,null,null,null,null,null,null,null,null,null,null,null,null,null,null,null,null,null,null,null,null,null,null,{"$f":"IF('MOD2'!AM12=\"\",\"\",'MOD6'!M35)","v":""}]
[]
[]
[]
[]
[]
[]
[]
[]
[null,null,"Medios de verificación",null,null,null,null,null,"PCI\nPAT",null,null,null,null,null,"PCI / Unidades / Sesiones / evidencias en la producción de los estudiantes\nPAT",null,null,null,null,null,"PCI / Unidades / Sesiones / evidencias en la producción de los estudiantes\nPAT",null,null,null,null,null,"PAT",null,null,null,null,null,null,null,null,null,null,null,{"$f":"COUNTIF(I20:AF21,\"SI\")","v":0}]
[]
[]
[]
[]
[]
[null,null,{"$f":"REPT(CHAR(73),48*COUNTIF(I20:AF21,\"*\"))","v":""},null,null,null,null,null,null,null,null,null,null,null,null,null,null,null,null,null,null,null,null,null,null,null,null,null,null,null,null,null,null,{"$f":"IF(A1=TRUE,\"a\",\"\")","v":""}]
[]
[]
[null,null,"%",null,"&",null,"N",null,"O",null,"Y",null,"b",null,"h",null,"Š",null,"\u008f",null,"§",null,"¨",null,"þ",null,"H",null,"J",null,"M",null,"P",null,"Q",null,"z",null,"~",null,"á",null,"%",null,"&"]

{"sheet":"MOD3","index":6,"n_rows":79,"n_cols":47,"rows_kept":79,"cut":false,"hidden":true,"merged":[[78,26,79,27],[21,38,24,45],[75,2,76,31],[75,33,76,34],[78,2,79,3],[37,14,40,19],[37,20,40,25],[37,26,40,31],[27,2,36,7],[27,8,34,13],[27,14,34,19],[27,20,34,25],[27,26,34,31],[26,26,26,31],[37,38,40,45],[25,2,26,7],[25,8,25,31],[25,32,26,37],[25,38,26,45],[26,8,26,13],[26,14,26,19],[26,20,26,25],[27,38,36,45],[35,8,36,13],[78,40,79,41],[78,42,79,43],[78,44,79,45],[78,28,79,29],[78,30,79,31],[78,32,79,33],[78,34,79,35],[78,36,79,37],[78,38,79,39],[78,14,79,15],[11,38,20,45],[21,2,24,7],[11,2,20,7],[11,32,24,37],[78,4,79,5],[78,6,79,7],[78,8,79,9],[78,10,79,11],[78,12,79,13],[78,16,79,17],[78,18,79,19],[78,20,79,21],[78,22,79,23],[78,24,79,25],[11,8,18,13],[11,14,18,19],[11,20,18,25],[11,26,18,31],[19,8,20,13],[19,14,20,19],[19,20,20,25],[19,26,20,31],[21,8,24,13],[7,2,8,45],[9,2,10,7],[9,8,9,31],[9,32,10,37],[9,38,10,45],[10,8,10,13],[10,14,10,19],[10,20,10,25],[10,26,10,31],[57,2,58,7],[57,8,57,31],[57,32,58,37],[57,38,58,45],[58,8,58,13],[58,14,58,19],[58,20,58,25],[58,26,58,31],[21,20,24,25],[21,26,24,31],[41,2,42,7],[41,8,41,31],[41,32,42,37],[21,14,24,19],[27,32,40,37],[35,14,36,19],[35,20,36,25],[35,26,36,31],[37,2,40,7],[37,8,40,13],[41,38,42,45],[42,8,42,15],[42,16,42,23],[42,24,42,31],[43,2,52,7],[43,8,50,15],[43,16,50,23],[43,24,50,31],[43,32,56,37],[43,38,52,45],[51,8,52,15],[51,16,52,23],[51,24,52,31],[53,2,56,7],[53,8,56,15],[53,16,56,23],[53,24,56,31],[53,38,56,45],[69,2,72,7],[69,8,72,13],[69,14,72,19],[69,20,72,25],[69,26,72,31],[59,32,72,37],[59,38,68,45],[67,8,68,13],[67,14,68,19],[67,20,68,25],[67,26,68,31],[69,38,72,45],[59,2,68,7],[59,8,66,13],[59,14,66,19],[59,20,66,25],[59,26,66,31]]}
[{"$f":"COUNTIF(I20:AF21,\"SI\")+COUNTIF(I20:AF21,\"NO\")+COUNTIF(I36:AF37,\"SI\")+COUNTIF(I36:AF37,\"NO\")+COUNTIF(I52:AF53,\"SI\")+COUNTIF(I52:AF53,\"NO\")+COUNTIF(I68:AF69,\"SI\")+COUNTIF(I68:AF69,\"NO\")=15","v":false}]
[null,null,null,null,null,null,null,null,null,null,null,null,null,null,null,null,null,null,null,null,null,null,null,null,null,null,null,null,null,null,null,null,null,null,null,null,null,null,null,null,null,null,null,null,null,null,{"$f":"IF(ING!$AY$2=\"\",\"\",ING!$AY$2)","v":""}]
[]
[]
[]
[]
[]
[null,null,"Componente de Ecoeficiencia"]
[]
[null,null,"Actividades ambientales estandarizadas",null,null,null,null,null,"Hitos de aplicación del enfoque ambiental",null,null,null,null,null,null,null,null,null,null,null,null,null,null,null,null,null,null,null,null,null,null,null,"Indicador",null,null,null,null,null,"Describir principales aspectos, que facilitaron que la IE llegara a este logro, así como dificultades"]
[null,null,null,null,null,null,null,null,"A",null,null,null,null,null,"B",null,null,null,null,null,"C",null,null,null,null,null,"D"]
[null,null,"5.    La I.E. realizó actividades de manejo de residuos sólidos. ",null,null,null,null,null,"La I.E. cuenta con un Plan de manejo adecuado de los residuos sólidos, y actividades de las \"3R\" (Reducir, Reusar y Reciclar) incluidos en el PAT.",null,null,null,null,null,"La I.E. implementó actividades pedagógicas  sobre el manejo adecuado de los residuos sólidos y la aplicación de las “3R”: Reducir, Reusar y Reciclar, para afianzar aprendizajes, valores y actitudes.",null,null,null,null,null,"La I.E. coordinó con el gobierno local u otras instituciones aliadas la recolección y transporte de los residuos para la disposición final de los residuos sólidos de la I.E.",null,null,null,null,null,"La I.E. sensibilizó  a los padres y madres de familia  y/o comunidad local  sobre el manejo adecuado de los residuos sólidos y en actividades de las 3R: Reducir, Reusar y Reciclar.",null,null,null,null,null,"N° de hitos de aplicación del enfoque ambiental puestos en práctica en la institucionalización del Comité Ambiental. "]
[]
[]
[]
[]
[]
[]
[]
[]
[]
[null,null,"Medios de verificación",null,null,null,null,null,"Plan de Manejo de Residuos Sólidos\nPAT",null,null,null,null,null,"PCI / Unidades / Sesiones / evidencias en la producción de los estudiantes\nPAT",null,null,null,null,null,"Cartas u oficios de coordinación del Gobierno regional u otros aliados.\nPAT",null,null,null,null,null,"PAT\nDocumentos administrativos: Cartas, Oficios, Memo\nLista de Asistencia\nFotografías",null,null,null,null,null,null,null,null,null,null,null,{"$f":"COUNTIF(I20:AF21,\"SI\")","v":0}]
[]
[]
[]
[null,null,"Actividades ambientales estandarizadas",null,null,null,null,null,"Hitos de aplicación del enfoque ambiental",null,null,null,null,null,null,null,null,null,null,null,null,null,null,null,null,null,null,null,null,null,null,null,"Indicador",null,null,null,null,null,"Describir principales aspectos, que facilitaron que la IE llegara a este logro, así como dificultades"]
[null,null,null,null,null,null,null,null,"A",null,null,null,null,null,"B",null,null,null,null,null,"C",null,null,null,null,null,"D"]
[null,null,"6.    La I.E. practicó el uso ecoeficiente de la energía.",null,null,null,null,null,"La I.E. implementó medidas institucionales de ecoeficiencia para el ahorro y buen uso de la energía (uso de focos ahorradores, entre otros) incluidas en el PAT. ",null,null,null,null,null,"La I.E. implementó actividades pedagógicas  sobre el consumo responsable y el manejo adecuado de la energía para afianzar aprendizajes, valores y actitudes.",null,null,null,null,null,"La I.E.  implementó actividades pedagógicas sobre la importancia del uso de medios de transporte menos nocivos para el ambiente (por ejemplo, transporte público, bicicletas, caminatas, etc.) para afianzar aprendizajes, valores y actitudes.",null,null,null,null,null,"La I.E. sensibilizó a los padres y madres de familia  y/o comunidad local sobre el uso ecoeficiente de la energía y el uso de medios de transporte públicos y alternativos (bicicletas, caminatas, etc.)",null,null,null,null,null,"N° de hitos de aplicación del enfoque ambiental puestos en práctica en la institucionalización del Comité Ambiental. "]
[]
[]
[]
[]
[]
[]
[]
[]
[]
[null,null,"Medios de verificación",null,null,null,null,null,"PAT",null,null,null,null,null,"PCI / Unidades / Sesiones / evidencias en la producción de los estudiantes\nPAT",null,null,null,null,null,"PCI / Unidades / Sesiones / evidencias en la producción de los estudiantes\nPAT",null,null,null,null,null,"PAT\nDocumentos administrativos: Cartas, Oficios, Memo\nLista de Asistencia\nFotografías",null,null,null,null,null,null,null,null,null,null,null,{"$f":"COUNTIF(I36:AF37,\"SI\")","v":0}]
[]
[]
[]
[null,null,"Actividades ambientales estandarizadas",null,null,null,null,null,"Hitos de aplicación del enfoque ambiental",null,null,null,null,null,null,null,null,null,null,null,null,null,null,null,null,null,null,null,null,null,null,null,"Indicador",null,null,null,null,null,"Describir principales aspectos, que facilitaron que la IE llegara a este logro, así como dificultades"]
[null,null,null,null,null,null,null,null,"A",null,null,null,null,null,null,null,"B",null,null,null,null,null,null,null,"C"]
[null,null,"7.    La I.E. practicó el empleo de energía renovable.",null,null,null,null,null,"La I.E. ha implementado medidas institucionales sobre el empleo de energía renovable incluidas en el PAT. ",null,null,null,null,null,null,null,"La I.E. implementó actividades pedagógicas  sobre el uso de energía renovable, de acuerdo a su contexto para afianzar aprendizajes, valores y actitudes. ",null,null,null,null,null,null,null,"La I.E. sensibilizó a los padres y madres de familia  y/o comunidad local para el empleo de energía renovable.",null,null,null,null,null,null,null,"N° de hitos de aplicación del enfoque ambiental puestos en práctica en la institucionalización del Comité Ambiental. "]
[]
[]
[]
[]
[]
[]
[]
[]
[]
[null,null,"Medios de verificación",null,null,null,null,null,"PAT",null,null,null,null,null,null,null,"PCI / Unidades / Sesiones / evidencias en la producción de los estudiantes\nPAT",null,null,null,null,null,null,null,"PAT\nDocumentos administrativos: Cartas, Oficios, Memo\nLista de Asistencia\nFotografías",null,null,null,null,null,null,null,null,null,null,null,null,null,{"$f":"COUNTIF(I52:AF53,\"SI\")","v":0}]
[]
[]
[]
[null,null,"Actividades ambientales estandarizadas",null,null,null,null,null,"Hitos de aplicación del enfoque ambiental",null,null,null,null,null,null,null,null,null,null,null,null,null,null,null,null,null,null,null,null,null,null,null,"Indicador",null,null,null,null,null,"Describir principales aspectos, que facilitaron que la IE llegara a este logro, así como dificultades"]
[null,null,null,null,null,null,null,null,"A",null,null,null,null,null,"B",null,null,null,null,null,"C",null,null,null,null,null,"D"]
[null,null,"8.    La I.E. practicó la gestión integral y uso eficiente de los recursos hídricos.",null,null,null,null,null,"La I.E. implementó medidas institucionales de ecoeficiencia para el ahorro y buen uso del agua, incluidas en el PAT.",null,null,null,null,null,"La I.E. implementó actividades pedagógicas  sobre el consumo y manejo responsable  de los recursos hídricos para afianzar aprendizajes, valores y actitudes.",null,null,null,null,null,"La I.E. implementó  actividades pedagógicas sobre cultura del agua (por ejemplo la conservación del agua y  cuencas hidrográficas, agua segura, practicas ancestrales de siembra y cosecha del agua, entre otros), para afianzar aprendizajes, valores y actitudes.",null,null,null,null,null,"La I.E.  sensibilizó a los padres y madres de familia  y/o comunidad local para promover la gestión integral de recursos hídricos y una nueva cultura del agua.",null,null,null,null,null,"N° de hitos de aplicación del enfoque ambiental puestos en práctica en la institucionalización del Comité Ambiental. "]
[]
[]
[]
[]
[]
[]
[]
[]
[]
[null,null,"Medios de verificación",null,null,null,null,null,"PAT",null,null,null,null,null,"PCI / Unidades / Sesiones / evidencias en la producción de los estudiantes\nPAT",null,null,null,null,null,"PCI / Unidades / Sesiones / evidencias en la producción de los estudiantes\nPAT",null,null,null,null,null,"PAT\nDocumentos administrativos: Cartas, Oficios, Memo\nLista de Asistencia\nFotografías",null,null,null,null,null,null,null,null,null,null,null,{"$f":"COUNTIF(I68:AF69,\"SI\")","v":0}]
[]
[]
[]
[]
[]
[null,null,{"$f":"REPT(CHAR(73),13*(COUNTIF(I20:AF21,\"*\")+COUNTIF(I36:AF37,\"*\")+COUNTIF(I52:AF53,\"*\")+COUNTIF(I68:AF69,\"*\")))","v":""},null,null,null,null,null,null,null,null,null,null,null,null,null,null,null,null,null,null,null,null,null,null,null,null,null,null,null,null,null,null,{"$f":"IF(A1=TRUE,\"a\",\"\")","v":""}]
[]
[]
[null,null,"%",null,"&",null,"N",null,"O",null,"Y",null,"b",null,"h",null,"Š",null,"\u008f",null,"§",null,"¨",null,"þ",null,"H",null,"J",null,"M",null,"P",null,"Q",null,"z",null,"~",null,"á",null,"%",null,"&"]

{"sheet":"MOD4","index":7,"n_rows":79,"n_cols":47,"rows_kept":79,"cut":false,"hidden":true,"merged":[[59,8,66,13],[59,14,66,19],[59,20,66,25],[59,26,66,31],[67,8,68,13],[67,14,68,19],[67,20,68,25],[67,26,68,31],[69,8,72,13],[69,14,72,19],[69,20,72,25],[69,26,72,31],[75,2,76,31],[25,2,26,7],[25,8,25,31],[59,2,68,7],[37,2,40,7],[27,8,34,13],[27,14,34,19],[37,38,40,45],[57,2,58,7],[57,8,57,31],[57,32,58,37],[57,38,58,45],[25,32,26,37],[25,38,26,45],[27,2,36,7],[27,32,40,37],[27,38,36,45],[43,32,56,37],[43,38,52,45],[53,2,56,7],[59,32,72,37],[59,38,68,45],[69,2,72,7],[69,38,72,45],[78,34,79,35],[78,36,79,37],[78,38,79,39],[78,16,79,17],[78,18,79,19],[78,20,79,21],[78,22,79,23],[78,24,79,25],[78,26,79,27],[75,33,76,34],[78,2,79,3],[78,4,79,5],[78,6,79,7],[78,8,79,9],[78,10,79,11],[78,12,79,13],[78,14,79,15],[11,38,20,45],[21,2,24,7],[11,2,20,7],[11,32,24,37],[53,38,56,45],[78,40,79,41],[78,42,79,43],[78,44,79,45],[41,2,42,7],[41,8,41,31],[41,32,42,37],[41,38,42,45],[43,2,52,7],[78,28,79,29],[78,30,79,31],[78,32,79,33],[7,2,8,45],[9,2,10,7],[9,8,9,31],[9,32,10,37],[9,38,10,45],[21,38,24,45],[11,8,18,13],[11,14,18,19],[11,20,18,25],[11,26,18,31],[19,8,20,13],[19,14,20,19],[19,20,20,25],[19,26,20,31],[21,8,24,13],[21,14,24,19],[21,20,24,25],[21,26,24,31],[10,8,10,13],[10,14,10,19],[53,20,56,25],[53,26,56,31],[27,20,34,25],[27,26,34,31],[35,8,36,13],[35,14,36,19],[35,20,36,25],[35,26,36,31],[37,8,40,13],[37,14,40,19],[37,20,40,25],[37,26,40,31],[58,8,58,13],[58,14,58,19],[58,20,58,25],[58,26,58,31],[10,20,10,25],[10,26,10,31],[26,8,26,13],[26,14,26,19],[26,20,26,25],[26,26,26,31],[42,8,42,13],[42,14,42,19],[42,20,42,25],[42,26,42,31],[43,8,50,13],[43,14,50,19],[43,20,50,25],[43,26,50,31],[51,8,52,13],[51,14,52,19],[51,20,52,25],[51,26,52,31],[53,8,56,13],[53,14,56,19]]}
[{"$f":"COUNTIF(I20:AF21,\"SI\")+COUNTIF(I20:AF21,\"NO\")+COUNTIF(I36:AF37,\"SI\")+COUNTIF(I36:AF37,\"NO\")+COUNTIF(I52:AF53,\"SI\")+COUNTIF(I52:AF53,\"NO\")+COUNTIF(I68:AF69,\"SI\")+COUNTIF(I68:AF69,\"NO\")=16","v":false}]
[null,null,null,null,null,null,null,null,null,null,null,null,null,null,null,null,null,null,null,null,null,null,null,null,null,null,null,null,null,null,null,null,null,null,null,null,null,null,null,null,null,null,null,null,null,null,{"$f":"IF(ING!$AY$2=\"\",\"\",ING!$AY$2)","v":""}]
[]
[]
[]
[]
[]
[null,null,"Componente de Salud"]
[]
[null,null,"Actividades ambientales estandarizadas",null,null,null,null,null,"Hitos de aplicación del enfoque ambiental",null,null,null,null,null,null,null,null,null,null,null,null,null,null,null,null,null,null,null,null,null,null,null,"Indicador",null,null,null,null,null,"Describir principales aspectos, que facilitaron que la IE llegara a este logro, así como dificultades"]
[null,null,null,null,null,null,null,null,"A",null,null,null,null,null,"B",null,null,null,null,null,"C",null,null,null,null,null,"D"]
[null,null,"9. La I.E. implementó acciones sobre alimentación saludable y sostenible.",null,null,null,null,null,"La I.E. cuenta con una planificación de actividades, así como espacios educativos acondiconados, para garantizar la alimentación saludable y sostenible, incluidos en el PAT. ",null,null,null,null,null,"La I.E. implementó actividades pedagógicas para la revalorización y consumo de alimentos saludables de origen local para afianzar aprendizajes, valores y actitudes.",null,null,null,null,null,"La I.E. implementó y supervisó los centros de expendio de alimentos (como los quioscos, cafetines, cafeterías y/o comedores escolares), garantizando el acceso, la disponibilidad y el consumo de una alimentación saludable y sostenible, según la normativa vigente.",null,null,null,null,null,"La I.E. sensibilizó a las familias de la comunidad educativa sobre la importancia de una alimentación saludable  y sostenible (refrigerios y loncheras saludables), así como la revalorización y cconsumo de alimentos saludables de origen local.",null,null,null,null,null,"N° de hitos de aplicación del enfoque ambiental puestos en práctica en la institucionalización del Comité Ambiental. "]
[]
[]
[]
[]
[]
[]
[]
[]
[]
[null,null,"Medios de verificación",null,null,null,null,null,"PAT\n",null,null,null,null,null,"PCI / Unidades / Sesiones / evidencias en la producción de los estudiantes\nPAT",null,null,null,null,null,"PAT\nCartas, Oficios, Memo u otros documentos.",null,null,null,null,null,"PAT\nDocumentos administrativos: Cartas, Oficios, Memo\nLista de Asistencia\nFotografías",null,null,null,null,null,null,null,null,null,null,null,{"$f":"COUNTIF(I20:AF21,\"SI\")","v":0}]
[]
[]
[]
[null,null,"Actividades ambientales estandarizadas",null,null,null,null,null,"Hitos de aplicación del enfoque ambiental",null,null,null,null,null,null,null,null,null,null,null,null,null,null,null,null,null,null,null,null,null,null,null,"Indicador",null,null,null,null,null,"Describir principales aspectos, que facilitaron que la IE llegara a este logro, así como dificultades"]
[null,null,null,null,null,null,null,null,"A",null,null,null,null,null,"B",null,null,null,null,null,"C",null,null,null,null,null,"D"]
[null,null,"10. La I.E. implementó  acciones para la práctica de la higiene integral (lavado de manos, higiene bucal, aseo y cuidado personal). ",null,null,null,null,null,"La I.E. cuenta con espacios educativos acondicionados, para garantizar la puesta en práctica de hábitos de higiene integral, incluidos en el PAT.",null,null,null,null,null,"La I.E.  Implementó actividades pedagógicas sobre la importancia y la práctica diaria del lavado de manos (antes y después de las comidas,  después de realizar actividades físicas, después del uso de los baños) e higiene bucal, para afianzar aprendizajes, valores y actitudes.",null,null,null,null,null,"La I.E. implementó actividades pedagógicas sobre la importancia y la práctica diaria de aseo y del cuidado personal (baño cotidiano, control de la pediculosis, ropa limpia, etc.). ",null,null,null,null,null,"La I.E. sensibilizó  a los padres y madres de familia  y/o comunidad local  en la adopción de hábitos de higiene integral.",null,null,null,null,null,"N° de hitos de aplicación del enfoque ambiental puestos en práctica en la institucionalización del Comité Ambiental. "]
[]
[]
[]
[]
[]
[]
[]
[]
[]
[null,null,"Medios de verificación",null,null,null,null,null,"PAT",null,null,null,null,null,"PCI / Unidades / Sesiones / evidencias en la producción de los estudiantes\nPAT",null,null,null,null,null,"PCI / Unidades / Sesiones / evidencias en la producción de los estudiantes\nPAT",null,null,null,null,null,"PAT\nDocumentos administrativos: Cartas, Oficios, Memo\nLista de Asistencia\nFotografías",null,null,null,null,null,null,null,null,null,null,null,{"$f":"COUNTIF(I36:AF37,\"SI\")","v":0}]
[]
[]
[]
[null,null,"Actividades ambientales estandarizadas",null,null,null,null,null,"Hitos de aplicación del enfoque ambiental",null,null,null,null,null,null,null,null,null,null,null,null,null,null,null,null,null,null,null,null,null,null,null,"Indicador",null,null,null,null,null,"Describir principales aspectos, que facilitaron que la IE llegara a este logro, así como dificultades"]
[null,null,null,null,null,null,null,null,"A",null,null,null,null,null,"B",null,null,null,null,null,"C",null,null,null,null,null,"D"]
[null,null,"11. La I.E. implementó actividades de mantenimiento, orden y limpieza de todos los ambientes como práctica cotidiana y para la prevención de enfermedades prevalentes.",null,null,null,null,null,"La I.E. implementó medidas de mantenimiento, orden, limpieza, ventilación e iluminación ,para  garantizar espacios educativos saludables, al interior y en el perímetro exterior de la I.E., incluidos en el PAT.",null,null,null,null,null,"La I.E. implementó actividades pedagógicas sobre la importancia y la práctica de la limpieza periódica, el orden, la ventilación e iluminación de espacios, como medidas de prevención de enfermedades prevalentes (EDAs, IRAs, Influenza, Dengue y otras de prevalencia local, TBC, entre otros), para afianzar aprendizajes, valores y actitudes.",null,null,null,null,null,"La I.E. programó y ejecutó, en coordinación con la UGEL u otros aliados, la desinfección y fumigación de las aulas, los servicios higiénicos, y otros espacios educativos de la I.E.",null,null,null,null,null,"La I.E. sensibilizó  a los padres y madres de familia  y/o comunidad local, y logra su participación en las actividades de conservación y limpieza de los espacios interiores y exteriores a la I.E como medidas preventivas de enfermedades prevalentes.",null,null,null,null,null,"N° de hitos de aplicación del enfoque ambiental puestos en práctica en la institucionalización del Comité Ambiental. "]
[]
[]
[]
[]
[]
[]
[]
[]
[]
[null,null,"Medios de verificación",null,null,null,null,null,"PAT",null,null,null,null,null,"PCI / Unidades / Sesiones / evidencias en la producción de los estudiantes\nPAT",null,null,null,null,null,"PAT\nCartas, Oficios, Memo u otros documentos.",null,null,null,null,null,"PAT\nDocumentos administrativos: Cartas, Oficios, Memo\nLista de Asistencia\nFotografías",null,null,null,null,null,null,null,null,null,null,null,{"$f":"COUNTIF(I52:AF53,\"SI\")","v":0}]
[]
[]
[]
[null,null,"Actividades ambientales estandarizadas",null,null,null,null,null,"Hitos de aplicación del enfoque ambiental",null,null,null,null,null,null,null,null,null,null,null,null,null,null,null,null,null,null,null,null,null,null,null,"Indicador",null,null,null,null,null,"Describir principales aspectos, que facilitaron que la IE llegara a este logro, así como dificultades"]
[null,null,null,null,null,null,null,null,"A",null,null,null,null,null,"B",null,null,null,null,null,"C",null,null,null,null,null,"D"]
[null,null,"12. La I.E. adoptó medidas de protección frente a los efectos nocivos por la exposición a la radiación ultravioleta",null,null,null,null,null,"La I.E. implementó medidas de protección y prevención de los efectos nocivos de la radiación solar (promover el uso de elementos que brinden protección, la instalación de techos y/o toldos con mallas de tipo raschel en patios, jardines u otros espacios, etc.).",null,null,null,null,null,"La I.E. implementó actividades pedagógicas sobre la prevención de los efectos nocivos por la exposición prolongada a la radiación solar, para afianzar aprendizajes, valores y actitudes.",null,null,null,null,null,"La I.E implementó medidas para el desarrollo de actividades pedagógicas, deportivas y otras que se realicen al aire libre, procurando realizarlas según las indicaciones de la norma técnica vigente, para la prevención de los efectos nocivos por la exposición prolongada a la radiación solar. ",null,null,null,null,null,"La I.E. sensibilizó  a los padres y madres de familia  y/o comunidad local  sobre las medidas de protección a implementar durante todos el año frente a los efectos nocivos por la exposición prolongada a la radiación solar. ",null,null,null,null,null,"N° de hitos de aplicación del enfoque ambiental puestos en práctica en la institucionalización del Comité Ambiental. "]
[]
[]
[]
[]
[]
[]
[]
[]
[]
[null,null,"Medios de verificación",null,null,null,null,null,"PAT",null,null,null,null,null,"PCI / Unidades / Sesiones / evidencias en la producción de los estudiantes\nPAT",null,null,null,null,null,"PAT\nRI",null,null,null,null,null,"PAT\nComunicados\nPlanes de Talleres o campañas\nLista de Asistencia\nFotografías",null,null,null,null,null,null,null,null,null,null,null,{"$f":"COUNTIF(I68:AF69,\"SI\")","v":0}]
[]
[]
[]
[]
[]
[null,null,{"$f":"REPT(CHAR(73),12*(COUNTIF(I20:AF21,\"*\")+COUNTIF(I36:AF37,\"*\")+COUNTIF(I52:AF53,\"*\")+COUNTIF(I68:AF69,\"*\")))","v":""},null,null,null,null,null,null,null,null,null,null,null,null,null,null,null,null,null,null,null,null,null,null,null,null,null,null,null,null,null,null,{"$f":"IF(A1=TRUE,\"a\",\"\")","v":""}]
[]
[]
[null,null,"%",null,"&",null,"N",null,"O",null,"Y",null,"b",null,"h",null,"Š",null,"\u008f",null,"§",null,"¨",null,"þ",null,"H",null,"J",null,"M",null,"P",null,"Q",null,"z",null,"~",null,"á",null,"%",null,"&"]

{"sheet":"MOD5","index":8,"n_rows":31,"n_cols":47,"rows_kept":31,"cut":false,"hidden":true,"merged":[[11,38,20,45],[19,8,20,13],[30,22,31,23],[30,24,31,25],[30,26,31,27],[19,14,20,19],[19,20,20,25],[19,26,20,31],[11,32,24,37],[30,28,31,29],[30,30,31,31],[30,32,31,33],[30,34,31,35],[30,36,31,37],[30,8,31,9],[30,10,31,11],[30,40,31,41],[30,42,31,43],[30,44,31,45],[21,38,24,45],[27,2,28,31],[27,33,28,34],[30,2,31,3],[30,4,31,5],[30,6,31,7],[30,14,31,15],[30,12,31,13],[30,38,31,39],[30,16,31,17],[30,18,31,19],[30,20,31,21],[21,2,24,7],[21,8,24,13],[21,14,24,19],[21,20,24,25],[21,26,24,31],[11,2,20,7],[11,8,18,13],[11,14,18,19],[11,20,18,25],[11,26,18,31],[7,2,8,45],[9,2,10,7],[9,8,9,31],[9,32,10,37],[9,38,10,45],[10,8,10,13],[10,14,10,19],[10,20,10,25],[10,26,10,31]]}
[{"$f":"COUNTIF(I20:AF21,\"SI\")+COUNTIF(I20:AF21,\"NO\")=4","v":false}]
[null,null,null,null,null,null,null,null,null,null,null,null,null,null,null,null,null,null,null,null,null,null,null,null,null,null,null,null,null,null,null,null,null,null,null,null,null,null,null,null,null,null,null,null,null,null,{"$f":"IF(ING!$AY$2=\"\",\"\",ING!$AY$2)","v":""}]
[]
[]
[]
[]
[]
[null,null,"Componente de Gestión del Riesgo de Desastres"]
[]
[null,null,"Actividades ambientales estandarizadas",null,null,null,null,null,"Hitos de aplicación del enfoque ambiental",null,null,null,null,null,null,null,null,null,null,null,null,null,null,null,null,null,null,null,null,null,null,null,"Indicador",null,null,null,null,null,"Describir principales aspectos, que facilitaron que la IE llegara a este logro, así como dificultades"]
[null,null,null,null,null,null,null,null,"A",null,null,null,null,null,"B",null,null,null,null,null,"C",null,null,null,null,null,"D"]
[null,null,"13. La IE adoptó medidas para la Gestión del Riesgo de Desastres.",null,null,null,null,null,"La I.E. implementó medidas para la preparación y respuesta frente a emergencias y desastres (señalética, croquis de señalización y evacuación interna, acondicionamiento del COE, otros.).",null,null,null,null,null,"La I.E. implementó actividades institucionales para simulacros (campañas comunicacionales, pasacalles, concurso de murales, etc.), para hacer frente a las emergencias y/o desastres, en atención al contexto local.",null,null,null,null,null,"La I.E. implementó actividades pedagógicas sobre la gestión del riesgo de desastres en el marco del enfoque ambiental y en atención al contexto local para afianzar aprendizajes, valores y actitudes.",null,null,null,null,null,"La I.E. sensibilizó a los estudiantes, y padres y madres de familia, sobre la prevención, reducción, preparación, respuesta y rehabilitación, para hacer frente a las emergencias y/o desastres, en atención al contexto local.",null,null,null,null,null,"N° de hitos de aplicación del enfoque ambiental puestos en práctica en la institucionalización del Comité Ambiental. "]
[]
[]
[]
[]
[]
[]
[]
[]
[]
[null,null,"Medios de verificación",null,null,null,null,null,"PAT",null,null,null,null,null,"PAT",null,null,null,null,null,"PCI / Unidades / Sesiones / evidencias en la producción de los estudiantes\nPAT",null,null,null,null,null,"PAT\nComunicados\nPlanes de Talleres o campañas\nLista de Asistencia\nFotografías",null,null,null,null,null,null,null,null,null,null,null,{"$f":"COUNTIF(I20:AF21,\"SI\")","v":0}]
[]
[]
[]
[]
[]
[null,null,{"$f":"REPT(CHAR(73),48*(COUNTIF(I20:AF21,\"*\")))","v":""},null,null,null,null,null,null,null,null,null,null,null,null,null,null,null,null,null,null,null,null,null,null,null,null,null,null,null,null,null,null,{"$f":"IF(A1=TRUE,\"a\",\"\")","v":""}]
[]
[]
[null,null,"%",null,"&",null,"N",null,"O",null,"Y",null,"b",null,"h",null,"Š",null,"\u008f",null,"§",null,"¨",null,"þ",null,"H",null,"J",null,"M",null,"P",null,"Q",null,"z",null,"~",null,"á",null,"%",null,"&"]

{"sheet":"MOD6","index":9,"n_rows":55,"n_cols":51,"rows_kept":55,"cut":false,"hidden":true,"merged":[[43,4,44,25],[43,26,44,29],[43,30,44,33],[43,34,44,37],[43,38,44,41],[31,48,33,49],[34,48,36,49],[31,42,33,47],[16,34,18,37],[16,38,18,41],[19,48,21,49],[22,48,24,49],[25,48,27,49],[28,48,30,49],[25,34,27,37],[25,38,27,41],[25,42,27,47],[28,38,30,41],[28,34,30,37],[15,42,18,47],[28,42,30,47],[31,38,33,41],[15,4,18,21],[25,26,27,29],[22,26,24,29],[28,26,30,29],[16,26,18,29],[22,22,24,25],[25,22,27,25],[28,22,30,25],[19,4,21,21],[22,4,24,21],[25,4,27,21],[28,4,30,21],[15,26,15,41],[19,22,21,25],[15,22,18,25],[16,30,18,33],[8,2,9,49],[10,3,12,48],[51,24,52,25],[51,2,52,3],[51,4,52,5],[51,6,52,7],[51,8,52,9],[51,10,52,11],[51,12,52,13],[51,14,52,15],[51,16,52,17],[51,18,52,19],[51,20,52,21],[34,34,36,37],[34,38,36,41],[51,28,52,29],[22,42,24,47],[19,26,21,29],[19,42,21,47],[25,30,27,33],[22,30,24,33],[22,34,24,37],[22,38,24,41],[28,30,30,33],[19,50,21,50],[22,50,24,50],[25,50,27,50],[28,50,30,50],[31,50,33,50],[51,22,52,23],[51,48,52,49],[51,26,52,27],[34,50,36,50],[51,42,52,43],[51,44,52,45],[51,46,52,47],[51,30,52,31],[51,32,52,33],[51,34,52,35],[51,36,52,37],[51,38,52,39],[51,40,52,41],[34,42,36,47],[34,22,36,25],[19,30,21,33],[19,34,21,37],[19,38,21,41],[31,34,33,37],[31,4,33,21],[34,10,36,21],[34,26,36,29],[31,26,33,29],[31,30,33,33],[34,30,36,33],[31,22,33,25],[34,2,36,3],[19,2,21,3],[22,2,24,3],[25,2,27,3],[28,2,30,3],[31,2,33,3],[34,4,36,9],[40,50,42,50],[37,2,39,3],[37,4,39,9],[37,10,39,21],[37,22,39,25],[37,26,39,29],[37,30,39,33],[37,34,39,37],[37,38,39,41],[37,42,39,47],[37,48,39,49],[37,50,39,50],[40,30,42,33],[40,34,42,37],[40,38,42,41],[40,42,42,47],[40,48,42,49],[40,2,42,3],[40,4,42,9],[40,10,42,21],[40,22,42,25],[40,26,42,29]]}
[{"$f":"COUNTIF(W20:Z34,\"SI\")+COUNTIF(W20:Z34,\"NO\")=5","v":false}]
[null,null,null,null,null,null,null,null,null,null,null,null,null,null,null,null,null,null,null,null,null,null,null,null,null,null,null,null,null,null,null,null,null,null,null,null,null,null,null,null,null,null,null,null,null,null,null,null,null,null,{"$f":"IF(ING!$AY$2=\"\",\"\",ING!$AY$2)","v":""}]
[]
[]
[]
[]
[]
[]
[null,null,"Proyecto Educativo Ambiental Integrado (PEAI)"]
[]
[null,null,null,"El Proyecto Educativo Ambiental Integrado (PEAI) es una herramienta institucional y pedagógica que permite la mejor implementación de las actividades estandarizadas de cada uno de los componentes del enfoque ambiental."]
[]
[]
[]
[null,null,null,null,1,1,1,1,1,1,1,1,1,1,1,1,1,1,1,1,1,1,1,1,1,1,1,1,1,1,1,1,1,1,1,1,1,1,1,1,1,1,1,1,1,1,1,1]
[null,null,null,null,"Nombre del Proyecto Educativo Ambiental Integrado",null,null,null,null,null,null,null,null,null,null,null,null,null,null,null,null,null,"Proyecto Ejecutado en el 2017",null,null,null,"Marcar el PEAI implementado (debe marcar siempre y cuando cuente con un PEAI implementándose activamente en la IIEE)",null,null,null,null,null,null,null,null,null,null,null,null,null,null,null,"Describe brevemente como se implementó el PEAI"]
[null,null,null,null,null,null,null,null,null,null,null,null,null,null,null,null,null,null,null,null,null,null,null,null,null,null,"La I.E. implementó el PEAI con actividades pedagógicas articulando competencias de las áreas curriculares.",null,null,null,"La I.E. implementó actividades institucionales para la ejecución del PEAI a lo largo de todo el año escolar.",null,null,null,"El PEAI se implementó con apoyo de instituciones del sector público y/o privado.",null,null,null,"Las actividades del PEAI involucran la participación de los padres de familia y la comunidad local."]
[]
[]
[null,null,1,null,"Espacio de Vida – EsVi ",null,null,null,null,null,null,null,null,null,null,null,null,null,null,null,null,null,null,null,null,null,null,null,null,null,null,null,null,null,null,null,null,null,null,null,null,null,null,null,null,null,null,null,{"$f":"IF(AQ20=\"\",\"\",IF(COUNTIF(#REF!,\"\")=0,\"a\",\"\"))","v":""}]
[]
[]
[null,null,2,null,"Manejo de Residuos Sólidos – MARES ",null,null,null,null,null,null,null,null,null,null,null,null,null,null,null,null,null,null,null,null,null,null,null,null,null,null,null,null,null,null,null,null,null,null,null,null,null,null,null,null,null,null,null,{"$f":"IF(AQ23=\"\",\"\",IF(COUNTIF(#REF!,\"\")=0,\"a\",\"\"))","v":""}]
[]
[]
[null,null,3,null,"Vida y Verde – VIVE ",null,null,null,null,null,null,null,null,null,null,null,null,null,null,null,null,null,null,null,null,null,null,null,null,null,null,null,null,null,null,null,null,null,null,null,null,null,null,null,null,null,null,null,{"$f":"IF(AQ26=\"\",\"\",IF(COUNTIF(#REF!,\"\")=0,\"a\",\"\"))","v":""}]
[]
[]
[null,null,4,null,"GLOBE Perú ",null,null,null,null,null,null,null,null,null,null,null,null,null,null,null,null,null,null,null,null,null,null,null,null,null,null,null,null,null,null,null,null,null,null,null,null,null,null,null,null,null,null,null,{"$f":"IF(AQ29=\"\",\"\",IF(COUNTIF(#REF!,\"\")=0,\"a\",\"\"))","v":""}]
[]
[]
[null,null,5,null,"Mi Huella – Mido y reduzco mi huella de carbono ",null,null,null,null,null,null,null,null,null,null,null,null,null,null,null,null,null,null,null,null,null,null,null,null,null,null,null,null,null,null,null,null,null,null,null,null,null,null,null,null,null,null,null,{"$f":"IF(AQ32=\"\",\"\",IF(COUNTIF(#REF!,\"\")=0,\"a\",\"\"))","v":""}]
[]
[]
[null,null,6,null,"Otros proyectos:",null,null,null,null,null,null,null,null,null,null,null,null,null,null,null,null,null,null,null,null,null,null,null,null,null,null,null,null,null,null,null,null,null,null,null,null,null,null,null,null,null,null,null,{"$f":"IF(AQ35=\"\",\"\",IF(COUNTIF(#REF!,\"\")=0,\"a\",\"\"))","v":""}]
[]
[]
[null,null,7,null,"Otros proyectos:",null,null,null,null,null,null,null,null,null,null,null,null,null,null,null,null,null,null,null,null,null,null,null,null,null,null,null,null,null,null,null,null,null,null,null,null,null,null,null,null,null,null,null,{"$f":"IF(AQ38=\"\",\"\",IF(COUNTIF(#REF!,\"\")=0,\"a\",\"\"))","v":""}]
[]
[]
[null,null,8,null,"Otros proyectos:",null,null,null,null,null,null,null,null,null,null,null,null,null,null,null,null,null,null,null,null,null,null,null,null,null,null,null,null,null,null,null,null,null,null,null,null,null,null,null,null,null,null,null,{"$f":"IF(AQ41=\"\",\"\",IF(COUNTIF(#REF!,\"\")=0,\"a\",\"\"))","v":""}]
[]
[]
[null,null,null,null,"Medios de verificación",null,null,null,null,null,null,null,null,null,null,null,null,null,null,null,null,null,null,null,null,null,"PAT",null,null,null,"PCI / Unidades / Sesiones / evidencias en la producción de los estudiantes\nPAT",null,null,null,"PAT\nCartas, Oficios, Memo u otros documentos.",null,null,null,"PAT\nDocumentos administrativos: Cartas, Oficios, Memo \nLista de Asistencia\nFotografías"]
[]
[null,null,"CONTAR.SI(C20:C37,VERDADERO)>0"]
[]
[null,null,null,null,"Todos los datos deben ser llenados y selecionados correctamente."]
[]
[]
[]
[null,null,"%",null,"&",null,"N",null,"O",null,"Y",null,"b",null,"h",null,"Š",null,"\u008f",null,"§",null,"¨",null,"þ",null,"H",null,"J",null,"M",null,"P",null,"Q",null,"z",null,"~",null,"á",null,"%",null,"&",null,"N",null,"O"]
[]
[]
[null,{"$f":"IF(VALUE(INFO(\"VERSION\"))<14,\"Probablemente la herramienta no pueda operar correctamente por ser una versión muy antigua de MS-Excel, comuníquese con Gestión de la Información!\",IF(ISERROR(CONCATENATE(\"Versión del Sistema Operativo: \",INFO(\"VERSIONSO\"),\",     Versión de MS-Excel: \",INFO(\"VERSION\"))),\"Probablemente la herramienta no pueda operar correctamente, comuníquese con Gestión de la Información!\",CONCATENATE(\"Versión del Sistema Operativo: \",INFO(\"VERSIONSO\"),\",     Versión de MS-Excel: \",INFO(\"VERSION\"))))","v":{"$error":"#VALUE!"}},null,null,null,null,null,null,null,null,null,null,null,null,null,null,null,null,null,null,null,null,null,null,null,null,null,null,null,null,null,null,null,null,null,null,null,null,null,null,null,null,null,null,null,null,null,null,null,null,{"$f":"IF(ING!$AY$43=\"\",\"\",ING!$AY$43)","v":{"$error":"#VALUE!"}}]

{"sheet":"CONFIRM","index":10,"n_rows":137,"n_cols":127,"rows_kept":137,"cut":false,"hidden":true,"merged":[[74,32,74,34],[77,32,77,34],[78,32,78,34],[80,32,80,34],[134,32,134,34],[125,32,125,34],[126,32,126,34],[127,32,127,34],[128,2,128,31],[129,32,129,34],[130,32,130,34],[131,32,131,34],[132,32,132,34],[133,32,133,34],[132,2,132,31],[133,2,133,31],[131,2,131,31],[125,2,125,31],[126,2,126,31],[127,2,127,31],[129,2,129,31],[130,2,130,31],[111,32,111,34],[120,32,120,34],[121,32,121,34],[113,32,113,34],[114,32,114,34],[115,32,115,34],[116,32,116,34],[115,2,115,31],[116,2,116,31],[117,2,117,31],[118,2,118,31],[119,2,119,31],[120,2,120,31],[121,2,121,31],[98,2,98,31],[99,2,99,31],[100,2,100,31],[101,2,101,31],[102,2,102,31],[103,2,103,31],[104,2,104,31],[105,2,105,31],[124,32,124,34],[122,2,122,31],[123,2,123,31],[124,2,124,31],[106,2,106,31],[107,2,107,31],[108,2,108,31],[109,2,109,31],[110,2,110,31],[111,2,111,31],[112,2,112,31],[113,2,113,31],[114,2,114,31],[110,32,110,34],[118,32,118,34],[119,32,119,34],[70,2,70,31],[71,2,71,31],[72,2,72,31],[73,2,73,31],[74,2,74,31],[75,2,75,31],[76,2,76,31],[77,2,77,31],[78,2,78,31],[65,32,65,34],[67,32,67,34],[68,32,68,34],[71,32,71,34],[72,32,72,34],[73,32,73,34],[109,32,109,34],[97,32,97,34],[98,32,98,34],[103,32,103,34],[88,32,88,34],[90,32,90,34],[91,32,91,34],[93,32,93,34],[94,32,94,34],[69,32,69,34],[79,32,79,34],[84,32,84,34],[85,32,85,34],[89,32,89,34],[99,32,99,34],[100,32,100,34],[95,32,95,34],[106,32,106,34],[104,32,104,34],[105,32,105,34],[108,32,108,34],[94,2,94,31],[83,32,83,34],[86,32,86,34],[79,2,79,31],[80,2,80,31],[81,2,81,31],[82,2,82,31],[83,2,83,31],[84,2,84,31],[85,2,85,31],[86,2,86,31],[87,2,87,31],[88,2,88,31],[89,2,89,31],[90,2,90,31],[91,2,91,31],[92,2,92,31],[93,2,93,31],[95,2,95,31],[96,2,96,31],[97,2,97,31],[61,2,61,31],[62,2,62,31],[63,2,63,31],[64,2,64,31],[62,32,62,34],[63,32,63,34],[64,32,64,34],[54,21,54,34],[55,21,55,34],[68,2,68,31],[69,2,69,31],[28,32,28,34],[43,29,43,34],[43,19,43,28],[33,2,33,14],[33,15,33,17],[33,19,33,31],[33,32,33,34],[35,2,36,17],[35,19,36,34],[37,2,37,14],[37,15,37,17],[37,19,37,31],[37,32,37,34],[38,2,38,14],[38,15,38,17],[38,19,38,31],[38,32,38,34],[41,2,42,34],[43,2,43,14],[54,4,54,17],[55,4,55,17],[60,2,60,31],[6,2,7,34],[9,18,9,34],[14,8,14,34],[15,8,15,34],[16,8,16,34],[27,15,27,17],[30,2,31,17],[30,19,31,34],[32,2,32,14],[32,15,32,17],[32,19,32,31],[32,32,32,34],[19,8,19,34],[17,8,17,34],[20,8,20,34],[18,8,18,34],[25,2,26,17],[25,19,26,34],[28,15,28,17],[27,2,27,14],[28,2,28,14],[27,19,27,31],[27,32,27,34],[28,19,28,31],[136,32,136,34],[135,32,135,34],[134,2,134,7],[134,8,134,31],[135,2,135,7],[135,8,135,31],[136,2,136,7],[136,8,136,31],[43,15,43,17],[48,4,48,17],[49,4,49,17],[50,4,50,17],[51,4,51,17],[52,4,52,17],[53,4,53,17],[48,21,48,34],[49,21,49,34],[50,21,50,34],[51,21,51,34],[52,21,52,34],[53,21,53,34],[65,2,65,31],[66,2,66,31],[67,2,67,31]]}
[]
[null,null,null,null,null,null,null,null,null,null,null,null,null,null,null,null,null,null,null,null,null,null,null,null,null,null,null,null,null,null,null,null,null,null,null,null,null,null,null,null,null,null,null,null,null,null,null,null,null,null,null,null,null,null,null,null,null,null,null,null,null,null,null,null,null,null,null,null,null,null,null,null,null,null,null,null,null,null,null,null,null,null,null,null,null,null,null,null,null,null,null,null,null,null,null,null,null,null,null,null,null,null,null,null,null,null,null,null,null,null,null,null,null,null,null,null,null,null,null,null,null,null,null,null,null,null,{"$f":"CONFIRM!P29","v":0}]
[]
[]
[]
[]
[null,null,"CONFIRMACIÓN DE ENVÍO DE DATOS"]
[]
[]
[null,null,"FECHA/HORA DE CONFIRMACIÓN DE ENVÍO:",null,null,null,null,null,null,null,null,null,null,null,null,null,null,null,{"$f":"ENVIO!F3","v":"2017-11-08T15:39:14.317"}]
[]
[]
[null,null,"DATOS DE LA INSTITUCIÓN EDUCATIVA:"]
[]
[null,null,"Nombre de II.EE.:",null,null,null,null,null,{"$f":"ING!K29","v":""}]
[null,null,"Código modular:",null,null,null,null,null,{"$f":"LEFT(ING!D29,7)","v":""}]
[null,null,"Nivel educativo:",null,null,null,null,null,{"$f":"ING!AN14","v":"PRIMARIA"}]
[null,null,"Modalidad:",null,null,null,null,null,{"$f":"ING!AN11","v":"PÚBLICA"}]
[null,null,"Dirección de II.EE.:",null,null,null,null,null,{"$f":"IF(ING!D31=\"\",\"\",ING!D31)","v":""}]
[null,null,"Dependencia:",null,null,null,null,null,{"$f":"ING!AN11","v":"PÚBLICA"}]
[null,null,"DRE/UGEL:",null,null,null,null,null,{"$f":"ING!D21","v":"CAJAMARCA"}]
[]
[]
[null,null,"DEL RECOJO DE LA INFORMACIÓN (Carga de datos):"]
[]
[null,null,"Gestión Escolar",null,null,null,null,null,null,null,null,null,null,null,null,null,null,null,null,"Cambio Climático"]
[]
[null,null,"Respuestas afirmativas:",null,null,null,null,null,null,null,null,null,null,null,null,{"$f":"COUNTIF(ENVIO!AD13:AN13,TRUE)","v":0},null,null,null,"Respuestas afirmativas:",null,null,null,null,null,null,null,null,null,null,null,null,{"$f":"COUNTIF(ENVIO!AO13:AR13,TRUE)","v":0}]
[null,null,"Porcentaje:",null,null,null,null,null,null,null,null,null,null,null,null,{"$f":"P28/11","v":0},null,null,null,"Porcentaje:",null,null,null,null,null,null,null,null,null,null,null,null,{"$f":"AG28/4","v":0}]
[]
[null,null,"Ecoeficiencia",null,null,null,null,null,null,null,null,null,null,null,null,null,null,null,null,"Salud"]
[]
[null,null,"Respuestas afirmativas:",null,null,null,null,null,null,null,null,null,null,null,null,{"$f":"COUNTIF(ENVIO!AS13:BG13,TRUE)","v":0},null,null,null,"Respuestas afirmativas:",null,null,null,null,null,null,null,null,null,null,null,null,{"$f":"COUNTIF(ENVIO!BH13:BW13,TRUE)","v":0}]
[null,null,"Porcentaje:",null,null,null,null,null,null,null,null,null,null,null,null,{"$f":"P33/15","v":0},null,null,null,"Porcentaje:",null,null,null,null,null,null,null,null,null,null,null,null,{"$f":"AG33/16","v":0}]
[]
[null,null,"Gestión del Riesgo de Desastres",null,null,null,null,null,null,null,null,null,null,null,null,null,null,null,null,"PEAI"]
[]
[null,null,"Respuestas afirmativas:",null,null,null,null,null,null,null,null,null,null,null,null,{"$f":"COUNTIF(ENVIO!BX13:CA13,TRUE)","v":0},null,null,null,"Respuestas afirmativas:",null,null,null,null,null,null,null,null,null,null,null,null,{"$f":"IF('MOD6'!W20=\"SI\",COUNTIF('MOD6'!AA20:AP22,\"SI\"),0)+IF('MOD6'!W23=\"SI\",COUNTIF('MOD6'!AA23:AP25,\"SI\"),0)+IF('MOD6'!W26=\"SI\",COUNTIF('MOD6'!AA26:AP28,\"SI\"),0)+IF('MOD6'!W29=\"SI\",COUNTIF('MOD6'!AA29:AP31,\"SI\"),0)+IF('MOD6'!W32=\"SI\",COUNTIF('MOD6'!AA32:AP34,\"SI\"),0)+IF('MOD6'!W35=\"SI\",COUNTIF('MOD6'!AA35:AP37,\"SI\"),0)+IF('MOD6'!W38=\"SI\",COUNTIF('MOD6'!AA38:AP40,\"SI\"),0)+IF('MOD6'!W41=\"SI\",COUNTIF('MOD6'!AA41:AP43,\"SI\"),0)","v":0}]
[null,null,"Porcentaje:",null,null,null,null,null,null,null,null,null,null,null,null,{"$f":"P38/4","v":0},null,null,null,"Porcentaje:",null,null,null,null,null,null,null,null,null,null,null,null,{"$f":"IFERROR(AG38/(COUNTIF('MOD6'!W20:Z43,\"SI\")*4),0)","v":0}]
[]
[]
[null,null,"VALOR FINAL (Carga de Datos)"]
[]
[null,null,"Porcentaje en base a respuestas:",null,null,null,null,null,null,null,null,null,null,null,null,{"$f":"(P28+AG28+P33+AG33+P38+IFERROR(AG38/COUNTIF('MOD6'!W20:Z43,\"SI\"),0))/54","v":0},null,null,null,"Nivel de Logro",null,null,null,null,null,null,null,null,null,{"$f":"IF($P$44>0.75,\"Destacado\",IF($P$44>0.5,\"Previsto\",IF($P$44>0.25,\"En proceso\",IF($P$44>0,\"En inicio\",\"Por iniciar\"))))","v":"Por iniciar"}]
[]
[]
[null,null,"DOCUMENTOS A ADJUNTAR EN EL EXPEDIENTE, INDICANDO CÓDIGO MODULAR Y NOMBRE DE LA IIEE."]
[]
[null,null,1,"-",{"$f":"IFERROR(VLOOKUP(C49,LISTAS!$U$60:$V$75,2,FALSE),\"\")","v":""},null,null,null,null,null,null,null,null,null,null,null,null,null,null,9,"-",{"$f":"IFERROR(VLOOKUP(T49,LISTAS!$U$60:$V$75,2,FALSE),\"\")","v":""}]
[null,null,2,"-",{"$f":"IFERROR(VLOOKUP(C50,LISTAS!$U$60:$V$75,2,FALSE),\"\")","v":""},null,null,null,null,null,null,null,null,null,null,null,null,null,null,10,"-",{"$f":"IFERROR(VLOOKUP(T50,LISTAS!$U$60:$V$75,2,FALSE),\"\")","v":""}]
[null,null,3,"-",{"$f":"IFERROR(VLOOKUP(C51,LISTAS!$U$60:$V$75,2,FALSE),\"\")","v":""},null,null,null,null,null,null,null,null,null,null,null,null,null,null,11,"-",{"$f":"IFERROR(VLOOKUP(T51,LISTAS!$U$60:$V$75,2,FALSE),\"\")","v":""}]
[null,null,4,"-",{"$f":"IFERROR(VLOOKUP(C52,LISTAS!$U$60:$V$75,2,FALSE),\"\")","v":""},null,null,null,null,null,null,null,null,null,null,null,null,null,null,12,"-",{"$f":"IFERROR(VLOOKUP(T52,LISTAS!$U$60:$V$75,2,FALSE),\"\")","v":""}]
[null,null,5,"-",{"$f":"IFERROR(VLOOKUP(C53,LISTAS!$U$60:$V$75,2,FALSE),\"\")","v":""},null,null,null,null,null,null,null,null,null,null,null,null,null,null,13,"-",{"$f":"IFERROR(VLOOKUP(T53,LISTAS!$U$60:$V$75,2,FALSE),\"\")","v":""}]
[null,null,6,"-",{"$f":"IFERROR(VLOOKUP(C54,LISTAS!$U$60:$V$75,2,FALSE),\"\")","v":""},null,null,null,null,null,null,null,null,null,null,null,null,null,null,14,"-",{"$f":"IFERROR(VLOOKUP(T54,LISTAS!$U$60:$V$75,2,FALSE),\"\")","v":""}]
[null,null,7,"-",{"$f":"IFERROR(VLOOKUP(C55,LISTAS!$U$60:$V$75,2,FALSE),\"\")","v":""},null,null,null,null,null,null,null,null,null,null,null,null,null,null,15,"-",{"$f":"IFERROR(VLOOKUP(T55,LISTAS!$U$60:$V$75,2,FALSE),\"\")","v":""}]
[null,null,8,"-",{"$f":"IFERROR(VLOOKUP(C56,LISTAS!$U$60:$V$75,2,FALSE),\"\")","v":""},null,null,null,null,null,null,null,null,null,null,null,null,null,null,16,"-",{"$f":"IFERROR(VLOOKUP(T56,LISTAS!$U$60:$V$75,2,FALSE),\"\")","v":""}]
[]
[]
[]
[]
[null,null,"Componentes de Gestión Escolar: Gestión Institucional y Gestión Pedagógica"]
[null,null,"1.    La I.E. cuenta con un Comité Ambiental reconocido e institucionalizado."]
[null,null,"La Comisión Ambiental y de Gestión de Riesgos fue constituida y reconocida mediante resolución directoral.",null,null,null,null,null,null,null,null,null,null,null,null,null,null,null,null,null,null,null,null,null,null,null,null,null,null,null,null,null,{"$f":"IF('MOD1'!I$20=\"\",\"\",'MOD1'!I$20)","v":""}]
[null,null,"Las actividades de la Comisión están incluidas en el Plan Anual de Trabajo",null,null,null,null,null,null,null,null,null,null,null,null,null,null,null,null,null,null,null,null,null,null,null,null,null,null,null,null,null,{"$f":"IF('MOD1'!O$20=\"\",\"\",'MOD1'!O$20)","v":""}]
[null,null,"La Comisión Ambiental y de Gestión de Riesgos ha recibido capacitación sobre temas relacionados a cambio climático considerando su efecto en las poblaciones vulnerables y de género",null,null,null,null,null,null,null,null,null,null,null,null,null,null,null,null,null,null,null,null,null,null,null,null,null,null,null,null,null,{"$f":"IF('MOD1'!U$20=\"\",\"\",'MOD1'!U$20)","v":""}]
[null,null,"La Comisión Ambiental y de Gestión de Riesgos está conformado al menos por un (01) representante de la comunidad local (de instituciones privadas, públicas, organizaciones sociales, líderes y otros).",null,null,null,null,null,null,null,null,null,null,null,null,null,null,null,null,null,null,null,null,null,null,null,null,null,null,null,null,null,{"$f":"IF('MOD1'!AA$20=\"\",\"\",'MOD1'!AA$20)","v":""}]
[null,null,"2.    La I.E. actualizó y/o elaboró sus herramientas de gestión escolar con enfoque ambiental"]
[null,null,"La I.E. incluyó el enfoque ambiental en el diagnóstico, visión, objetivos y/o metas del Proyecto Educativo Institucional.",null,null,null,null,null,null,null,null,null,null,null,null,null,null,null,null,null,null,null,null,null,null,null,null,null,null,null,null,null,{"$f":"IF('MOD1'!I$36=\"\",\"\",'MOD1'!I$36)","v":""}]
[null,null,"El Plan de Gestión del Riesgo de Desastres y Planes de Contingencia están incluidos en el PAT.",null,null,null,null,null,null,null,null,null,null,null,null,null,null,null,null,null,null,null,null,null,null,null,null,null,null,null,null,null,{"$f":"IF('MOD1'!Q$36=\"\",\"\",'MOD1'!Q$36)","v":""}]
[null,null,"La I.E. estableció en su Reglamento Interno las responsabilidades y funciones específicas para la Comisión Ambiental y de Gestión de Riesgos.",null,null,null,null,null,null,null,null,null,null,null,null,null,null,null,null,null,null,null,null,null,null,null,null,null,null,null,null,null,{"$f":"IF('MOD1'!Y$36=\"\",\"\",'MOD1'!Y$36)","v":""}]
[null,null,"3.    La I.E. incluyó en el PCI el enfoque ambiental y empleó recursos pedagógicos ambientales propios de la localidad."]
[null,null,"El PCI de la I.E. visibiliza la tranversavilidad del enfoque ambiental",null,null,null,null,null,null,null,null,null,null,null,null,null,null,null,null,null,null,null,null,null,null,null,null,null,null,null,null,null,{"$f":"IF('MOD1'!I$52=\"\",\"\",'MOD1'!I$52)","v":""}]
[null,null,"La I.E. transversalizó el enfoque ambiental en la programación curricular anual y unidades didácticas ",null,null,null,null,null,null,null,null,null,null,null,null,null,null,null,null,null,null,null,null,null,null,null,null,null,null,null,null,null,{"$f":"IF('MOD1'!O$52=\"\",\"\",'MOD1'!O$52)","v":""}]
[null,null,"La I.E. incluyó en las sesiones de aprendizaje las actividades del calendario ambiental nacional, local y/o comunal, así como los saberes y conocimientos ambientales locales.",null,null,null,null,null,null,null,null,null,null,null,null,null,null,null,null,null,null,null,null,null,null,null,null,null,null,null,null,null,{"$f":"IF('MOD1'!U$52=\"\",\"\",'MOD1'!U$52)","v":""}]
[null,null,"La I.E. incluyó en las sesiones de aprendizaje visitas pedagógicas a espacios naturales y culturales (áreas naturales protegidas, rutas de ecoturismo, proyectos de conservación, bosques comunitarios, playas locales, etc.)",null,null,null,null,null,null,null,null,null,null,null,null,null,null,null,null,null,null,null,null,null,null,null,null,null,null,null,null,null,{"$f":"IF('MOD1'!AA$52=\"\",\"\",'MOD1'!AA$52)","v":""}]
[null,null,"Componente de Cambio Climático"]
[null,null,"4.    La I.E. realizó actividades de mitigación y adaptación frente al Cambio climático."]
[null,null,"La I.E. crea, recupera y/o aprovecha áreas verdes y/o espacios naturales dentro de la I.E. como recurso pedagógico como acciones de mitigación frente al cambio climático. ",null,null,null,null,null,null,null,null,null,null,null,null,null,null,null,null,null,null,null,null,null,null,null,null,null,null,null,null,null,{"$f":"IF('MOD2'!I$20=\"\",\"\",'MOD2'!I$20)","v":""}]
[null,null,"La I.E. implementó actividades pedagógicas sobre la importancia y conservación de la diversidad biológica (flora y fauna, terrestre y acuática) y de los servicios ecosistémicos (lo servicios que el ambiente nos brinda), como aciones frente al cambio climático, para afianzar aprendizajes, valores y actitudes.",null,null,null,null,null,null,null,null,null,null,null,null,null,null,null,null,null,null,null,null,null,null,null,null,null,null,null,null,null,{"$f":"IF('MOD2'!O$20=\"\",\"\",'MOD2'!O$20)","v":""}]
[null,null,"La I.E. implementó actividades pedagógicas de promoción de la producción y consumo responsables (valoración de prácticas compatibles con el cuidado del ambiente y los recursos naturales), como aciones de adaptación frente al cambio climático, para afianzar aprendizajes, valores y actitudes.",null,null,null,null,null,null,null,null,null,null,null,null,null,null,null,null,null,null,null,null,null,null,null,null,null,null,null,null,null,{"$f":"IF('MOD2'!U$20=\"\",\"\",'MOD2'!U$20)","v":""}]
[null,null,"La I.E. implementó actividades a favor de la recuperación y/o mantenimiento de espacios públicos y áreas verdes aledañas a la I.E. y en la comunidad local (jornadas de limpieza, el abono y/o sembrado de árboles, otras actividades), como acciones de mitigación frente al cambio climático. ",null,null,null,null,null,null,null,null,null,null,null,null,null,null,null,null,null,null,null,null,null,null,null,null,null,null,null,null,null,{"$f":"IF('MOD2'!AA$20=\"\",\"\",'MOD2'!AA$20)","v":""}]
[null,null,"Componente de Ecoeficiencia"]
[null,null,"5.    La I.E. realizó actividades de manejo de residuos sólidos. "]
[null,null,"La I.E. cuenta con un Plan de manejo adecuado de los residuos sólidos, y actividades de las \"3R\" (Reducir, Reusar y Reciclar) incluidos en el PAT.",null,null,null,null,null,null,null,null,null,null,null,null,null,null,null,null,null,null,null,null,null,null,null,null,null,null,null,null,null,{"$f":"IF('MOD3'!I$20=\"\",\"\",'MOD3'!I$20)","v":""}]
[null,null,"La I.E. implementó actividades pedagógicas  sobre el manejo adecuado de los residuos sólidos y la aplicación de las “3R”: Reducir, Reusar y Reciclar, para afianzar aprendizajes, valores y actitudes.",null,null,null,null,null,null,null,null,null,null,null,null,null,null,null,null,null,null,null,null,null,null,null,null,null,null,null,null,null,{"$f":"IF('MOD3'!O$20=\"\",\"\",'MOD3'!O$20)","v":""}]
[null,null,"La I.E. coordinó con el gobierno local u otras instituciones aliadas la recolección y transporte de los residuos para la disposición final de los residuos sólidos de la I.E.",null,null,null,null,null,null,null,null,null,null,null,null,null,null,null,null,null,null,null,null,null,null,null,null,null,null,null,null,null,{"$f":"IF('MOD3'!U$20=\"\",\"\",'MOD3'!U$20)","v":""}]
[null,null,"La I.E. sensibilizó  a los padres y madres de familia  y/o comunidad local  sobre el manejo adecuado de los residuos sólidos y en actividades de las 3R: Reducir, Reusar y Reciclar.",null,null,null,null,null,null,null,null,null,null,null,null,null,null,null,null,null,null,null,null,null,null,null,null,null,null,null,null,null,{"$f":"IF('MOD3'!AA$20=\"\",\"\",'MOD3'!AA$20)","v":""}]
[null,null,"6.    La I.E. practicó el uso ecoeficiente de la energía."]
[null,null,"La I.E. implementó medidas institucionales de ecoeficiencia para el ahorro y buen uso de la energía (uso de focos ahorradores, entre otros) incluidas en el PAT. ",null,null,null,null,null,null,null,null,null,null,null,null,null,null,null,null,null,null,null,null,null,null,null,null,null,null,null,null,null,{"$f":"IF('MOD3'!I$36=\"\",\"\",'MOD3'!I$36)","v":""}]
[null,null,"La I.E. implementó actividades pedagógicas  sobre el consumo responsable y el manejo adecuado de la energía para afianzar aprendizajes, valores y actitudes.",null,null,null,null,null,null,null,null,null,null,null,null,null,null,null,null,null,null,null,null,null,null,null,null,null,null,null,null,null,{"$f":"IF('MOD3'!O$36=\"\",\"\",'MOD3'!O$36)","v":""}]
[null,null,"La I.E.  implementó actividades pedagógicas sobre la importancia del uso de medios de transporte menos nocivos para el ambiente (por ejemplo, transporte público, bicicletas, caminatas, etc.) para afianzar aprendizajes, valores y actitudes.",null,null,null,null,null,null,null,null,null,null,null,null,null,null,null,null,null,null,null,null,null,null,null,null,null,null,null,null,null,{"$f":"IF('MOD3'!U$36=\"\",\"\",'MOD3'!U$36)","v":""}]
[null,null,"La I.E. sensibilizó a los padres y madres de familia  y/o comunidad local sobre el uso ecoeficiente de la energía y el uso de medios de transporte públicos y alternativos (bicicletas, caminatas, etc.)",null,null,null,null,null,null,null,null,null,null,null,null,null,null,null,null,null,null,null,null,null,null,null,null,null,null,null,null,null,{"$f":"IF('MOD3'!AA$36=\"\",\"\",'MOD3'!AA$36)","v":""}]
[null,null,"7.    La I.E. practicó el empleo de energía renovable."]
[null,null,"La I.E. ha implementado medidas institucionales sobre el empleo de energía renovable incluidas en el PAT. ",null,null,null,null,null,null,null,null,null,null,null,null,null,null,null,null,null,null,null,null,null,null,null,null,null,null,null,null,null,{"$f":"IF('MOD3'!I$52=\"\",\"\",'MOD3'!I$52)","v":""}]
[null,null,"La I.E. implementó actividades pedagógicas  sobre el uso de energía renovable, de acuerdo a su contexto para afianzar aprendizajes, valores y actitudes. ",null,null,null,null,null,null,null,null,null,null,null,null,null,null,null,null,null,null,null,null,null,null,null,null,null,null,null,null,null,{"$f":"IF('MOD3'!Q$52=\"\",\"\",'MOD3'!Q$52)","v":""}]
[null,null,"La I.E. sensibilizó a los padres y madres de familia  y/o comunidad local para el empleo de energía renovable.",null,null,null,null,null,null,null,null,null,null,null,null,null,null,null,null,null,null,null,null,null,null,null,null,null,null,null,null,null,{"$f":"IF('MOD3'!Y$52=\"\",\"\",'MOD3'!Y$52)","v":""}]
[null,null,"8.    La I.E. practicó la gestión integral y uso eficiente de los recursos hídricos."]
[null,null,"La I.E. implementó medidas institucionales de ecoeficiencia para el ahorro y buen uso del agua, incluidas en el PAT.",null,null,null,null,null,null,null,null,null,null,null,null,null,null,null,null,null,null,null,null,null,null,null,null,null,null,null,null,null,{"$f":"IF('MOD3'!I$68=\"\",\"\",'MOD3'!I$68)","v":""}]
[null,null,"La I.E. implementó actividades pedagógicas  sobre el consumo y manejo responsable  de los recursos hídricos para afianzar aprendizajes, valores y actitudes.",null,null,null,null,null,null,null,null,null,null,null,null,null,null,null,null,null,null,null,null,null,null,null,null,null,null,null,null,null,{"$f":"IF('MOD3'!O$68=\"\",\"\",'MOD3'!O$68)","v":""}]
[null,null,"La I.E. implementó  actividades pedagógicas sobre cultura del agua (por ejemplo la conservación del agua y  cuencas hidrográficas, agua segura, practicas ancestrales de siembra y cosecha del agua, entre otros), para afianzar aprendizajes, valores y actitudes.",null,null,null,null,null,null,null,null,null,null,null,null,null,null,null,null,null,null,null,null,null,null,null,null,null,null,null,null,null,{"$f":"IF('MOD3'!U$68=\"\",\"\",'MOD3'!U$68)","v":""}]
[null,null,"La I.E.  sensibilizó a los padres y madres de familia  y/o comunidad local para promover la gestión integral de recursos hídricos y una nueva cultura del agua.",null,null,null,null,null,null,null,null,null,null,null,null,null,null,null,null,null,null,null,null,null,null,null,null,null,null,null,null,null,{"$f":"IF('MOD3'!AA$68=\"\",\"\",'MOD3'!AA$68)","v":""}]
[null,null,"Componente de Salud"]
[null,null,"9. La I.E. implementó acciones sobre alimentación saludable y sostenible."]
[null,null,"La I.E. cuenta con una planificación de actividades, así como espacios educativos acondiconados, para garantizar la alimentación saludable y sostenible, incluidos en el PAT. ",null,null,null,null,null,null,null,null,null,null,null,null,null,null,null,null,null,null,null,null,null,null,null,null,null,null,null,null,null,{"$f":"IF('MOD4'!I$20=\"\",\"\",'MOD4'!I$20)","v":""}]
[null,null,"La I.E. implementó actividades pedagógicas para la revalorización y consumo de alimentos saludables de origen local para afianzar aprendizajes, valores y actitudes.",null,null,null,null,null,null,null,null,null,null,null,null,null,null,null,null,null,null,null,null,null,null,null,null,null,null,null,null,null,{"$f":"IF('MOD4'!O$20=\"\",\"\",'MOD4'!O$20)","v":""}]
[null,null,"La I.E. implementó y supervisó los centros de expendio de alimentos (como los quioscos, cafetines, cafeterías y/o comedores escolares), garantizando el acceso, la disponibilidad y el consumo de una alimentación saludable y sostenible, según la normativa vigente.",null,null,null,null,null,null,null,null,null,null,null,null,null,null,null,null,null,null,null,null,null,null,null,null,null,null,null,null,null,{"$f":"IF('MOD4'!U$20=\"\",\"\",'MOD4'!U$20)","v":""}]
[null,null,"La I.E. sensibilizó a las familias de la comunidad educativa sobre la importancia de una alimentación saludable  y sostenible (refrigerios y loncheras saludables), así como la revalorización y cconsumo de alimentos saludables de origen local.",null,null,null,null,null,null,null,null,null,null,null,null,null,null,null,null,null,null,null,null,null,null,null,null,null,null,null,null,null,{"$f":"IF('MOD4'!AA$20=\"\",\"\",'MOD4'!AA$20)","v":""}]
[null,null,"10. La I.E. implementó  acciones para la práctica de la higiene integral (lavado de manos, higiene bucal, aseo y cuidado personal). "]
[null,null,"La I.E. cuenta con espacios educativos acondicionados, para garantizar la puesta en práctica de hábitos de higiene integral, incluidos en el PAT.",null,null,null,null,null,null,null,null,null,null,null,null,null,null,null,null,null,null,null,null,null,null,null,null,null,null,null,null,null,{"$f":"IF('MOD4'!I$36=\"\",\"\",'MOD4'!I$36)","v":""}]
[null,null,"La I.E.  Implementó actividades pedagógicas sobre la importancia y la práctica diaria del lavado de manos (antes y después de las comidas,  después de realizar actividades físicas, después del uso de los baños) e higiene bucal, para afianzar aprendizajes, valores y actitudes.",null,null,null,null,null,null,null,null,null,null,null,null,null,null,null,null,null,null,null,null,null,null,null,null,null,null,null,null,null,{"$f":"IF('MOD4'!O$36=\"\",\"\",'MOD4'!O$36)","v":""}]
[null,null,"La I.E. implementó actividades pedagógicas sobre la importancia y la práctica diaria de aseo y del cuidado personal (baño cotidiano, control de la pediculosis, ropa limpia, etc.). ",null,null,null,null,null,null,null,null,null,null,null,null,null,null,null,null,null,null,null,null,null,null,null,null,null,null,null,null,null,{"$f":"IF('MOD4'!U$36=\"\",\"\",'MOD4'!U$36)","v":""}]
[null,null,"La I.E. sensibilizó  a los padres y madres de familia  y/o comunidad local  en la adopción de hábitos de higiene integral.",null,null,null,null,null,null,null,null,null,null,null,null,null,null,null,null,null,null,null,null,null,null,null,null,null,null,null,null,null,{"$f":"IF('MOD4'!AA$36=\"\",\"\",'MOD4'!AA$36)","v":""}]
[null,null,"11. La I.E. implementó actividades de mantenimiento, orden y limpieza de todos los ambientes como práctica cotidiana y para la prevención de enfermedades prevalentes."]
[null,null,"La I.E. implementó medidas de mantenimiento, orden, limpieza, ventilación e iluminación ,para  garantizar espacios educativos saludables, al interior y en el perímetro exterior de la I.E., incluidos en el PAT.",null,null,null,null,null,null,null,null,null,null,null,null,null,null,null,null,null,null,null,null,null,null,null,null,null,null,null,null,null,{"$f":"IF('MOD4'!I$52=\"\",\"\",'MOD4'!I$52)","v":""}]
[null,null,"La I.E. implementó actividades pedagógicas sobre la importancia y la práctica de la limpieza periódica, el orden, la ventilación e iluminación de espacios, como medidas de prevención de enfermedades prevalentes (EDAs, IRAs, Influenza, Dengue y otras de prevalencia local, TBC, entre otros), para afianzar aprendizajes, valores y actitudes.",null,null,null,null,null,null,null,null,null,null,null,null,null,null,null,null,null,null,null,null,null,null,null,null,null,null,null,null,null,{"$f":"IF('MOD4'!O$52=\"\",\"\",'MOD4'!O$52)","v":""}]
[null,null,"La I.E. programó y ejecutó, en coordinación con la UGEL u otros aliados, la desinfección y fumigación de las aulas, los servicios higiénicos, y otros espacios educativos de la I.E.",null,null,null,null,null,null,null,null,null,null,null,null,null,null,null,null,null,null,null,null,null,null,null,null,null,null,null,null,null,{"$f":"IF('MOD4'!U$52=\"\",\"\",'MOD4'!U$52)","v":""}]
[null,null,"La I.E. sensibilizó  a los padres y madres de familia  y/o comunidad local, y logra su participación en las actividades de conservación y limpieza de los espacios interiores y exteriores a la I.E como medidas preventivas de enfermedades prevalentes.",null,null,null,null,null,null,null,null,null,null,null,null,null,null,null,null,null,null,null,null,null,null,null,null,null,null,null,null,null,{"$f":"IF('MOD4'!AA$52=\"\",\"\",'MOD4'!AA$52)","v":""}]
[null,null,"12. La I.E. adoptó medidas de protección frente a los efectos nocivos por la exposición a la radiación ultravioleta"]
[null,null,"La I.E. implementó medidas de protección y prevención de los efectos nocivos de la radiación solar (promover el uso de elementos que brinden protección, la instalación de techos y/o toldos con mallas de tipo raschel en patios, jardines u otros espacios, etc.).",null,null,null,null,null,null,null,null,null,null,null,null,null,null,null,null,null,null,null,null,null,null,null,null,null,null,null,null,null,{"$f":"IF('MOD4'!I$68=\"\",\"\",'MOD4'!I$68)","v":""}]
[null,null,"La I.E. implementó actividades pedagógicas sobre la prevención de los efectos nocivos por la exposición prolongada a la radiación solar, para afianzar aprendizajes, valores y actitudes.",null,null,null,null,null,null,null,null,null,null,null,null,null,null,null,null,null,null,null,null,null,null,null,null,null,null,null,null,null,{"$f":"IF('MOD4'!O$68=\"\",\"\",'MOD4'!O$68)","v":""}]
[null,null,"La I.E implementó medidas para el desarrollo de actividades pedagógicas, deportivas y otras que se realicen al aire libre, procurando realizarlas según las indicaciones de la norma técnica vigente, para la prevención de los efectos nocivos por la exposición prolongada a la radiación solar. ",null,null,null,null,null,null,null,null,null,null,null,null,null,null,null,null,null,null,null,null,null,null,null,null,null,null,null,null,null,{"$f":"IF('MOD4'!U$68=\"\",\"\",'MOD4'!U$68)","v":""}]
[null,null,"La I.E. sensibilizó  a los padres y madres de familia  y/o comunidad local  sobre las medidas de protección a implementar durante todos el año frente a los efectos nocivos por la exposición prolongada a la radiación solar. ",null,null,null,null,null,null,null,null,null,null,null,null,null,null,null,null,null,null,null,null,null,null,null,null,null,null,null,null,null,{"$f":"IF('MOD4'!AA$68=\"\",\"\",'MOD4'!AA$68)","v":""}]
[null,null,"Componente de Gestión del Riesgo de Desastres"]
[null,null,"13. La IE adoptó medidas para la Gestión del Riesgo de Desastres."]
[null,null,"La I.E. implementó medidas para la preparación y respuesta frente a emergencias y desastres (señalética, croquis de señalización y evacuación interna, acondicionamiento del COE, otros.).",null,null,null,null,null,null,null,null,null,null,null,null,null,null,null,null,null,null,null,null,null,null,null,null,null,null,null,null,null,{"$f":"IF('MOD5'!I$20=\"\",\"\",'MOD5'!I$20)","v":""}]
[null,null,"La I.E. implementó actividades institucionales para simulacros (campañas comunicacionales, pasacalles, concurso de murales, etc.), para hacer frente a las emergencias y/o desastres, en atención al contexto local.",null,null,null,null,null,null,null,null,null,null,null,null,null,null,null,null,null,null,null,null,null,null,null,null,null,null,null,null,null,{"$f":"IF('MOD5'!O$20=\"\",\"\",'MOD5'!O$20)","v":""}]
[null,null,"La I.E. implementó actividades pedagógicas sobre la gestión del riesgo de desastres en el marco del enfoque ambiental y en atención al contexto local para afianzar aprendizajes, valores y actitudes.",null,null,null,null,null,null,null,null,null,null,null,null,null,null,null,null,null,null,null,null,null,null,null,null,null,null,null,null,null,{"$f":"IF('MOD5'!U$20=\"\",\"\",'MOD5'!U$20)","v":""}]
[null,null,"La I.E. sensibilizó a los estudiantes, y padres y madres de familia, sobre la prevención, reducción, preparación, respuesta y rehabilitación, para hacer frente a las emergencias y/o desastres, en atención al contexto local.",null,null,null,null,null,null,null,null,null,null,null,null,null,null,null,null,null,null,null,null,null,null,null,null,null,null,null,null,null,{"$f":"IF('MOD5'!AA$20=\"\",\"\",'MOD5'!AA$20)","v":""}]
[null,null,"Proyecto Educativo Ambiental Integrado (PEAI)"]
[null,null,"Espacio de Vida – EsVi ",null,null,null,null,null,null,null,null,null,null,null,null,null,null,null,null,null,null,null,null,null,null,null,null,null,null,null,null,null,{"$f":"IF('MOD6'!W20=\"\",\"\",'MOD6'!W20)","v":""}]
[null,null,"Manejo de Residuos Sólidos – MARES ",null,null,null,null,null,null,null,null,null,null,null,null,null,null,null,null,null,null,null,null,null,null,null,null,null,null,null,null,null,{"$f":"IF('MOD6'!W23=\"\",\"\",'MOD6'!W23)","v":""}]
[null,null,"Vida y Verde – VIVE ",null,null,null,null,null,null,null,null,null,null,null,null,null,null,null,null,null,null,null,null,null,null,null,null,null,null,null,null,null,{"$f":"IF('MOD6'!W26=\"\",\"\",'MOD6'!W26)","v":""}]
[null,null,"GLOBE Perú ",null,null,null,null,null,null,null,null,null,null,null,null,null,null,null,null,null,null,null,null,null,null,null,null,null,null,null,null,null,{"$f":"IF('MOD6'!W29=\"\",\"\",'MOD6'!W29)","v":""}]
[null,null,"Mi Huella – Mido y reduzco mi huella de carbono ",null,null,null,null,null,null,null,null,null,null,null,null,null,null,null,null,null,null,null,null,null,null,null,null,null,null,null,null,null,{"$f":"IF('MOD6'!W32=\"\",\"\",'MOD6'!W32)","v":""}]
[null,null,"Otros proyectos (1):",null,null,null,null,null,{"$f":"IF('MOD6'!K35=\"\",\"\",'MOD6'!K35)","v":""},null,null,null,null,null,null,null,null,null,null,null,null,null,null,null,null,null,null,null,null,null,null,null,{"$f":"IF('MOD6'!W35=\"\",\"\",'MOD6'!W35)","v":""}]
[null,null,"Otros proyectos (2):",null,null,null,null,null,{"$f":"IF('MOD6'!K38=\"\",\"\",'MOD6'!K38)","v":""},null,null,null,null,null,null,null,null,null,null,null,null,null,null,null,null,null,null,null,null,null,null,null,{"$f":"IF('MOD6'!W38=\"\",\"\",'MOD6'!W38)","v":""}]
[null,null,"Otros proyectos (3):",null,null,null,null,null,{"$f":"IF('MOD6'!K41=\"\",\"\",'MOD6'!K41)","v":""},null,null,null,null,null,null,null,null,null,null,null,null,null,null,null,null,null,null,null,null,null,null,null,{"$f":"IF('MOD6'!W41=\"\",\"\",'MOD6'!W41)","v":""}]

{"sheet":"LISTAS","index":11,"n_rows":1875,"n_cols":27,"rows_kept":1875,"cut":false,"hidden":true,"merged":[]}
[null,"DEPAR",null,0,"DEPARTAMENTO","PROVINCIA",null,{"$f":"J1&\" \"&K1&\" \"&L1","v":"DEPARTAMENTO PROVINCIA DISTRITO"},0,"DEPARTAMENTO","PROVINCIA","DISTRITO","ID_DISTRITO",null,0,"REGION","UNIDAD EJECUTORA","UGEL",null,0,"UGEL",null,0,"PROVI",null,0,"DISTR"]
[null,"AMAZONAS",null,{"$f":"IF(ING!$D$21=E2,D1+1,0)","v":0},"AMAZONAS","BAGUA",null,{"$f":"J2&\" \"&K2&\" \"&L2","v":"AMAZONAS BAGUA ARAMANGO"},{"$f":"IF(AND(ING!$D$21=J2,ING!$V$21=K2),I1+1,0)","v":0},"AMAZONAS","BAGUA","ARAMANGO","010202",null,{"$f":"IF($T$1=P2,O1+1,0)","v":0},"AMAZONAS","303. EDUCACION BAGUA CAPITAL","UGEL BAGUA",null,1,{"$f":"IFERROR(VLOOKUP(T2,O1:R222,4,FALSE),\"\")","v":""},null,1,{"$f":"IFERROR(VLOOKUP(W2,$D$1:$F$197,3,FALSE),\"\")","v":"CAJABAMBA"},null,1,{"$f":"IFERROR(VLOOKUP(Z2,$I:$M,4,FALSE),\"\")","v":"CHIRINOS"}]
[null,"ANCASH",null,{"$f":"IF(ING!$D$21=E3,D2+1,0)","v":0},"AMAZONAS","BONGARA",null,{"$f":"J3&\" \"&K3&\" \"&L3","v":"AMAZONAS BAGUA BAGUA"},{"$f":"IF(AND(ING!$D$21=J3,ING!$V$21=K3),I2+1,0)","v":0},"AMAZONAS","BAGUA","BAGUA","010201",null,{"$f":"IF($T$1=P3,O2+1,0)","v":0},"AMAZONAS","300. EDUCACION AMAZONAS","UGEL BONGARA",null,2,{"$f":"IFERROR(VLOOKUP(T3,O2:R223,4,FALSE),\"\")","v":""},null,2,{"$f":"IFERROR(VLOOKUP(W3,$D$1:$F$197,3,FALSE),\"\")","v":"CAJAMARCA"},null,2,{"$f":"IFERROR(VLOOKUP(Z3,$I:$M,4,FALSE),\"\")","v":"HUARANGO"}]
[null,"APURÍMAC",null,{"$f":"IF(ING!$D$21=E4,D3+1,0)","v":0},"AMAZONAS","CHACHAPOYAS",null,"AMAZONAS BAGUA COPALLIN",{"$f":"IF(AND(ING!$D$21=J4,ING!$V$21=K4),I3+1,0)","v":0},"AMAZONAS","BAGUA","COPALLIN","010203",null,0,"AMAZONAS","300. EDUCACION AMAZONAS","UGEL CHACHAPOYAS",null,3,"",null,3,"CELENDIN",null,3,"LA COIPA"]
[null,"AREQUIPA",null,{"$f":"IF(ING!$D$21=E5,D4+1,0)","v":0},"AMAZONAS","CONDORCANQUI",null,"AMAZONAS BAGUA EL PARCO",{"$f":"IF(AND(ING!$D$21=J5,ING!$V$21=K5),I4+1,0)","v":0},"AMAZONAS","BAGUA","EL PARCO","010204",null,0,"AMAZONAS","302. EDUCACION CONDORCANQUI","UGEL CONDORCANQUI",null,4,"",null,4,"CHOTA",null,4,"NAMBALLE"]
[null,"AYACUCHO",null,{"$f":"IF(ING!$D$21=E6,D5+1,0)","v":0},"AMAZONAS","LUYA",null,"AMAZONAS BAGUA IMAZA",{"$f":"IF(AND(ING!$D$21=J6,ING!$V$21=K6),I5+1,0)","v":0},"AMAZONAS","BAGUA","IMAZA","010205",null,0,"AMAZONAS","303. EDUCACION BAGUA CAPITAL","UGEL IBIR-IMAZA",null,5,"",null,5,"CONTUMAZA",null,5,"SAN IGNACIO"]
[null,"CAJAMARCA",null,{"$f":"IF(ING!$D$21=E7,D6+1,0)","v":0},"AMAZONAS","RODRIGUEZ DE MENDOZA",null,"AMAZONAS BAGUA LA PECA",{"$f":"IF(AND(ING!$D$21=J7,ING!$V$21=K7),I6+1,0)","v":0},"AMAZONAS","BAGUA","LA PECA","010206",null,0,"AMAZONAS","300. EDUCACION AMAZONAS","UGEL LUYA",null,6,"",null,6,"CUTERVO",null,6,"SAN JOSE DE LOURDES"]
[null,"CALLAO",null,{"$f":"IF(ING!$D$21=E8,D7+1,0)","v":0},"AMAZONAS","UTCUBAMBA",null,"AMAZONAS BONGARA CHISQUILLA",{"$f":"IF(AND(ING!$D$21=J8,ING!$V$21=K8),I7+1,0)","v":0},"AMAZONAS","BONGARA","CHISQUILLA","010302",null,0,"AMAZONAS","300. EDUCACION AMAZONAS","UGEL RODRIGUEZ DE MENDOZA",null,7,"",null,7,"HUALGAYOC",null,7,"TABACONAS"]
[null,"CUSCO",null,{"$f":"IF(ING!$D$21=E9,D8+1,0)","v":0},"ANCASH","AIJA",null,"AMAZONAS BONGARA CHURUJA",{"$f":"IF(AND(ING!$D$21=J9,ING!$V$21=K9),I8+1,0)","v":0},"AMAZONAS","BONGARA","CHURUJA","010303",null,0,"AMAZONAS","301. EDUCACION BAGUA","UGEL UTCUBAMBA",null,8,"",null,8,"JAEN",null,8,""]
[null,"HUANCAVELICA",null,{"$f":"IF(ING!$D$21=E10,D9+1,0)","v":0},"ANCASH","ANTONIO RAYMONDI",null,"AMAZONAS BONGARA COROSHA",{"$f":"IF(AND(ING!$D$21=J10,ING!$V$21=K10),I9+1,0)","v":0},"AMAZONAS","BONGARA","COROSHA","010304",null,0,"ANCASH","304. EDUCACION AIJA","UGEL AIJA",null,9,"",null,9,"SAN IGNACIO",null,9,""]
[null,"HUÁNUCO",null,{"$f":"IF(ING!$D$21=E11,D10+1,0)","v":0},"ANCASH","ASUNCION",null,"AMAZONAS BONGARA CUISPES",{"$f":"IF(AND(ING!$D$21=J11,ING!$V$21=K11),I10+1,0)","v":0},"AMAZONAS","BONGARA","CUISPES","010305",null,0,"ANCASH","312. EDUCACION ANTONIO RAIMONDI","UGEL ANTONIO RAYMONDI",null,10,"",null,10,"SAN MARCOS",null,10,""]
[null,"ICA",null,{"$f":"IF(ING!$D$21=E12,D11+1,0)","v":0},"ANCASH","BOLOGNESI",null,"AMAZONAS BONGARA FLORIDA",{"$f":"IF(AND(ING!$D$21=J12,ING!$V$21=K12),I11+1,0)","v":0},"AMAZONAS","BONGARA","FLORIDA","010306",null,0,"ANCASH","314. EDUCACION ASUNCION","UGEL ASUNCION",null,11,"",null,11,"SAN MIGUEL",null,11,""]
[null,"JUNÍN",null,{"$f":"IF(ING!$D$21=E13,D12+1,0)","v":0},"ANCASH","CARHUAZ",null,"AMAZONAS BONGARA JAZAN",{"$f":"IF(AND(ING!$D$21=J13,ING!$V$21=K13),I12+1,0)","v":0},"AMAZONAS","BONGARA","JAZAN","010307",null,0,"ANCASH","313. EDUCACION BOLOGNESI","UGEL BOLOGNESI",null,12,"",null,12,"SAN PABLO",null,12,""]
[null,"LA LIBERTAD",null,{"$f":"IF(ING!$D$21=E14,D13+1,0)","v":0},"ANCASH","CARLOS FERMIN FITZCARRALD",null,"AMAZONAS BONGARA JUMBILLA",{"$f":"IF(AND(ING!$D$21=J14,ING!$V$21=K14),I13+1,0)","v":0},"AMAZONAS","BONGARA","JUMBILLA","010301",null,0,"ANCASH","315. EDUCACION CARHUAZ","UGEL CARHUAZ",null,13,"",null,13,"SANTA CRUZ",null,13,""]
[null,"LAMBAYEQUE",null,{"$f":"IF(ING!$D$21=E15,D14+1,0)","v":0},"ANCASH","CASMA",null,"AMAZONAS BONGARA RECTA",{"$f":"IF(AND(ING!$D$21=J15,ING!$V$21=K15),I14+1,0)","v":0},"AMAZONAS","BONGARA","RECTA","010308",null,0,"ANCASH","307. EDUCACION CARLOS F. FITZCARRALD","UGEL CARLOS FERMIN FITZCARRALD",null,14,"",null,14,"",null,14,""]
[null,"LIMA",null,{"$f":"IF(ING!$D$21=E16,D15+1,0)","v":0},"ANCASH","CORONGO",null,"AMAZONAS BONGARA SAN CARLOS",{"$f":"IF(AND(ING!$D$21=J16,ING!$V$21=K16),I15+1,0)","v":0},"AMAZONAS","BONGARA","SAN CARLOS","010309",null,0,"ANCASH","310. EDUCACION CASMA","UGEL CASMA",null,15,"",null,15,"",null,15,""]
[null,"LORETO",null,{"$f":"IF(ING!$D$21=E17,D16+1,0)","v":0},"ANCASH","HUARAZ",null,"AMAZONAS BONGARA SHIPASBAMBA",{"$f":"IF(AND(ING!$D$21=J17,ING!$V$21=K17),I16+1,0)","v":0},"AMAZONAS","BONGARA","SHIPASBAMBA","010310",null,0,"ANCASH","320. EDUCACION CORONGO","UGEL CORONGO",null,16,"",null,16,"",null,16,""]
[null,"MADRE DE DIOS",null,{"$f":"IF(ING!$D$21=E18,D17+1,0)","v":0},"ANCASH","HUARI",null,"AMAZONAS BONGARA VALERA",{"$f":"IF(AND(ING!$D$21=J18,ING!$V$21=K18),I17+1,0)","v":0},"AMAZONAS","BONGARA","VALERA","010311",null,0,"ANCASH","311. EDUCACION HUARAZ","UGEL HUARAZ",null,17,"",null,17,"",null,17,""]
[null,"MOQUEGUA",null,{"$f":"IF(ING!$D$21=E19,D18+1,0)","v":0},"ANCASH","HUARMEY",null,"AMAZONAS BONGARA YAMBRASBAMBA",{"$f":"IF(AND(ING!$D$21=J19,ING!$V$21=K19),I18+1,0)","v":0},"AMAZONAS","BONGARA","YAMBRASBAMBA","010312",null,0,"ANCASH","308. EDUCACION HUARI","UGEL HUARI",null,18,"",null,18,"",null,18,""]
[null,"PASCO",null,{"$f":"IF(ING!$D$21=E20,D19+1,0)","v":0},"ANCASH","HUAYLAS",null,"AMAZONAS CHACHAPOYAS ASUNCION",{"$f":"IF(AND(ING!$D$21=J20,ING!$V$21=K20),I19+1,0)","v":0},"AMAZONAS","CHACHAPOYAS","ASUNCION","010102",null,0,"ANCASH","303. EDUCACION HUARMEY","UGEL HUARMEY",null,19,"",null,19,"",null,19,""]
[null,"PIURA",null,{"$f":"IF(ING!$D$21=E21,D20+1,0)","v":0},"ANCASH","MARISCAL LUZURIAGA",null,"AMAZONAS CHACHAPOYAS BALSAS",{"$f":"IF(AND(ING!$D$21=J21,ING!$V$21=K21),I20+1,0)","v":0},"AMAZONAS","CHACHAPOYAS","BALSAS","010103",null,0,"ANCASH","302. EDUCACION HUAYLAS","UGEL HUAYLAS",null,20,"",null,20,"",null,20,""]
[null,"PUNO",null,{"$f":"IF(ING!$D$21=E22,D21+1,0)","v":0},"ANCASH","OCROS",null,"AMAZONAS CHACHAPOYAS CHACHAPOYAS",{"$f":"IF(AND(ING!$D$21=J22,ING!$V$21=K22),I21+1,0)","v":0},"AMAZONAS","CHACHAPOYAS","CHACHAPOYAS","010101",null,0,"ANCASH","316. EDUCACION MARISCAL LUZURIAGA","UGEL MARISCAL LUZURIAGA",null,21,"",null,21,"",null,21,""]
[null,"SAN MARTÍN",null,{"$f":"IF(ING!$D$21=E23,D22+1,0)","v":0},"ANCASH","PALLASCA",null,"AMAZONAS CHACHAPOYAS CHETO",{"$f":"IF(AND(ING!$D$21=J23,ING!$V$21=K23),I22+1,0)","v":0},"AMAZONAS","CHACHAPOYAS","CHETO","010104",null,0,"ANCASH","317. EDUCACION OCROS","UGEL OCROS",null,22,"",null,22,"",null,22,""]
[null,"TACNA",null,{"$f":"IF(ING!$D$21=E24,D23+1,0)","v":0},"ANCASH","POMABAMBA",null,"AMAZONAS CHACHAPOYAS CHILIQUIN",{"$f":"IF(AND(ING!$D$21=J24,ING!$V$21=K24),I23+1,0)","v":0},"AMAZONAS","CHACHAPOYAS","CHILIQUIN","010105",null,0,"ANCASH","309. EDUCACION PALLASCA","UGEL PALLASCA",null,23,"",null,23,"",null,23,""]
[null,"TUMBES",null,{"$f":"IF(ING!$D$21=E25,D24+1,0)","v":0},"ANCASH","RECUAY",null,"AMAZONAS CHACHAPOYAS CHUQUIBAMBA",{"$f":"IF(AND(ING!$D$21=J25,ING!$V$21=K25),I24+1,0)","v":0},"AMAZONAS","CHACHAPOYAS","CHUQUIBAMBA","010106",null,0,"ANCASH","305. EDUCACION POMABAMBA","UGEL POMABAMBA",null,24,"",null,24,"",null,24,""]
[null,"UCAYALI",null,{"$f":"IF(ING!$D$21=E26,D25+1,0)","v":0},"ANCASH","SANTA",null,"AMAZONAS CHACHAPOYAS GRANADA",{"$f":"IF(AND(ING!$D$21=J26,ING!$V$21=K26),I25+1,0)","v":0},"AMAZONAS","CHACHAPOYAS","GRANADA","010107",null,0,"ANCASH","318. EDUCACION RECUAY","UGEL RECUAY",null,25,"",null,25,"",null,25,""]
[null,null,null,{"$f":"IF(ING!$D$21=E27,D26+1,0)","v":0},"ANCASH","SIHUAS",null,"AMAZONAS CHACHAPOYAS HUANCAS",{"$f":"IF(AND(ING!$D$21=J27,ING!$V$21=K27),I26+1,0)","v":0},"AMAZONAS","CHACHAPOYAS","HUANCAS","010108",null,0,"ANCASH","301. EDUCACION SANTA","UGEL SANTA",null,26,{"$f":"IFERROR(VLOOKUP(T27,O26:R247,4,FALSE),\"\")","v":""},null,null,null,null,26,""]
[null,null,null,{"$f":"IF(ING!$D$21=E28,D27+1,0)","v":0},"ANCASH","YUNGAY",null,"AMAZONAS CHACHAPOYAS LA JALCA",{"$f":"IF(AND(ING!$D$21=J28,ING!$V$21=K28),I27+1,0)","v":0},"AMAZONAS","CHACHAPOYAS","LA JALCA","010109",null,0,"ANCASH","306. EDUCACION SIHUAS","UGEL SIHUAS",null,27,"",null,null,null,null,27,""]
[null,null,null,{"$f":"IF(ING!$D$21=E29,D28+1,0)","v":0},"APURÍMAC","ABANCAY",null,"AMAZONAS CHACHAPOYAS LEIMEBAMBA",{"$f":"IF(AND(ING!$D$21=J29,ING!$V$21=K29),I28+1,0)","v":0},"AMAZONAS","CHACHAPOYAS","LEIMEBAMBA","010110",null,0,"ANCASH","319. EDUCACION YUNGAY","UGEL YUNGAY",null,28,"",null,null,null,null,28,""]
[null,"GESTIÓN",null,{"$f":"IF(ING!$D$21=E30,D29+1,0)","v":0},"APURÍMAC","ANDAHUAYLAS",null,"AMAZONAS CHACHAPOYAS LEVANTO",{"$f":"IF(AND(ING!$D$21=J30,ING!$V$21=K30),I29+1,0)","v":0},"AMAZONAS","CHACHAPOYAS","LEVANTO","010111",null,0,"APURIMAC","307. EDUCACION ABANCAY","UGEL ABANCAY",null,29,"",null,null,null,null,29,""]
[null,"PÚBLICA","<>",{"$f":"IF(ING!$D$21=E31,D30+1,0)","v":0},"APURÍMAC","ANTABAMBA",null,"AMAZONAS CHACHAPOYAS MAGDALENA",{"$f":"IF(AND(ING!$D$21=J31,ING!$V$21=K31),I30+1,0)","v":0},"AMAZONAS","CHACHAPOYAS","MAGDALENA","010112",null,0,"APURIMAC","301. EDUCACION CHANKA","UGEL ANDAHUAYLAS",null,30,"",null,null,null,null,30,""]
[null,"PRIVADA","=",{"$f":"IF(ING!$D$21=E32,D31+1,0)","v":0},"APURÍMAC","AYMARAES",null,"AMAZONAS CHACHAPOYAS MARISCAL CASTILLA",{"$f":"IF(AND(ING!$D$21=J32,ING!$V$21=K32),I31+1,0)","v":0},"AMAZONAS","CHACHAPOYAS","MARISCAL CASTILLA","010113",null,0,"APURIMAC","308. EDUCACION ANTABAMBA","UGEL ANTABAMBA",null,31,"",null,null,null,null,31,""]
[null,null,null,{"$f":"IF(ING!$D$21=E33,D32+1,0)","v":0},"APURÍMAC","CHINCHEROS",null,"AMAZONAS CHACHAPOYAS MOLINOPAMPA",{"$f":"IF(AND(ING!$D$21=J33,ING!$V$21=K33),I32+1,0)","v":0},"AMAZONAS","CHACHAPOYAS","MOLINOPAMPA","010114",null,0,"APURIMAC","306. EDUCACION AYMARAES","UGEL AYMARAES",null,32,"",null,null,null,null,32,""]
[null,null,null,{"$f":"IF(ING!$D$21=E34,D33+1,0)","v":0},"APURÍMAC","COTABAMBAS",null,"AMAZONAS CHACHAPOYAS MONTEVIDEO",{"$f":"IF(AND(ING!$D$21=J34,ING!$V$21=K34),I33+1,0)","v":0},"AMAZONAS","CHACHAPOYAS","MONTEVIDEO","010115",null,0,"APURIMAC","303. EDUCACION CHINCHEROS","UGEL CHINCHEROS",null,33,"",null,null,null,null,33,""]
[null,null,null,{"$f":"IF(ING!$D$21=E35,D34+1,0)","v":0},"APURÍMAC","GRAU",null,"AMAZONAS CHACHAPOYAS OLLEROS",{"$f":"IF(AND(ING!$D$21=J35,ING!$V$21=K35),I34+1,0)","v":0},"AMAZONAS","CHACHAPOYAS","OLLEROS","010116",null,0,"APURIMAC","302. EDUCACION COTABAMBAS","UGEL COTABAMBAS",null,34,"",null,null,null,null,34,""]
[null,"NIVEL",null,{"$f":"IF(ING!$D$21=E36,D35+1,0)","v":0},"AREQUIPA","AREQUIPA",null,"AMAZONAS CHACHAPOYAS QUINJALCA",{"$f":"IF(AND(ING!$D$21=J36,ING!$V$21=K36),I35+1,0)","v":0},"AMAZONAS","CHACHAPOYAS","QUINJALCA","010117",null,0,"APURIMAC","304. EDUCACION GRAU","UGEL GRAU",null,35,"",null,null,null,null,35,""]
[null,"INICIAL","A",{"$f":"IF(ING!$D$21=E37,D36+1,0)","v":0},"AREQUIPA","CAMANA",null,"AMAZONAS CHACHAPOYAS SAN FRANCISCO DE DAGUAS",{"$f":"IF(AND(ING!$D$21=J37,ING!$V$21=K37),I36+1,0)","v":0},"AMAZONAS","CHACHAPOYAS","SAN FRANCISCO DE DAGUAS","010118",null,0,"APURIMAC","305. EDUCACION HUANCARAMA","UGEL HUANCARAMA",null,null,null,null,null,null,null,36,""]
[null,"PRIMARIA","B",{"$f":"IF(ING!$D$21=E38,D37+1,0)","v":0},"AREQUIPA","CARAVELI",null,"AMAZONAS CHACHAPOYAS SAN ISIDRO DE MAINO",{"$f":"IF(AND(ING!$D$21=J38,ING!$V$21=K38),I37+1,0)","v":0},"AMAZONAS","CHACHAPOYAS","SAN ISIDRO DE MAINO","010119",null,0,"AREQUIPA","302. EDUCACION AREQUIPA NORTE","UGEL AREQUIPA NORTE",null,null,null,null,null,null,null,37,""]
[null,"SECUNDARIA","F",{"$f":"IF(ING!$D$21=E39,D38+1,0)","v":0},"AREQUIPA","CASTILLA",null,"AMAZONAS CHACHAPOYAS SOLOCO",{"$f":"IF(AND(ING!$D$21=J39,ING!$V$21=K39),I38+1,0)","v":0},"AMAZONAS","CHACHAPOYAS","SOLOCO","010120",null,0,"AREQUIPA","303. EDUCACION AREQUIPA SUR","UGEL AREQUIPA SUR",null,null,null,null,null,null,null,38,""]
[null,"ESPECIAL","E",{"$f":"IF(ING!$D$21=E40,D39+1,0)","v":0},"AREQUIPA","CAYLLOMA",null,"AMAZONAS CHACHAPOYAS SONCHE",{"$f":"IF(AND(ING!$D$21=J40,ING!$V$21=K40),I39+1,0)","v":0},"AMAZONAS","CHACHAPOYAS","SONCHE","010121",null,0,"AREQUIPA","300. EDUCACION AREQUIPA","UGEL CAMANA",null,null,null,null,null,null,null,39,""]
[null,"ALTERNATIVA","D",{"$f":"IF(ING!$D$21=E41,D40+1,0)","v":0},"AREQUIPA","CONDESUYOS",null,"AMAZONAS CONDORCANQUI EL CENEPA",{"$f":"IF(AND(ING!$D$21=J41,ING!$V$21=K41),I40+1,0)","v":0},"AMAZONAS","CONDORCANQUI","EL CENEPA","010402",null,0,"AREQUIPA","300. EDUCACION AREQUIPA","UGEL CARAVELI",null,null,null,null,null,null,null,40,""]
[null,null,null,{"$f":"IF(ING!$D$21=E42,D41+1,0)","v":0},"AREQUIPA","ISLAY",null,"AMAZONAS CONDORCANQUI NIEVA",{"$f":"IF(AND(ING!$D$21=J42,ING!$V$21=K42),I41+1,0)","v":0},"AMAZONAS","CONDORCANQUI","NIEVA","010401",null,0,"AREQUIPA","300. EDUCACION AREQUIPA","UGEL CASTILLA",null,null,null,null,null,null,null,41,""]
[null,null,null,{"$f":"IF(ING!$D$21=E43,D42+1,0)","v":0},"AREQUIPA","LA UNION",null,"AMAZONAS CONDORCANQUI RIO SANTIAGO",{"$f":"IF(AND(ING!$D$21=J43,ING!$V$21=K43),I42+1,0)","v":0},"AMAZONAS","CONDORCANQUI","RIO SANTIAGO","010403",null,0,"AREQUIPA","302. EDUCACION AREQUIPA NORTE","UGEL CAYLLOMA",null,null,null,null,null,null,null,42,""]
[null,null,null,{"$f":"IF(ING!$D$21=E44,D43+1,0)","v":0},"AYACUCHO","CANGALLO",null,"AMAZONAS LUYA CAMPORREDONDO",{"$f":"IF(AND(ING!$D$21=J44,ING!$V$21=K44),I43+1,0)","v":0},"AMAZONAS","LUYA","CAMPORREDONDO","010502",null,0,"AREQUIPA","300. EDUCACION AREQUIPA","UGEL CONDESUYOS",null,null,null,null,null,null,null,43,""]
[null,null,null,{"$f":"IF(ING!$D$21=E45,D44+1,0)","v":0},"AYACUCHO","HUAMANGA",null,"AMAZONAS LUYA COCABAMBA",{"$f":"IF(AND(ING!$D$21=J45,ING!$V$21=K45),I44+1,0)","v":0},"AMAZONAS","LUYA","COCABAMBA","010503",null,0,"AREQUIPA","300. EDUCACION AREQUIPA","UGEL ISLAY",null,null,null,null,null,null,null,44,""]
[null,null,null,{"$f":"IF(ING!$D$21=E46,D45+1,0)","v":0},"AYACUCHO","HUANCA SANCOS",null,"AMAZONAS LUYA COLCAMAR",{"$f":"IF(AND(ING!$D$21=J46,ING!$V$21=K46),I45+1,0)","v":0},"AMAZONAS","LUYA","COLCAMAR","010504",null,0,"AREQUIPA","302. EDUCACION AREQUIPA NORTE","UGEL LA JOYA",null,null,null,null,null,null,null,45,""]
[null,null,null,{"$f":"IF(ING!$D$21=E47,D46+1,0)","v":0},"AYACUCHO","HUANTA",null,"AMAZONAS LUYA CONILA",{"$f":"IF(AND(ING!$D$21=J47,ING!$V$21=K47),I46+1,0)","v":0},"AMAZONAS","LUYA","CONILA","010505",null,0,"AREQUIPA","300. EDUCACION AREQUIPA","UGEL LA UNION",null,null,null,null,null,null,null,46,""]
[null,null,null,{"$f":"IF(ING!$D$21=E48,D47+1,0)","v":0},"AYACUCHO","LA MAR",null,"AMAZONAS LUYA INGUILPATA",{"$f":"IF(AND(ING!$D$21=J48,ING!$V$21=K48),I47+1,0)","v":0},"AMAZONAS","LUYA","INGUILPATA","010506",null,0,"AYACUCHO","301. EDUCACION CENTRO AYACUCHO","UGEL CANGALLO",null,null,null,null,null,null,null,47,""]
[null,null,null,{"$f":"IF(ING!$D$21=E49,D48+1,0)","v":0},"AYACUCHO","LUCANAS",null,"AMAZONAS LUYA LAMUD",{"$f":"IF(AND(ING!$D$21=J49,ING!$V$21=K49),I48+1,0)","v":0},"AMAZONAS","LUYA","LAMUD","010501",null,0,"AYACUCHO","308. EDUCACION HUAMANGA","UGEL HUAMANGA",null,null,null,null,null,null,null,48,""]
[null,null,null,{"$f":"IF(ING!$D$21=E50,D49+1,0)","v":0},"AYACUCHO","PARINACOCHAS",null,"AMAZONAS LUYA LONGUITA",{"$f":"IF(AND(ING!$D$21=J50,ING!$V$21=K50),I49+1,0)","v":0},"AMAZONAS","LUYA","LONGUITA","010507",null,0,"AYACUCHO","312. EDUCACION HUANCASANCOS","UGEL HUANCASANCOS",null,null,null,null,null,null,null,49,""]
[null,null,null,{"$f":"IF(ING!$D$21=E51,D50+1,0)","v":0},"AYACUCHO","PAUCAR DEL SARA SARA",null,"AMAZONAS LUYA LONYA CHICO",{"$f":"IF(AND(ING!$D$21=J51,ING!$V$21=K51),I50+1,0)","v":0},"AMAZONAS","LUYA","LONYA CHICO","010508",null,0,"AYACUCHO","305. EDUCACION HUANTA","UGEL HUANTA",null,null,null,null,null,null,null,50,""]
[null,null,null,{"$f":"IF(ING!$D$21=E52,D51+1,0)","v":0},"AYACUCHO","SUCRE",null,"AMAZONAS LUYA LUYA",{"$f":"IF(AND(ING!$D$21=J52,ING!$V$21=K52),I51+1,0)","v":0},"AMAZONAS","LUYA","LUYA","010509",null,0,"AYACUCHO","307. EDUCACION VRAE LA MAR","UGEL LA MAR",null,{"$f":"IF('MOD1'!I20=\"SI\",'MOD1'!I22,\"\")&\" \"&IF('MOD1'!O20=\"SI\",'MOD1'!O22,\"\")&\" \"&IF('MOD1'!U20=\"SI\",'MOD1'!U22,\"\")&\" \"&IF('MOD1'!AA20=\"SI\",'MOD1'!AA22,\"\")&\" \"&IF('MOD1'!I36=\"SI\",'MOD1'!I38,\"\")&\" \"&IF('MOD1'!Q36=\"SI\",'MOD1'!Q38,\"\")&\" \"&IF('MOD1'!Y36=\"SI\",'MOD1'!Y38,\"\")&\" \"&IF('MOD1'!I52=\"SI\",'MOD1'!I54,\"\")&\" \"&IF('MOD1'!O52=\"SI\",'MOD1'!O54,\"\")&\" \"&IF('MOD1'!U52=\"SI\",'MOD1'!U54,\"\")&\" \"&IF('MOD1'!AA52=\"SI\",'MOD1'!AA54,\"\")","v":"          "}]
[null,null,null,{"$f":"IF(ING!$D$21=E53,D52+1,0)","v":0},"AYACUCHO","VICTOR FAJARDO",null,"AMAZONAS LUYA LUYA VIEJO",{"$f":"IF(AND(ING!$D$21=J53,ING!$V$21=K53),I52+1,0)","v":0},"AMAZONAS","LUYA","LUYA VIEJO","010510",null,0,"AYACUCHO","302. EDUCACION LUCANAS","UGEL LUCANAS",null,{"$f":"IF('MOD2'!I20=\"SI\",'MOD2'!I22,\"\")&\" \"&IF('MOD2'!O20=\"SI\",'MOD2'!O22,\"\")&\" \"&IF('MOD2'!U20=\"SI\",'MOD2'!U22,\"\")&\" \"&IF('MOD2'!AA20=\"SI\",'MOD2'!AA22,\"\")","v":"   "}]
[null,null,null,{"$f":"IF(ING!$D$21=E54,D53+1,0)","v":0},"AYACUCHO","VILCAS HUAMAN",null,"AMAZONAS LUYA MARIA",{"$f":"IF(AND(ING!$D$21=J54,ING!$V$21=K54),I53+1,0)","v":0},"AMAZONAS","LUYA","MARIA","010511",null,0,"AYACUCHO","303. EDUCACION SARA SARA","UGEL PARINACOCHAS",null,{"$f":"IF('MOD3'!I20=\"SI\",'MOD3'!I22,\"\")&\" \"&IF('MOD3'!O20=\"SI\",'MOD3'!O22,\"\")&\" \"&IF('MOD3'!U20=\"SI\",'MOD3'!U22,\"\")&\" \"&IF('MOD3'!AA20=\"SI\",'MOD3'!AA22,\"\")&\" \"&IF('MOD3'!I36=\"SI\",'MOD3'!I38,\"\")&\" \"&IF('MOD3'!O36=\"SI\",'MOD3'!O38,\"\")&\" \"&IF('MOD3'!U36=\"SI\",'MOD3'!U38,\"\")&\" \"&IF('MOD3'!AA36=\"SI\",'MOD3'!AA38,\"\")&\" \"&IF('MOD3'!I52=\"SI\",'MOD3'!I54,\"\")&\" \"&IF('MOD3'!Q52=\"SI\",'MOD3'!Q54,\"\")&\" \"&IF('MOD3'!Y52=\"SI\",'MOD3'!Y54,\"\")&\" \"&IF('MOD3'!I68=\"SI\",'MOD3'!I70,\"\")&\" \"&IF('MOD3'!O68=\"SI\",'MOD3'!O70,\"\")&\" \"&IF('MOD3'!U68=\"SI\",'MOD3'!U70,\"\")&\" \"&IF('MOD3'!AA68=\"SI\",'MOD3'!AA70,\"\")","v":"              "}]
[null,null,null,{"$f":"IF(ING!$D$21=E55,D54+1,0)","v":1},"CAJAMARCA","CAJABAMBA",null,"AMAZONAS LUYA OCALLI",{"$f":"IF(AND(ING!$D$21=J55,ING!$V$21=K55),I54+1,0)","v":0},"AMAZONAS","LUYA","OCALLI","010512",null,0,"AYACUCHO","304. EDUCACION SUR PAUZA","UGEL PAUCAR DE SARASARA",null,{"$f":"IF('MOD4'!I20=\"SI\",'MOD4'!I22,\"\")&\" \"&IF('MOD4'!O20=\"SI\",'MOD4'!O22,\"\")&\" \"&IF('MOD4'!U20=\"SI\",'MOD4'!U22,\"\")&\" \"&IF('MOD4'!AA20=\"SI\",'MOD4'!AA22,\"\")&\" \"&IF('MOD4'!I36=\"SI\",'MOD4'!I38,\"\")&\" \"&IF('MOD4'!O36=\"SI\",'MOD4'!O38,\"\")&\" \"&IF('MOD4'!U36=\"SI\",'MOD4'!U38,\"\")&\" \"&IF('MOD4'!AA36=\"SI\",'MOD4'!AA38,\"\")&\" \"&IF('MOD4'!I52=\"SI\",'MOD4'!I54,\"\")&\" \"&IF('MOD4'!O52=\"SI\",'MOD4'!O54,\"\")&\" \"&IF('MOD4'!U52=\"SI\",'MOD4'!U54,\"\")&\" \"&IF('MOD4'!AA52=\"SI\",'MOD4'!AA54,\"\")&\" \"&IF('MOD4'!I68=\"SI\",'MOD4'!I70,\"\")&\" \"&IF('MOD4'!O68=\"SI\",'MOD4'!O70,\"\")&\" \"&IF('MOD4'!U68=\"SI\",'MOD4'!U70,\"\")&\" \"&IF('MOD4'!AA68=\"SI\",'MOD4'!AA70,\"\")","v":"               "}]
[null,null,null,{"$f":"IF(ING!$D$21=E56,D55+1,0)","v":2},"CAJAMARCA","CAJAMARCA",null,"AMAZONAS LUYA OCUMAL",{"$f":"IF(AND(ING!$D$21=J56,ING!$V$21=K56),I55+1,0)","v":0},"AMAZONAS","LUYA","OCUMAL","010513",null,0,"AYACUCHO","309. EDUCACION UGEL SUCRE","UGEL SUCRE",null,{"$f":"IF('MOD5'!I20=\"SI\",'MOD5'!I22,\"\")&\" \"&IF('MOD5'!O20=\"SI\",'MOD5'!O22,\"\")&\" \"&IF('MOD5'!U20=\"SI\",'MOD5'!U22,\"\")&\" \"&IF('MOD5'!AA20=\"SI\",'MOD5'!AA22,\"\")","v":"   "}]
[null,null,null,{"$f":"IF(ING!$D$21=E57,D56+1,0)","v":3},"CAJAMARCA","CELENDIN",null,"AMAZONAS LUYA PISUQUIA",{"$f":"IF(AND(ING!$D$21=J57,ING!$V$21=K57),I56+1,0)","v":0},"AMAZONAS","LUYA","PISUQUIA","010514",null,0,"AYACUCHO","310. EDUCACION UGEL VICTOR FAJARDO","UGEL VICTOR FAJARDO",null,{"$f":"IF(COUNTIF('MOD6'!AA20:AD43,\"SI\")>0,'MOD6'!AA44,\"\")&\" \"&IF(COUNTIF('MOD6'!AE20:AH43,\"SI\")>0,'MOD6'!AE44,\"\")&\" \"&IF(COUNTIF('MOD6'!AI20:AL43,\"SI\")>0,'MOD6'!AI44,\"\")&\" \"&IF(COUNTIF('MOD6'!AM20:AP43,\"SI\")>0,'MOD6'!AM44,\"\")","v":"   "}]
[null,null,null,{"$f":"IF(ING!$D$21=E58,D57+1,0)","v":4},"CAJAMARCA","CHOTA",null,"AMAZONAS LUYA PROVIDENCIA",{"$f":"IF(AND(ING!$D$21=J58,ING!$V$21=K58),I57+1,0)","v":0},"AMAZONAS","LUYA","PROVIDENCIA","010515",null,0,"AYACUCHO","311. EDUCACION VILCASHUAMAN","UGEL VILCASHUAMAN",null,{"$f":"T52&\" \"&T53&\" \"&T54&\" \"&T55&\" \"&T56&\" \"&T57","v":"                                                     "}]
[null,null,null,{"$f":"IF(ING!$D$21=E59,D58+1,0)","v":5},"CAJAMARCA","CONTUMAZA",null,"AMAZONAS LUYA SAN CRISTOBAL",{"$f":"IF(AND(ING!$D$21=J59,ING!$V$21=K59),I58+1,0)","v":0},"AMAZONAS","LUYA","SAN CRISTOBAL","010516",null,0,"CAJAMARCA","306. EDUCACION UGEL CAJABAMBA","UGEL CAJABAMBA"]
[null,null,null,{"$f":"IF(ING!$D$21=E60,D59+1,0)","v":6},"CAJAMARCA","CUTERVO",null,"AMAZONAS LUYA SAN FRANCISCO DEL YESO",{"$f":"IF(AND(ING!$D$21=J60,ING!$V$21=K60),I59+1,0)","v":0},"AMAZONAS","LUYA","SAN FRANCISCO DEL YESO","010517",null,0,"CAJAMARCA","309. EDUCACION UGEL CAJAMARCA","UGEL CAJAMARCA",null,{"$f":"IFERROR(IF(FIND(V60,$T$58)>0,1,0),0)","v":0},{"$f":"T60+U59","v":0},"Cartas u oficios de coordinación del Gobierno regional u otros aliados"]
[null,null,null,{"$f":"IF(ING!$D$21=E61,D60+1,0)","v":7},"CAJAMARCA","HUALGAYOC",null,"AMAZONAS LUYA SAN JERONIMO",{"$f":"IF(AND(ING!$D$21=J61,ING!$V$21=K61),I60+1,0)","v":0},"AMAZONAS","LUYA","SAN JERONIMO","010518",null,0,"CAJAMARCA","308. EDUCACION UGEL CELENDIN","UGEL CELENDIN",null,{"$f":"IFERROR(IF(FIND(V61,$T$58)>0,1,0),0)","v":0},{"$f":"T61+U60","v":0},"Cartas, Oficios, Memo u otros documentos"]
[null,null,null,{"$f":"IF(ING!$D$21=E62,D61+1,0)","v":8},"CAJAMARCA","JAEN",null,"AMAZONAS LUYA SAN JUAN DE LOPECANCHA",{"$f":"IF(AND(ING!$D$21=J62,ING!$V$21=K62),I61+1,0)","v":0},"AMAZONAS","LUYA","SAN JUAN DE LOPECANCHA","010519",null,0,"CAJAMARCA","301. EDUCACION CHOTA","UGEL CHOTA",null,0,0,"Comunicados"]
[null,null,null,{"$f":"IF(ING!$D$21=E63,D62+1,0)","v":9},"CAJAMARCA","SAN IGNACIO",null,"AMAZONAS LUYA SANTA CATALINA",{"$f":"IF(AND(ING!$D$21=J63,ING!$V$21=K63),I62+1,0)","v":0},"AMAZONAS","LUYA","SANTA CATALINA","010520",null,0,"CAJAMARCA","311. EDUCACION UGEL CONTUMAZA","UGEL CONTUMAZA",null,0,0,"Documentos administrativos: Cartas, Oficios, Memo"]
[null,null,null,{"$f":"IF(ING!$D$21=E64,D63+1,0)","v":10},"CAJAMARCA","SAN MARCOS",null,"AMAZONAS LUYA SANTO TOMAS",{"$f":"IF(AND(ING!$D$21=J64,ING!$V$21=K64),I63+1,0)","v":0},"AMAZONAS","LUYA","SANTO TOMAS","010521",null,0,"CAJAMARCA","302. EDUCACION CUTERVO","UGEL CUTERVO",null,0,0,"Documentos de autorización de visitas y excursiones pedagógicas para el aprendizaje vivencial del enfoque ambiental"]
[null,null,null,{"$f":"IF(ING!$D$21=E65,D64+1,0)","v":11},"CAJAMARCA","SAN MIGUEL",null,"AMAZONAS LUYA TINGO",{"$f":"IF(AND(ING!$D$21=J65,ING!$V$21=K65),I64+1,0)","v":0},"AMAZONAS","LUYA","TINGO","010522",null,0,"CAJAMARCA","307. EDUCACION UGEL BAMBAMARCA","UGEL HUALGAYOC",null,0,0,"Fotografías"]
[null,null,null,{"$f":"IF(ING!$D$21=E66,D65+1,0)","v":12},"CAJAMARCA","SAN PABLO",null,"AMAZONAS LUYA TRITA",{"$f":"IF(AND(ING!$D$21=J66,ING!$V$21=K66),I65+1,0)","v":0},"AMAZONAS","LUYA","TRITA","010523",null,0,"CAJAMARCA","303. EDUCACION JAEN","UGEL JAEN",null,0,0,"Lista de Asistencia"]
[null,null,null,{"$f":"IF(ING!$D$21=E67,D66+1,0)","v":13},"CAJAMARCA","SANTA CRUZ",null,{"$f":"J67&\" \"&K67&\" \"&L67","v":"AMAZONAS RODRIGUEZ DE MENDOZA CHIRIMOTO"},{"$f":"IF(AND(ING!$D$21=J67,ING!$V$21=K67),I66+1,0)","v":0},"AMAZONAS","RODRIGUEZ DE MENDOZA","CHIRIMOTO","010602",null,{"$f":"IF($T$1=P67,O66+1,0)","v":0},"CAJAMARCA","304. EDUCACION SAN IGNACIO","UGEL SAN IGNACIO",null,0,0,"PAT"]
[null,null,null,{"$f":"IF(ING!$D$21=E68,D67+1,0)","v":0},"CALLAO","CALLAO",null,"AMAZONAS RODRIGUEZ DE MENDOZA COCHAMAL",{"$f":"IF(AND(ING!$D$21=J68,ING!$V$21=K68),I67+1,0)","v":0},"AMAZONAS","RODRIGUEZ DE MENDOZA","COCHAMAL","010603",null,0,"CAJAMARCA","310. EDUCACION UGEL SAN MARCOS","UGEL SAN MARCOS",null,0,0,"PCI"]
[null,null,null,{"$f":"IF(ING!$D$21=E69,D68+1,0)","v":0},"CUSCO","ACOMAYO",null,"AMAZONAS RODRIGUEZ DE MENDOZA HUAMBO",{"$f":"IF(AND(ING!$D$21=J69,ING!$V$21=K69),I68+1,0)","v":0},"AMAZONAS","RODRIGUEZ DE MENDOZA","HUAMBO","010604",null,0,"CAJAMARCA","312. EDUCACION UGEL SAN MIGUEL","UGEL SAN MIGUEL",null,0,0,"PCI / Unidades / Sesiones / evidencias en la producción de los estudiantes"]
[null,null,null,{"$f":"IF(ING!$D$21=E70,D69+1,0)","v":0},"CUSCO","ANTA",null,"AMAZONAS RODRIGUEZ DE MENDOZA LIMABAMBA",{"$f":"IF(AND(ING!$D$21=J70,ING!$V$21=K70),I69+1,0)","v":0},"AMAZONAS","RODRIGUEZ DE MENDOZA","LIMABAMBA","010605",null,0,"CAJAMARCA","313. EDUCACION UGEL SAN PABLO","UGEL SAN PABLO",null,0,0,"PEI"]
[null,null,null,{"$f":"IF(ING!$D$21=E71,D70+1,0)","v":0},"CUSCO","CALCA",null,"AMAZONAS RODRIGUEZ DE MENDOZA LONGAR",{"$f":"IF(AND(ING!$D$21=J71,ING!$V$21=K71),I70+1,0)","v":0},"AMAZONAS","RODRIGUEZ DE MENDOZA","LONGAR","010606",null,0,"CAJAMARCA","305. EDUCACION UGEL SANTA CRUZ","UGEL SANTA CRUZ",null,0,0,"Plan de Manejo de Residuos Sólidos"]
[null,null,null,{"$f":"IF(ING!$D$21=E72,D71+1,0)","v":0},"CUSCO","CANAS",null,"AMAZONAS RODRIGUEZ DE MENDOZA MARISCAL BENAVIDES",{"$f":"IF(AND(ING!$D$21=J72,ING!$V$21=K72),I71+1,0)","v":0},"AMAZONAS","RODRIGUEZ DE MENDOZA","MARISCAL BENAVIDES","010607",null,0,"CUSCO","303. EDUCACION QUISPICANCHIS","UGEL ACOMAYO",null,0,0,"Planes de Talleres o campañas"]
[null,null,null,{"$f":"IF(ING!$D$21=E73,D72+1,0)","v":0},"CUSCO","CANCHIS",null,"AMAZONAS RODRIGUEZ DE MENDOZA MILPUC",{"$f":"IF(AND(ING!$D$21=J73,ING!$V$21=K73),I72+1,0)","v":0},"AMAZONAS","RODRIGUEZ DE MENDOZA","MILPUC","010608",null,0,"CUSCO","300. EDUCACION CUSCO","UGEL ANTA",null,0,0,"Programa Curricular Anual"]
[null,null,null,{"$f":"IF(ING!$D$21=E74,D73+1,0)","v":0},"CUSCO","CHUMBIVILCAS",null,"AMAZONAS RODRIGUEZ DE MENDOZA OMIA",{"$f":"IF(AND(ING!$D$21=J74,ING!$V$21=K74),I73+1,0)","v":0},"AMAZONAS","RODRIGUEZ DE MENDOZA","OMIA","010609",null,0,"CUSCO","311. UGEL CALCA","UGEL CALCA",null,0,0,"Resolución Directoral"]
[null,null,null,{"$f":"IF(ING!$D$21=E75,D74+1,0)","v":0},"CUSCO","CUSCO",null,"AMAZONAS RODRIGUEZ DE MENDOZA SAN NICOLAS",{"$f":"IF(AND(ING!$D$21=J75,ING!$V$21=K75),I74+1,0)","v":0},"AMAZONAS","RODRIGUEZ DE MENDOZA","SAN NICOLAS","010601",null,0,"CUSCO","302. EDUCACION CANCHIS","UGEL CANAS",null,0,0,"RI "]
[null,null,null,{"$f":"IF(ING!$D$21=E76,D75+1,0)","v":0},"CUSCO","ESPINAR",null,"AMAZONAS RODRIGUEZ DE MENDOZA SANTA ROSA",{"$f":"IF(AND(ING!$D$21=J76,ING!$V$21=K76),I75+1,0)","v":0},"AMAZONAS","RODRIGUEZ DE MENDOZA","SANTA ROSA","010610",null,0,"CUSCO","302. EDUCACION CANCHIS","UGEL CANCHIS"]
[null,null,null,{"$f":"IF(ING!$D$21=E77,D76+1,0)","v":0},"CUSCO","LA CONVENCION",null,"AMAZONAS RODRIGUEZ DE MENDOZA TOTORA",{"$f":"IF(AND(ING!$D$21=J77,ING!$V$21=K77),I76+1,0)","v":0},"AMAZONAS","RODRIGUEZ DE MENDOZA","TOTORA","010611",null,0,"CUSCO","305. EDUCACION CHUMBIVILCAS","UGEL CHUMBIVILCAS"]
[null,null,null,{"$f":"IF(ING!$D$21=E78,D77+1,0)","v":0},"CUSCO","PARURO",null,"AMAZONAS RODRIGUEZ DE MENDOZA VISTA ALEGRE",{"$f":"IF(AND(ING!$D$21=J78,ING!$V$21=K78),I77+1,0)","v":0},"AMAZONAS","RODRIGUEZ DE MENDOZA","VISTA ALEGRE","010612",null,0,"CUSCO","312. UGEL CUSCO","UGEL CUSCO"]
[null,null,null,{"$f":"IF(ING!$D$21=E79,D78+1,0)","v":0},"CUSCO","PAUCARTAMBO",null,"AMAZONAS UTCUBAMBA BAGUA GRANDE",{"$f":"IF(AND(ING!$D$21=J79,ING!$V$21=K79),I78+1,0)","v":0},"AMAZONAS","UTCUBAMBA","BAGUA GRANDE","010701",null,0,"CUSCO","310. EDUCACION ESPINAR","UGEL ESPINAR"]
[null,null,null,{"$f":"IF(ING!$D$21=E80,D79+1,0)","v":0},"CUSCO","QUISPICANCHI",null,"AMAZONAS UTCUBAMBA CAJARURO",{"$f":"IF(AND(ING!$D$21=J80,ING!$V$21=K80),I79+1,0)","v":0},"AMAZONAS","UTCUBAMBA","CAJARURO","010702",null,0,"CUSCO","304. EDUCACION LA CONVENCION","UGEL LA CONVENCION"]
[null,null,null,{"$f":"IF(ING!$D$21=E81,D80+1,0)","v":0},"CUSCO","URUBAMBA",null,"AMAZONAS UTCUBAMBA CUMBA",{"$f":"IF(AND(ING!$D$21=J81,ING!$V$21=K81),I80+1,0)","v":0},"AMAZONAS","UTCUBAMBA","CUMBA","010703",null,0,"CUSCO","306. UGEL PARURO","UGEL PARURO"]
[null,null,null,{"$f":"IF(ING!$D$21=E82,D81+1,0)","v":0},"HUANCAVELICA","ACOBAMBA",null,"AMAZONAS UTCUBAMBA EL MILAGRO",{"$f":"IF(AND(ING!$D$21=J82,ING!$V$21=K82),I81+1,0)","v":0},"AMAZONAS","UTCUBAMBA","EL MILAGRO","010704",null,0,"CUSCO","309. EDUCACION PAUCARTAMBO","UGEL PAUCARTAMBO"]
[null,null,null,{"$f":"IF(ING!$D$21=E83,D82+1,0)","v":0},"HUANCAVELICA","ANGARAES",null,"AMAZONAS UTCUBAMBA JAMALCA",{"$f":"IF(AND(ING!$D$21=J83,ING!$V$21=K83),I82+1,0)","v":0},"AMAZONAS","UTCUBAMBA","JAMALCA","010705",null,0,"CUSCO","300. EDUCACION CUSCO","UGEL PICHARI-KIMBIRI"]
[null,null,null,{"$f":"IF(ING!$D$21=E84,D83+1,0)","v":0},"HUANCAVELICA","CASTROVIRREYNA",null,"AMAZONAS UTCUBAMBA LONYA GRANDE",{"$f":"IF(AND(ING!$D$21=J84,ING!$V$21=K84),I83+1,0)","v":0},"AMAZONAS","UTCUBAMBA","LONYA GRANDE","010706",null,0,"CUSCO","303. EDUCACION QUISPICANCHIS","UGEL QUISPICANCHI"]
[null,null,null,{"$f":"IF(ING!$D$21=E85,D84+1,0)","v":0},"HUANCAVELICA","CHURCAMPA",null,"AMAZONAS UTCUBAMBA YAMON",{"$f":"IF(AND(ING!$D$21=J85,ING!$V$21=K85),I84+1,0)","v":0},"AMAZONAS","UTCUBAMBA","YAMON","010707",null,0,"CUSCO","308. UGEL URUBAMBA","UGEL URUBAMBA"]
[null,null,null,{"$f":"IF(ING!$D$21=E86,D85+1,0)","v":0},"HUANCAVELICA","HUANCAVELICA",null,"ANCASH AIJA AIJA",{"$f":"IF(AND(ING!$D$21=J86,ING!$V$21=K86),I85+1,0)","v":0},"ANCASH","AIJA","AIJA","020201",null,0,"HUANCAVELICA","008. GERENCIA SUB-REGIONAL ACOBAMBA","UGEL ACOBAMBA"]
[null,null,null,{"$f":"IF(ING!$D$21=E87,D86+1,0)","v":0},"HUANCAVELICA","HUAYTARA",null,"ANCASH AIJA CORIS",{"$f":"IF(AND(ING!$D$21=J87,ING!$V$21=K87),I86+1,0)","v":0},"ANCASH","AIJA","CORIS","020202",null,0,"HUANCAVELICA","307. EDUCACION UGEL ANGARAES","UGEL ANGARAES"]
[null,null,null,{"$f":"IF(ING!$D$21=E88,D87+1,0)","v":0},"HUANCAVELICA","TAYACAJA",null,"ANCASH AIJA HUACLLAN",{"$f":"IF(AND(ING!$D$21=J88,ING!$V$21=K88),I87+1,0)","v":0},"ANCASH","AIJA","HUACLLAN","020203",null,0,"HUANCAVELICA","006. GERENCIA SUB-REGIONAL CASTROVIRREYNA","UGEL CASTROVIRREYNA"]
[null,null,null,{"$f":"IF(ING!$D$21=E89,D88+1,0)","v":0},"HUÁNUCO","AMBO",null,"ANCASH AIJA LA MERCED",{"$f":"IF(AND(ING!$D$21=J89,ING!$V$21=K89),I88+1,0)","v":0},"ANCASH","AIJA","LA MERCED","020204",null,0,"HUANCAVELICA","005. GERENCIA SUB-REGIONAL CHURCAMPA","UGEL CHURCAMPA"]
[null,null,null,{"$f":"IF(ING!$D$21=E90,D89+1,0)","v":0},"HUÁNUCO","DOS DE MAYO",null,"ANCASH AIJA SUCCHA",{"$f":"IF(AND(ING!$D$21=J90,ING!$V$21=K90),I89+1,0)","v":0},"ANCASH","AIJA","SUCCHA","020205",null,0,"HUANCAVELICA","300. EDUCACION HUANCAVELICA","UGEL HUANCAVELICA"]
[null,null,null,{"$f":"IF(ING!$D$21=E91,D90+1,0)","v":0},"HUÁNUCO","HUACAYBAMBA",null,"ANCASH ANTONIO RAYMONDI ACZO",{"$f":"IF(AND(ING!$D$21=J91,ING!$V$21=K91),I90+1,0)","v":0},"ANCASH","ANTONIO RAYMONDI","ACZO","020302",null,0,"HUANCAVELICA","007. GERENCIA SUB-REGIONAL HUAYTARA","UGEL HUAYTARA"]
[null,null,null,{"$f":"IF(ING!$D$21=E92,D91+1,0)","v":0},"HUÁNUCO","HUAMALIES",null,"ANCASH ANTONIO RAYMONDI CHACCHO",{"$f":"IF(AND(ING!$D$21=J92,ING!$V$21=K92),I91+1,0)","v":0},"ANCASH","ANTONIO RAYMONDI","CHACCHO","020303",null,0,"HUANCAVELICA","002. GERENCIA SUB-REGIONAL TAYACAJA","UGEL SURCUBAMBA"]
[null,null,null,{"$f":"IF(ING!$D$21=E93,D92+1,0)","v":0},"HUÁNUCO","HUANUCO",null,"ANCASH ANTONIO RAYMONDI CHINGAS",{"$f":"IF(AND(ING!$D$21=J93,ING!$V$21=K93),I92+1,0)","v":0},"ANCASH","ANTONIO RAYMONDI","CHINGAS","020304",null,0,"HUANCAVELICA","002. GERENCIA SUB-REGIONAL TAYACAJA","UGEL TAYACAJA"]
[null,null,null,{"$f":"IF(ING!$D$21=E94,D93+1,0)","v":0},"HUÁNUCO","LAURICOCHA",null,"ANCASH ANTONIO RAYMONDI LLAMELLIN",{"$f":"IF(AND(ING!$D$21=J94,ING!$V$21=K94),I93+1,0)","v":0},"ANCASH","ANTONIO RAYMONDI","LLAMELLIN","020301",null,0,"HUANUCO","308. EDUCACION UGEL AMBO","UGEL AMBO"]
[null,null,null,{"$f":"IF(ING!$D$21=E95,D94+1,0)","v":0},"HUÁNUCO","LEONCIO PRADO",null,"ANCASH ANTONIO RAYMONDI MIRGAS",{"$f":"IF(AND(ING!$D$21=J95,ING!$V$21=K95),I94+1,0)","v":0},"ANCASH","ANTONIO RAYMONDI","MIRGAS","020305",null,0,"HUANUCO","303. EDUCACION DOS DE MAYO","UGEL DOS DE MAYO"]
[null,null,null,{"$f":"IF(ING!$D$21=E96,D95+1,0)","v":0},"HUÁNUCO","MARAÑON",null,"ANCASH ANTONIO RAYMONDI SAN JUAN DE RONTOY",{"$f":"IF(AND(ING!$D$21=J96,ING!$V$21=K96),I95+1,0)","v":0},"ANCASH","ANTONIO RAYMONDI","SAN JUAN DE RONTOY","020306",null,0,"HUANUCO","307. EDUCACION UGEL HUACAYBAMBA","UGEL HUACAYBAMBA"]
[null,null,null,{"$f":"IF(ING!$D$21=E97,D96+1,0)","v":0},"HUÁNUCO","PACHITEA",null,"ANCASH ASUNCION ACOCHACA",{"$f":"IF(AND(ING!$D$21=J97,ING!$V$21=K97),I96+1,0)","v":0},"ANCASH","ASUNCION","ACOCHACA","020402",null,0,"HUANUCO","305. EDUCACION UGEL HUAMALIES","UGEL HUAMALIES"]
[null,null,null,{"$f":"IF(ING!$D$21=E98,D97+1,0)","v":0},"HUÁNUCO","PUERTO INCA",null,"ANCASH ASUNCION CHACAS",{"$f":"IF(AND(ING!$D$21=J98,ING!$V$21=K98),I97+1,0)","v":0},"ANCASH","ASUNCION","CHACAS","020401",null,0,"HUANUCO","311. EDUCACION UGEL HUANUCO","UGEL HUANUCO"]
[null,null,null,{"$f":"IF(ING!$D$21=E99,D98+1,0)","v":0},"HUÁNUCO","YAROWILCA",null,"ANCASH BOLOGNESI ABELARDO PARDO LEZAMETA",{"$f":"IF(AND(ING!$D$21=J99,ING!$V$21=K99),I98+1,0)","v":0},"ANCASH","BOLOGNESI","ABELARDO PARDO LEZAMETA","020502",null,0,"HUANUCO","309. EDUCACION UGEL LAURICOCHA","UGEL LAURICOCHA"]
[null,null,null,{"$f":"IF(ING!$D$21=E100,D99+1,0)","v":0},"ICA","CHINCHA",null,"ANCASH BOLOGNESI ANTONIO RAYMONDI",{"$f":"IF(AND(ING!$D$21=J100,ING!$V$21=K100),I99+1,0)","v":0},"ANCASH","BOLOGNESI","ANTONIO RAYMONDI","020503",null,0,"HUANUCO","302. EDUCACION LEONCIO PRADO","UGEL LEONCIO PRADO"]
[null,null,null,{"$f":"IF(ING!$D$21=E101,D100+1,0)","v":0},"ICA","ICA",null,"ANCASH BOLOGNESI AQUIA",{"$f":"IF(AND(ING!$D$21=J101,ING!$V$21=K101),I100+1,0)","v":0},"ANCASH","BOLOGNESI","AQUIA","020504",null,0,"HUANUCO","301. EDUCACION MARANON","UGEL MARANON"]
[null,null,null,{"$f":"IF(ING!$D$21=E102,D101+1,0)","v":0},"ICA","NAZCA",null,"ANCASH BOLOGNESI CAJACAY",{"$f":"IF(AND(ING!$D$21=J102,ING!$V$21=K102),I101+1,0)","v":0},"ANCASH","BOLOGNESI","CAJACAY","020505",null,0,"HUANUCO","304. EDUCACION UGEL PACHITEA","UGEL PACHITEA"]
[null,null,null,{"$f":"IF(ING!$D$21=E103,D102+1,0)","v":0},"ICA","PALPA",null,"ANCASH BOLOGNESI CANIS",{"$f":"IF(AND(ING!$D$21=J103,ING!$V$21=K103),I102+1,0)","v":0},"ANCASH","BOLOGNESI","CANIS","020506",null,0,"HUANUCO","306. EDUCACION UGEL PUERTO INCA","UGEL PUERTO INCA"]
[null,null,null,{"$f":"IF(ING!$D$21=E104,D103+1,0)","v":0},"ICA","PISCO",null,"ANCASH BOLOGNESI CHIQUIAN",{"$f":"IF(AND(ING!$D$21=J104,ING!$V$21=K104),I103+1,0)","v":0},"ANCASH","BOLOGNESI","CHIQUIAN","020501",null,0,"HUANUCO","310. EDUCACION UGEL YAROWILCA","UGEL YAROWILCA"]
[null,null,null,{"$f":"IF(ING!$D$21=E105,D104+1,0)","v":0},"JUNÍN","CHANCHAMAYO",null,"ANCASH BOLOGNESI COLQUIOC",{"$f":"IF(AND(ING!$D$21=J105,ING!$V$21=K105),I104+1,0)","v":0},"ANCASH","BOLOGNESI","COLQUIOC","020507",null,0,"ICA","301. EDUCACION CHINCHA","UGEL CHINCHA"]
[null,null,null,{"$f":"IF(ING!$D$21=E106,D105+1,0)","v":0},"JUNÍN","CHUPACA",null,"ANCASH BOLOGNESI HUALLANCA",{"$f":"IF(AND(ING!$D$21=J106,ING!$V$21=K106),I105+1,0)","v":0},"ANCASH","BOLOGNESI","HUALLANCA","020508",null,0,"ICA","300. EDUCACION ICA","UGEL ICA"]
[null,null,null,{"$f":"IF(ING!$D$21=E107,D106+1,0)","v":0},"JUNÍN","CONCEPCION",null,"ANCASH BOLOGNESI HUASTA",{"$f":"IF(AND(ING!$D$21=J107,ING!$V$21=K107),I106+1,0)","v":0},"ANCASH","BOLOGNESI","HUASTA","020509",null,0,"ICA","302. EDUCACION NASCA","UGEL NAZCA"]
[null,null,null,{"$f":"IF(ING!$D$21=E108,D107+1,0)","v":0},"JUNÍN","HUANCAYO",null,"ANCASH BOLOGNESI HUAYLLACAYAN",{"$f":"IF(AND(ING!$D$21=J108,ING!$V$21=K108),I107+1,0)","v":0},"ANCASH","BOLOGNESI","HUAYLLACAYAN","020510",null,0,"ICA","304. EDUCACION PALPA","UGEL PALPA"]
[null,null,null,{"$f":"IF(ING!$D$21=E109,D108+1,0)","v":0},"JUNÍN","JAUJA",null,"ANCASH BOLOGNESI LA PRIMAVERA",{"$f":"IF(AND(ING!$D$21=J109,ING!$V$21=K109),I108+1,0)","v":0},"ANCASH","BOLOGNESI","LA PRIMAVERA","020511",null,0,"ICA","303. EDUCACION PISCO","UGEL PISCO"]
[null,null,null,{"$f":"IF(ING!$D$21=E110,D109+1,0)","v":0},"JUNÍN","JUNIN",null,"ANCASH BOLOGNESI MANGAS",{"$f":"IF(AND(ING!$D$21=J110,ING!$V$21=K110),I109+1,0)","v":0},"ANCASH","BOLOGNESI","MANGAS","020512",null,0,"JUNIN","303. EDUCACION CHANCHAMAYO","UGEL CHANCHAMAYO"]
[null,null,null,{"$f":"IF(ING!$D$21=E111,D110+1,0)","v":0},"JUNÍN","SATIPO",null,"ANCASH BOLOGNESI PACLLON",{"$f":"IF(AND(ING!$D$21=J111,ING!$V$21=K111),I110+1,0)","v":0},"ANCASH","BOLOGNESI","PACLLON","020513",null,0,"JUNIN","306. EDUCACION CHUPACA","UGEL CHUPACA"]
[null,null,null,{"$f":"IF(ING!$D$21=E112,D111+1,0)","v":0},"JUNÍN","TARMA",null,"ANCASH BOLOGNESI SAN MIGUEL DE CORPANQUI",{"$f":"IF(AND(ING!$D$21=J112,ING!$V$21=K112),I111+1,0)","v":0},"ANCASH","BOLOGNESI","SAN MIGUEL DE CORPANQUI","020514",null,0,"JUNIN","305. EDUCACION CONCEPCION","UGEL CONCEPCION"]
[null,null,null,{"$f":"IF(ING!$D$21=E113,D112+1,0)","v":0},"JUNÍN","YAULI",null,"ANCASH BOLOGNESI TICLLOS",{"$f":"IF(AND(ING!$D$21=J113,ING!$V$21=K113),I112+1,0)","v":0},"ANCASH","BOLOGNESI","TICLLOS","020515",null,0,"JUNIN","304. EDUCACION HUANCAYO","UGEL HUANCAYO"]
[null,null,null,{"$f":"IF(ING!$D$21=E114,D113+1,0)","v":0},"LA LIBERTAD","ASCOPE",null,"ANCASH CARHUAZ ACOPAMPA",{"$f":"IF(AND(ING!$D$21=J114,ING!$V$21=K114),I113+1,0)","v":0},"ANCASH","CARHUAZ","ACOPAMPA","020602",null,0,"JUNIN","307. EDUCACION JAUJA","UGEL JAUJA"]
[null,null,null,{"$f":"IF(ING!$D$21=E115,D114+1,0)","v":0},"LA LIBERTAD","BOLIVAR",null,"ANCASH CARHUAZ AMASHCA",{"$f":"IF(AND(ING!$D$21=J115,ING!$V$21=K115),I114+1,0)","v":0},"ANCASH","CARHUAZ","AMASHCA","020603",null,0,"JUNIN","309. EDUCACION PROVINCIA DE JUNIN","UGEL JUNIN"]
[null,null,null,{"$f":"IF(ING!$D$21=E116,D115+1,0)","v":0},"LA LIBERTAD","CHEPEN",null,"ANCASH CARHUAZ ANTA",{"$f":"IF(AND(ING!$D$21=J116,ING!$V$21=K116),I115+1,0)","v":0},"ANCASH","CARHUAZ","ANTA","020604",null,0,"JUNIN","302. EDUCACION SATIPO","UGEL PANGOA"]
[null,null,null,{"$f":"IF(ING!$D$21=E117,D116+1,0)","v":0},"LA LIBERTAD","GRAN CHIMU",null,"ANCASH CARHUAZ ATAQUERO",{"$f":"IF(AND(ING!$D$21=J117,ING!$V$21=K117),I116+1,0)","v":0},"ANCASH","CARHUAZ","ATAQUERO","020605",null,0,"JUNIN","303. EDUCACION CHANCHAMAYO","UGEL PICHANAKI"]
[null,null,null,{"$f":"IF(ING!$D$21=E118,D117+1,0)","v":0},"LA LIBERTAD","JULCAN",null,"ANCASH CARHUAZ CARHUAZ",{"$f":"IF(AND(ING!$D$21=J118,ING!$V$21=K118),I117+1,0)","v":0},"ANCASH","CARHUAZ","CARHUAZ","020601",null,0,"JUNIN","302. EDUCACION SATIPO","UGEL RIO ENE-MANTARO"]
[null,null,null,{"$f":"IF(ING!$D$21=E119,D118+1,0)","v":0},"LA LIBERTAD","OTUZCO",null,"ANCASH CARHUAZ MARCARA",{"$f":"IF(AND(ING!$D$21=J119,ING!$V$21=K119),I118+1,0)","v":0},"ANCASH","CARHUAZ","MARCARA","020606",null,0,"JUNIN","302. EDUCACION SATIPO","UGEL RIO TAMBO"]
[null,null,null,{"$f":"IF(ING!$D$21=E120,D119+1,0)","v":0},"LA LIBERTAD","PACASMAYO",null,"ANCASH CARHUAZ PARIAHUANCA",{"$f":"IF(AND(ING!$D$21=J120,ING!$V$21=K120),I119+1,0)","v":0},"ANCASH","CARHUAZ","PARIAHUANCA","020607",null,0,"JUNIN","302. EDUCACION SATIPO","UGEL SATIPO"]
[null,null,null,{"$f":"IF(ING!$D$21=E121,D120+1,0)","v":0},"LA LIBERTAD","PATAZ",null,"ANCASH CARHUAZ SAN MIGUEL DE ACO",{"$f":"IF(AND(ING!$D$21=J121,ING!$V$21=K121),I120+1,0)","v":0},"ANCASH","CARHUAZ","SAN MIGUEL DE ACO","020608",null,0,"JUNIN","301. EDUCACION TARMA","UGEL TARMA"]
[null,null,null,{"$f":"IF(ING!$D$21=E122,D121+1,0)","v":0},"LA LIBERTAD","SANCHEZ CARRION",null,"ANCASH CARHUAZ SHILLA",{"$f":"IF(AND(ING!$D$21=J122,ING!$V$21=K122),I121+1,0)","v":0},"ANCASH","CARHUAZ","SHILLA","020609",null,0,"JUNIN","308. EDUCACION YAULI - LA OROYA","UGEL YAULI"]
[null,null,null,{"$f":"IF(ING!$D$21=E123,D122+1,0)","v":0},"LA LIBERTAD","SANTIAGO DE CHUCO",null,"ANCASH CARHUAZ TINCO",{"$f":"IF(AND(ING!$D$21=J123,ING!$V$21=K123),I122+1,0)","v":0},"ANCASH","CARHUAZ","TINCO","020610",null,0,"LA LIBERTAD","313. EDUCACION EL PORVENIR","UGEL 01 - EL PORVENIR"]
[null,null,null,{"$f":"IF(ING!$D$21=E124,D123+1,0)","v":0},"LA LIBERTAD","TRUJILLO",null,"ANCASH CARHUAZ YUNGAR",{"$f":"IF(AND(ING!$D$21=J124,ING!$V$21=K124),I123+1,0)","v":0},"ANCASH","CARHUAZ","YUNGAR","020611",null,0,"LA LIBERTAD","314. EDUCACION LA ESPERANZA","UGEL 02 - LA ESPERANZA"]
[null,null,null,{"$f":"IF(ING!$D$21=E125,D124+1,0)","v":0},"LA LIBERTAD","VIRU",null,"ANCASH CARLOS FERMIN FITZCARRALD SAN LUIS",{"$f":"IF(AND(ING!$D$21=J125,ING!$V$21=K125),I124+1,0)","v":0},"ANCASH","CARLOS FERMIN FITZCARRALD","SAN LUIS","020701",null,0,"LA LIBERTAD","315. EDUCACION TRUJILLO NOR OESTE","UGEL 03 - TRUJILLO NOR OESTE"]
[null,null,null,{"$f":"IF(ING!$D$21=E126,D125+1,0)","v":0},"LAMBAYEQUE","CHICLAYO",null,"ANCASH CARLOS FERMIN FITZCARRALD SAN NICOLAS",{"$f":"IF(AND(ING!$D$21=J126,ING!$V$21=K126),I125+1,0)","v":0},"ANCASH","CARLOS FERMIN FITZCARRALD","SAN NICOLAS","020702",null,0,"LA LIBERTAD","316. EDUCACION TRUJILLO SUR ESTE","UGEL 04 - TRUJILLO SUR ESTE"]
[null,null,null,{"$f":"IF(ING!$D$21=E127,D126+1,0)","v":0},"LAMBAYEQUE","FERREÑAFE",null,"ANCASH CARLOS FERMIN FITZCARRALD YAUYA",{"$f":"IF(AND(ING!$D$21=J127,ING!$V$21=K127),I126+1,0)","v":0},"ANCASH","CARLOS FERMIN FITZCARRALD","YAUYA","020703",null,0,"LA LIBERTAD","303. EDUCACION ASCOPE","UGEL ASCOPE"]
[null,null,null,{"$f":"IF(ING!$D$21=E128,D127+1,0)","v":0},"LAMBAYEQUE","LAMBAYEQUE",null,"ANCASH CASMA BUENA VISTA ALTA",{"$f":"IF(AND(ING!$D$21=J128,ING!$V$21=K128),I127+1,0)","v":0},"ANCASH","CASMA","BUENA VISTA ALTA","020802",null,0,"LA LIBERTAD","309. EDUCACION BOLIVAR","UGEL BOLIVAR"]
[null,null,null,{"$f":"IF(ING!$D$21=E129,D128+1,0)","v":0},"LIMA","BARRANCA",null,"ANCASH CASMA CASMA",{"$f":"IF(AND(ING!$D$21=J129,ING!$V$21=K129),I128+1,0)","v":0},"ANCASH","CASMA","CASMA","020801",null,0,"LA LIBERTAD","301. EDUCACION CHEPEN","UGEL CHEPEN"]
[null,null,null,{"$f":"IF(ING!$D$21=E130,D129+1,0)","v":0},"LIMA","CAJATAMBO",null,"ANCASH CASMA COMANDANTE NOEL",{"$f":"IF(AND(ING!$D$21=J130,ING!$V$21=K130),I129+1,0)","v":0},"ANCASH","CASMA","COMANDANTE NOEL","020803",null,0,"LA LIBERTAD","304. EDUCACION GRAN CHIMU","UGEL GRAN CHIMU"]
[null,null,null,{"$f":"IF(ING!$D$21=E131,D130+1,0)","v":0},"LIMA","CANTA",null,{"$f":"J131&\" \"&K131&\" \"&L131","v":"ANCASH CASMA YAUTAN"},{"$f":"IF(AND(ING!$D$21=J131,ING!$V$21=K131),I130+1,0)","v":0},"ANCASH","CASMA","YAUTAN","020804",null,{"$f":"IF($T$1=P131,O130+1,0)","v":0},"LA LIBERTAD","311. EDUCACION JULCAN","UGEL JULCAN"]
[null,null,null,{"$f":"IF(ING!$D$21=E132,D131+1,0)","v":0},"LIMA","CAÑETE",null,"ANCASH CORONGO ACO",{"$f":"IF(AND(ING!$D$21=J132,ING!$V$21=K132),I131+1,0)","v":0},"ANCASH","CORONGO","ACO","020902",null,0,"LA LIBERTAD","305. EDUCACION OTUZCO","UGEL OTUZCO"]
[null,null,null,{"$f":"IF(ING!$D$21=E133,D132+1,0)","v":0},"LIMA","HUARAL",null,"ANCASH CORONGO BAMBAS",{"$f":"IF(AND(ING!$D$21=J133,ING!$V$21=K133),I132+1,0)","v":0},"ANCASH","CORONGO","BAMBAS","020903",null,0,"LA LIBERTAD","302. EDUCACION PACASMAYO","UGEL PACASMAYO"]
[null,null,null,{"$f":"IF(ING!$D$21=E134,D133+1,0)","v":0},"LIMA","HUAROCHIRI",null,"ANCASH CORONGO CORONGO",{"$f":"IF(AND(ING!$D$21=J134,ING!$V$21=K134),I133+1,0)","v":0},"ANCASH","CORONGO","CORONGO","020901",null,0,"LA LIBERTAD","308. EDUCACION PATAZ","UGEL PATAZ"]
[null,null,null,{"$f":"IF(ING!$D$21=E135,D134+1,0)","v":0},"LIMA","HUAURA",null,"ANCASH CORONGO CUSCA",{"$f":"IF(AND(ING!$D$21=J135,ING!$V$21=K135),I134+1,0)","v":0},"ANCASH","CORONGO","CUSCA","020904",null,0,"LA LIBERTAD","307. EDUCACION SANCHEZ CARRION","UGEL SANCHEZ CARRION"]
[null,null,null,{"$f":"IF(ING!$D$21=E136,D135+1,0)","v":0},"LIMA","LIMA",null,"ANCASH CORONGO LA PAMPA",{"$f":"IF(AND(ING!$D$21=J136,ING!$V$21=K136),I135+1,0)","v":0},"ANCASH","CORONGO","LA PAMPA","020905",null,0,"LA LIBERTAD","306. EDUCACION SANTIAGO DE CHUCO","UGEL SANTIAGO DE CHUCO"]
[null,null,null,{"$f":"IF(ING!$D$21=E137,D136+1,0)","v":0},"LIMA","OYON",null,"ANCASH CORONGO YANAC",{"$f":"IF(AND(ING!$D$21=J137,ING!$V$21=K137),I136+1,0)","v":0},"ANCASH","CORONGO","YANAC","020906",null,0,"LA LIBERTAD","312. EDUCACION VIRU","UGEL VIRU"]
[null,null,null,{"$f":"IF(ING!$D$21=E138,D137+1,0)","v":0},"LIMA","YAUYOS",null,"ANCASH CORONGO YUPAN",{"$f":"IF(AND(ING!$D$21=J138,ING!$V$21=K138),I137+1,0)","v":0},"ANCASH","CORONGO","YUPAN","020907",null,0,"LAMBAYEQUE","300. EDUCACION CHICLAYO","UGEL CHICLAYO"]
[null,null,null,{"$f":"IF(ING!$D$21=E139,D138+1,0)","v":0},"LORETO","ALTO AMAZONAS",null,"ANCASH HUARAZ COCHABAMBA",{"$f":"IF(AND(ING!$D$21=J139,ING!$V$21=K139),I138+1,0)","v":0},"ANCASH","HUARAZ","COCHABAMBA","020102",null,0,"LAMBAYEQUE","303. EDUCACION FERRENAFE","UGEL FERRENAFE"]
[null,null,null,{"$f":"IF(ING!$D$21=E140,D139+1,0)","v":0},"LORETO","DATEM DEL MARAÑON",null,"ANCASH HUARAZ COLCABAMBA",{"$f":"IF(AND(ING!$D$21=J140,ING!$V$21=K140),I139+1,0)","v":0},"ANCASH","HUARAZ","COLCABAMBA","020103",null,0,"LAMBAYEQUE","302. EDUCACION LAMBAYEQUE","UGEL LAMBAYEQUE"]
[null,null,null,{"$f":"IF(ING!$D$21=E141,D140+1,0)","v":0},"LORETO","LORETO",null,"ANCASH HUARAZ HUANCHAY",{"$f":"IF(AND(ING!$D$21=J141,ING!$V$21=K141),I140+1,0)","v":0},"ANCASH","HUARAZ","HUANCHAY","020104",null,0,"LIMA","001-56: 01 SAN JUAN DE MIRAFLORES","UGEL 01 SAN JUAN DE MIRAFLORES"]
[null,null,null,{"$f":"IF(ING!$D$21=E142,D141+1,0)","v":0},"LORETO","MARISCAL RAMON CASTILLA",null,"ANCASH HUARAZ HUARAZ",{"$f":"IF(AND(ING!$D$21=J142,ING!$V$21=K142),I141+1,0)","v":0},"ANCASH","HUARAZ","HUARAZ","020101",null,0,"LIMA","002-57: 02 SAN MARTIN DE PORRAS","UGEL 02 RIMAC"]
[null,null,null,{"$f":"IF(ING!$D$21=E143,D142+1,0)","v":0},"LORETO","MAYNAS",null,"ANCASH HUARAZ INDEPENDENCIA",{"$f":"IF(AND(ING!$D$21=J143,ING!$V$21=K143),I142+1,0)","v":0},"ANCASH","HUARAZ","INDEPENDENCIA","020105",null,0,"LIMA","003-58: 03 CERCADO","UGEL 03 BRENA"]
[null,null,null,{"$f":"IF(ING!$D$21=E144,D143+1,0)","v":0},"LORETO","PUTUMAYO",null,"ANCASH HUARAZ JANGAS",{"$f":"IF(AND(ING!$D$21=J144,ING!$V$21=K144),I143+1,0)","v":0},"ANCASH","HUARAZ","JANGAS","020106",null,0,"LIMA","004-59: 04 COMAS","UGEL 04 COMAS"]
[null,null,null,{"$f":"IF(ING!$D$21=E145,D144+1,0)","v":0},"LORETO","REQUENA",null,"ANCASH HUARAZ LA LIBERTAD",{"$f":"IF(AND(ING!$D$21=J145,ING!$V$21=K145),I144+1,0)","v":0},"ANCASH","HUARAZ","LA LIBERTAD","020107",null,0,"LIMA","005-60: 05 SAN JUAN DE LURIGANCHO","UGEL 05 SAN JUAN DE LURIGANCHO"]
[null,null,null,{"$f":"IF(ING!$D$21=E146,D145+1,0)","v":0},"LORETO","UCAYALI",null,"ANCASH HUARAZ OLLEROS",{"$f":"IF(AND(ING!$D$21=J146,ING!$V$21=K146),I145+1,0)","v":0},"ANCASH","HUARAZ","OLLEROS","020108",null,0,"LIMA","006-61: 06 VITARTE","UGEL 06 ATE"]
[null,null,null,{"$f":"IF(ING!$D$21=E147,D146+1,0)","v":0},"MADRE DE DIOS","MANU",null,"ANCASH HUARAZ PAMPAS GRANDE",{"$f":"IF(AND(ING!$D$21=J147,ING!$V$21=K147),I146+1,0)","v":0},"ANCASH","HUARAZ","PAMPAS GRANDE","020109",null,0,"LIMA","007-62: 07 SAN BORJA","UGEL 07 SAN BORJA"]
[null,null,null,{"$f":"IF(ING!$D$21=E148,D147+1,0)","v":0},"MADRE DE DIOS","TAHUAMANU",null,"ANCASH HUARAZ PARIACOTO",{"$f":"IF(AND(ING!$D$21=J148,ING!$V$21=K148),I147+1,0)","v":0},"ANCASH","HUARAZ","PARIACOTO","020110",null,0,"LIMA","301. EDUCACION CANETE","UGEL 08 CANETE"]
[null,null,null,{"$f":"IF(ING!$D$21=E149,D148+1,0)","v":0},"MADRE DE DIOS","TAMBOPATA",null,"ANCASH HUARAZ PIRA",{"$f":"IF(AND(ING!$D$21=J149,ING!$V$21=K149),I148+1,0)","v":0},"ANCASH","HUARAZ","PIRA","020111",null,0,"LIMA","302. EDUCACION HUAURA","UGEL 09 HUAURA"]
[null,null,null,{"$f":"IF(ING!$D$21=E150,D149+1,0)","v":0},"MOQUEGUA","GENERAL SANCHEZ CERRO",null,"ANCASH HUARAZ TARICA",{"$f":"IF(AND(ING!$D$21=J150,ING!$V$21=K150),I149+1,0)","v":0},"ANCASH","HUARAZ","TARICA","020112",null,0,"LIMA","303. EDUCACION HUARAL","UGEL 10 HUARAL"]
[null,null,null,{"$f":"IF(ING!$D$21=E151,D150+1,0)","v":0},"MOQUEGUA","ILO",null,"ANCASH HUARI ANRA",{"$f":"IF(AND(ING!$D$21=J151,ING!$V$21=K151),I150+1,0)","v":0},"ANCASH","HUARI","ANRA","021002",null,0,"LIMA","304. EDUCACION CAJATAMBO","UGEL 11 CAJATAMBO"]
[null,null,null,{"$f":"IF(ING!$D$21=E152,D151+1,0)","v":0},"MOQUEGUA","MARISCAL NIETO",null,"ANCASH HUARI CAJAY",{"$f":"IF(AND(ING!$D$21=J152,ING!$V$21=K152),I151+1,0)","v":0},"ANCASH","HUARI","CAJAY","021003",null,0,"LIMA","305. EDUCACION CANTA","UGEL 12 CANTA"]
[null,null,null,{"$f":"IF(ING!$D$21=E153,D152+1,0)","v":0},"PASCO","DANIEL ALCIDES CARRION",null,"ANCASH HUARI CHAVIN DE HUANTAR",{"$f":"IF(AND(ING!$D$21=J153,ING!$V$21=K153),I152+1,0)","v":0},"ANCASH","HUARI","CHAVIN DE HUANTAR","021004",null,0,"LIMA","306. EDUCACION YAUYOS","UGEL 13 YAUYOS"]
[null,null,null,{"$f":"IF(ING!$D$21=E154,D153+1,0)","v":0},"PASCO","OXAPAMPA",null,"ANCASH HUARI HUACACHI",{"$f":"IF(AND(ING!$D$21=J154,ING!$V$21=K154),I153+1,0)","v":0},"ANCASH","HUARI","HUACACHI","021005",null,0,"LIMA","307. EDUCACION OYON","UGEL 14 OYON"]
[null,null,null,{"$f":"IF(ING!$D$21=E155,D154+1,0)","v":0},"PASCO","PASCO",null,"ANCASH HUARI HUACCHIS",{"$f":"IF(AND(ING!$D$21=J155,ING!$V$21=K155),I154+1,0)","v":0},"ANCASH","HUARI","HUACCHIS","021006",null,0,"LIMA","308. EDUCACION HUAROCHIRI","UGEL 15 HUAROCHIRI"]
[null,null,null,{"$f":"IF(ING!$D$21=E156,D155+1,0)","v":0},"PIURA","AYABACA",null,"ANCASH HUARI HUACHIS",{"$f":"IF(AND(ING!$D$21=J156,ING!$V$21=K156),I155+1,0)","v":0},"ANCASH","HUARI","HUACHIS","021007",null,0,"LIMA","309. EDUCACION BARRANCA","UGEL 16 BARRANCA"]
[null,null,null,{"$f":"IF(ING!$D$21=E157,D156+1,0)","v":0},"PIURA","HUANCABAMBA",null,"ANCASH HUARI HUANTAR",{"$f":"IF(AND(ING!$D$21=J157,ING!$V$21=K157),I156+1,0)","v":0},"ANCASH","HUARI","HUANTAR","021008",null,0,"CALLAO","300. EDUCACION CALLAO","DRE CALLAO"]
[null,null,null,{"$f":"IF(ING!$D$21=E158,D157+1,0)","v":0},"PIURA","MORROPON",null,"ANCASH HUARI HUARI",{"$f":"IF(AND(ING!$D$21=J158,ING!$V$21=K158),I157+1,0)","v":0},"ANCASH","HUARI","HUARI","021001",null,0,"CALLAO","302. EDUCACION VENTANILLA","UGEL VENTANILLA"]
[null,null,null,{"$f":"IF(ING!$D$21=E159,D158+1,0)","v":0},"PIURA","PAITA",null,"ANCASH HUARI MASIN",{"$f":"IF(AND(ING!$D$21=J159,ING!$V$21=K159),I158+1,0)","v":0},"ANCASH","HUARI","MASIN","021009",null,0,"LORETO","306. EDUCACION DATEM DEL MARANON","UGEL ALTO AMAZONAS-SAN LORENZO"]
[null,null,null,{"$f":"IF(ING!$D$21=E160,D159+1,0)","v":0},"PIURA","PIURA",null,"ANCASH HUARI PAUCAS",{"$f":"IF(AND(ING!$D$21=J160,ING!$V$21=K160),I159+1,0)","v":0},"ANCASH","HUARI","PAUCAS","021010",null,0,"LORETO","301. EDUCACION ALTO AMAZONAS","UGEL ALTO AMAZONAS-YURIMAGUAS"]
[null,null,null,{"$f":"IF(ING!$D$21=E161,D160+1,0)","v":0},"PIURA","SECHURA",null,"ANCASH HUARI PONTO",{"$f":"IF(AND(ING!$D$21=J161,ING!$V$21=K161),I160+1,0)","v":0},"ANCASH","HUARI","PONTO","021011",null,0,"LORETO","305. EDUCACION NAUTA","UGEL LORETO - NAUTA"]
[null,null,null,{"$f":"IF(ING!$D$21=E162,D161+1,0)","v":0},"PIURA","SULLANA",null,"ANCASH HUARI RAHUAPAMPA",{"$f":"IF(AND(ING!$D$21=J162,ING!$V$21=K162),I161+1,0)","v":0},"ANCASH","HUARI","RAHUAPAMPA","021012",null,0,"LORETO","300. EDUCACION LORETO","UGEL MAYNAS"]
[null,null,null,{"$f":"IF(ING!$D$21=E163,D162+1,0)","v":0},"PIURA","TALARA",null,"ANCASH HUARI RAPAYAN",{"$f":"IF(AND(ING!$D$21=J163,ING!$V$21=K163),I162+1,0)","v":0},"ANCASH","HUARI","RAPAYAN","021013",null,0,"LORETO","300. EDUCACION LORETO","UGEL PUTUMAYO"]
[null,null,null,{"$f":"IF(ING!$D$21=E164,D163+1,0)","v":0},"PUNO","AZANGARO",null,"ANCASH HUARI SAN MARCOS",{"$f":"IF(AND(ING!$D$21=J164,ING!$V$21=K164),I163+1,0)","v":0},"ANCASH","HUARI","SAN MARCOS","021014",null,0,"LORETO","303. EDUCACION MARISCAL RAMON CASTILLA","UGEL RAMON CASTILLA-CABALLOCOCHA"]
[null,null,null,{"$f":"IF(ING!$D$21=E165,D164+1,0)","v":0},"PUNO","CARABAYA",null,"ANCASH HUARI SAN PEDRO DE CHANA",{"$f":"IF(AND(ING!$D$21=J165,ING!$V$21=K165),I164+1,0)","v":0},"ANCASH","HUARI","SAN PEDRO DE CHANA","021015",null,0,"LORETO","304. EDUCACION REQUENA","UGEL REQUENA"]
[null,null,null,{"$f":"IF(ING!$D$21=E166,D165+1,0)","v":0},"PUNO","CHUCUITO",null,"ANCASH HUARI UCO",{"$f":"IF(AND(ING!$D$21=J166,ING!$V$21=K166),I165+1,0)","v":0},"ANCASH","HUARI","UCO","021016",null,0,"LORETO","302. EDUCACION CONTAMANA","UGEL UCAYALI-CONTAMANA"]
[null,null,null,{"$f":"IF(ING!$D$21=E167,D166+1,0)","v":0},"PUNO","EL COLLAO",null,"ANCASH HUARMEY COCHAPETI",{"$f":"IF(AND(ING!$D$21=J167,ING!$V$21=K167),I166+1,0)","v":0},"ANCASH","HUARMEY","COCHAPETI","021102",null,0,"MADRE DE DIOS","300. EDUCACION MADRE DE DIOS","UGEL MANU"]
[null,null,null,{"$f":"IF(ING!$D$21=E168,D167+1,0)","v":0},"PUNO","HUANCANE",null,"ANCASH HUARMEY CULEBRAS",{"$f":"IF(AND(ING!$D$21=J168,ING!$V$21=K168),I167+1,0)","v":0},"ANCASH","HUARMEY","CULEBRAS","021103",null,0,"MADRE DE DIOS","300. EDUCACION MADRE DE DIOS","UGEL TAHUAMANU"]
[null,null,null,{"$f":"IF(ING!$D$21=E169,D168+1,0)","v":0},"PUNO","LAMPA",null,"ANCASH HUARMEY HUARMEY",{"$f":"IF(AND(ING!$D$21=J169,ING!$V$21=K169),I168+1,0)","v":0},"ANCASH","HUARMEY","HUARMEY","021101",null,0,"MADRE DE DIOS","300. EDUCACION MADRE DE DIOS","UGEL TAMBOPATA"]
[null,null,null,{"$f":"IF(ING!$D$21=E170,D169+1,0)","v":0},"PUNO","MELGAR",null,"ANCASH HUARMEY HUAYAN",{"$f":"IF(AND(ING!$D$21=J170,ING!$V$21=K170),I169+1,0)","v":0},"ANCASH","HUARMEY","HUAYAN","021104",null,0,"MOQUEGUA","303. EDUCACION SANCHEZ CERRO","UGEL GENERAL SANCHEZ CERRO"]
[null,null,null,{"$f":"IF(ING!$D$21=E171,D170+1,0)","v":0},"PUNO","MOHO",null,"ANCASH HUARMEY MALVAS",{"$f":"IF(AND(ING!$D$21=J171,ING!$V$21=K171),I170+1,0)","v":0},"ANCASH","HUARMEY","MALVAS","021105",null,0,"MOQUEGUA","301. EDUCACION ILO","UGEL ILO"]
[null,null,null,{"$f":"IF(ING!$D$21=E172,D171+1,0)","v":0},"PUNO","PUNO",null,"ANCASH HUAYLAS CARAZ",{"$f":"IF(AND(ING!$D$21=J172,ING!$V$21=K172),I171+1,0)","v":0},"ANCASH","HUAYLAS","CARAZ","021201",null,0,"MOQUEGUA","302. EDUCACION MARISCAL NIETO","UGEL MARISCAL NIETO"]
[null,null,null,{"$f":"IF(ING!$D$21=E173,D172+1,0)","v":0},"PUNO","SAN ANTONIO DE PUTINA",null,"ANCASH HUAYLAS HUALLANCA",{"$f":"IF(AND(ING!$D$21=J173,ING!$V$21=K173),I172+1,0)","v":0},"ANCASH","HUAYLAS","HUALLANCA","021202",null,0,"PASCO","302. EDUCACION DANIEL A. CARRION","UGEL DANIEL ALCIDES CARRION"]
[null,null,null,{"$f":"IF(ING!$D$21=E174,D173+1,0)","v":0},"PUNO","SAN ROMAN",null,"ANCASH HUAYLAS HUATA",{"$f":"IF(AND(ING!$D$21=J174,ING!$V$21=K174),I173+1,0)","v":0},"ANCASH","HUAYLAS","HUATA","021203",null,0,"PASCO","301. EDUCACION OXAPAMPA","UGEL OXAPAMPA"]
[null,null,null,{"$f":"IF(ING!$D$21=E175,D174+1,0)","v":0},"PUNO","SANDIA",null,"ANCASH HUAYLAS HUAYLAS",{"$f":"IF(AND(ING!$D$21=J175,ING!$V$21=K175),I174+1,0)","v":0},"ANCASH","HUAYLAS","HUAYLAS","021204",null,0,"PASCO","303. UGEL PASCO","UGEL PASCO"]
[null,null,null,{"$f":"IF(ING!$D$21=E176,D175+1,0)","v":0},"PUNO","YUNGUYO",null,"ANCASH HUAYLAS MATO",{"$f":"IF(AND(ING!$D$21=J176,ING!$V$21=K176),I175+1,0)","v":0},"ANCASH","HUAYLAS","MATO","021205",null,0,"PIURA","308. EDUCACION UGEL AYABACA","UGEL AYABACA"]
[null,null,null,{"$f":"IF(ING!$D$21=E177,D176+1,0)","v":0},"SAN MARTÍN","BELLAVISTA",null,"ANCASH HUAYLAS PAMPAROMAS",{"$f":"IF(AND(ING!$D$21=J177,ING!$V$21=K177),I176+1,0)","v":0},"ANCASH","HUAYLAS","PAMPAROMAS","021206",null,0,"PIURA","303. EDUCACION ALTO PIURA","UGEL CHULUCANAS"]
[null,null,null,{"$f":"IF(ING!$D$21=E178,D177+1,0)","v":0},"SAN MARTÍN","EL DORADO",null,"ANCASH HUAYLAS PUEBLO LIBRE",{"$f":"IF(AND(ING!$D$21=J178,ING!$V$21=K178),I177+1,0)","v":0},"ANCASH","HUAYLAS","PUEBLO LIBRE","021207",null,0,"PIURA","309. UNIDAD DE GESTION EDUCATIVA LOCAL HUANCABAMBA","UGEL HUANCABAMBA"]
[null,null,null,{"$f":"IF(ING!$D$21=E179,D178+1,0)","v":0},"SAN MARTÍN","HUALLAGA",null,"ANCASH HUAYLAS SANTA CRUZ",{"$f":"IF(AND(ING!$D$21=J179,ING!$V$21=K179),I178+1,0)","v":0},"ANCASH","HUAYLAS","SANTA CRUZ","021208",null,0,"PIURA","310. UNIDAD DE GESTION EDUCATIVA LOCAL HUARMACA","UGEL HUARMACA"]
[null,null,null,{"$f":"IF(ING!$D$21=E180,D179+1,0)","v":0},"SAN MARTÍN","LAMAS",null,"ANCASH HUAYLAS SANTO TORIBIO",{"$f":"IF(AND(ING!$D$21=J180,ING!$V$21=K180),I179+1,0)","v":0},"ANCASH","HUAYLAS","SANTO TORIBIO","021209",null,0,"PIURA","300. EDUCACION PIURA","UGEL LA UNION"]
[null,null,null,{"$f":"IF(ING!$D$21=E181,D180+1,0)","v":0},"SAN MARTÍN","MARISCAL CACERES",null,"ANCASH HUAYLAS YURACMARCA",{"$f":"IF(AND(ING!$D$21=J181,ING!$V$21=K181),I180+1,0)","v":0},"ANCASH","HUAYLAS","YURACMARCA","021210",null,0,"PIURA","307. EDUCACION UGEL MORROPON","UGEL MORROPON"]
[null,null,null,{"$f":"IF(ING!$D$21=E182,D181+1,0)","v":0},"SAN MARTÍN","MOYOBAMBA",null,"ANCASH MARISCAL LUZURIAGA CASCA",{"$f":"IF(AND(ING!$D$21=J182,ING!$V$21=K182),I181+1,0)","v":0},"ANCASH","MARISCAL LUZURIAGA","CASCA","021302",null,0,"PIURA","305. EDUCACION UGEL DE PAITA","UGEL PAITA"]
[null,null,null,{"$f":"IF(ING!$D$21=E183,D182+1,0)","v":0},"SAN MARTÍN","PICOTA",null,"ANCASH MARISCAL LUZURIAGA ELEAZAR GUZMAN BARRON",{"$f":"IF(AND(ING!$D$21=J183,ING!$V$21=K183),I182+1,0)","v":0},"ANCASH","MARISCAL LUZURIAGA","ELEAZAR GUZMAN BARRON","021303",null,0,"PIURA","300. EDUCACION PIURA","UGEL PIURA"]
[null,null,null,{"$f":"IF(ING!$D$21=E184,D183+1,0)","v":0},"SAN MARTÍN","RIOJA",null,"ANCASH MARISCAL LUZURIAGA FIDEL OLIVAS ESCUDERO",{"$f":"IF(AND(ING!$D$21=J184,ING!$V$21=K184),I183+1,0)","v":0},"ANCASH","MARISCAL LUZURIAGA","FIDEL OLIVAS ESCUDERO","021304",null,0,"PIURA","300. EDUCACION PIURA","UGEL SECHURA"]
[null,null,null,{"$f":"IF(ING!$D$21=E185,D184+1,0)","v":0},"SAN MARTÍN","SAN MARTIN",null,"ANCASH MARISCAL LUZURIAGA LLAMA",{"$f":"IF(AND(ING!$D$21=J185,ING!$V$21=K185),I184+1,0)","v":0},"ANCASH","MARISCAL LUZURIAGA","LLAMA","021305",null,0,"PIURA","302. EDUCACION LUCIANO CASTILLO COLONNA","UGEL SULLANA"]
[null,null,null,{"$f":"IF(ING!$D$21=E186,D185+1,0)","v":0},"SAN MARTÍN","TOCACHE",null,"ANCASH MARISCAL LUZURIAGA LLUMPA",{"$f":"IF(AND(ING!$D$21=J186,ING!$V$21=K186),I185+1,0)","v":0},"ANCASH","MARISCAL LUZURIAGA","LLUMPA","021306",null,0,"PIURA","306. EDUCACION UGEL DE TALARA","UGEL TALARA"]
[null,null,null,{"$f":"IF(ING!$D$21=E187,D186+1,0)","v":0},"TACNA","CANDARAVE",null,"ANCASH MARISCAL LUZURIAGA LUCMA",{"$f":"IF(AND(ING!$D$21=J187,ING!$V$21=K187),I186+1,0)","v":0},"ANCASH","MARISCAL LUZURIAGA","LUCMA","021307",null,0,"PIURA","300. EDUCACION PIURA","UGEL TAMBOGRANDE"]
[null,null,null,{"$f":"IF(ING!$D$21=E188,D187+1,0)","v":0},"TACNA","JORGE BASADRE",null,"ANCASH MARISCAL LUZURIAGA MUSGA",{"$f":"IF(AND(ING!$D$21=J188,ING!$V$21=K188),I187+1,0)","v":0},"ANCASH","MARISCAL LUZURIAGA","MUSGA","021308",null,0,"PUNO","303. EDUCACION AZANGARO","UGEL AZANGARO"]
[null,null,null,{"$f":"IF(ING!$D$21=E189,D188+1,0)","v":0},"TACNA","TACNA",null,"ANCASH MARISCAL LUZURIAGA PISCOBAMBA",{"$f":"IF(AND(ING!$D$21=J189,ING!$V$21=K189),I188+1,0)","v":0},"ANCASH","MARISCAL LUZURIAGA","PISCOBAMBA","021301",null,0,"PUNO","309. EDUCACION CARABAYA MACUSANI","UGEL CARABAYA"]
[null,null,null,{"$f":"IF(ING!$D$21=E190,D189+1,0)","v":0},"TACNA","TARATA",null,"ANCASH OCROS ACAS",{"$f":"IF(AND(ING!$D$21=J190,ING!$V$21=K190),I189+1,0)","v":0},"ANCASH","OCROS","ACAS","021402",null,0,"PUNO","307. EDUCACION CHUCUITO JULI","UGEL CHUCUITO"]
[null,null,null,{"$f":"IF(ING!$D$21=E191,D190+1,0)","v":0},"TUMBES","CONTRALMIRANTE VILLAR",null,"ANCASH OCROS CAJAMARQUILLA",{"$f":"IF(AND(ING!$D$21=J191,ING!$V$21=K191),I190+1,0)","v":0},"ANCASH","OCROS","CAJAMARQUILLA","021403",null,0,"PUNO","314. EDUCACION CRUCERO","UGEL CRUCERO"]
[null,null,null,{"$f":"IF(ING!$D$21=E192,D191+1,0)","v":0},"TUMBES","TUMBES",null,"ANCASH OCROS CARHUAPAMPA",{"$f":"IF(AND(ING!$D$21=J192,ING!$V$21=K192),I191+1,0)","v":0},"ANCASH","OCROS","CARHUAPAMPA","021404",null,0,"PUNO","306. EDUCACION COLLAO","UGEL EL COLLAO"]
[null,null,null,{"$f":"IF(ING!$D$21=E193,D192+1,0)","v":0},"TUMBES","ZARUMILLA",null,"ANCASH OCROS COCHAS",{"$f":"IF(AND(ING!$D$21=J193,ING!$V$21=K193),I192+1,0)","v":0},"ANCASH","OCROS","COCHAS","021405",null,0,"PUNO","304. EDUCACION HUANCANE","UGEL HUANCANE"]
[null,null,null,{"$f":"IF(ING!$D$21=E194,D193+1,0)","v":0},"UCAYALI","ATALAYA",null,"ANCASH OCROS CONGAS",{"$f":"IF(AND(ING!$D$21=J194,ING!$V$21=K194),I193+1,0)","v":0},"ANCASH","OCROS","CONGAS","021406",null,0,"PUNO","312. EDUCACION LAMPA","UGEL LAMPA"]
[null,null,null,{"$f":"IF(ING!$D$21=E195,D194+1,0)","v":0},"UCAYALI","CORONEL PORTILLO",null,{"$f":"J195&\" \"&K195&\" \"&L195","v":"ANCASH OCROS LLIPA"},{"$f":"IF(AND(ING!$D$21=J195,ING!$V$21=K195),I194+1,0)","v":0},"ANCASH","OCROS","LLIPA","021407",null,{"$f":"IF($T$1=P195,O194+1,0)","v":0},"PUNO","302. EDUCACION MELGAR","UGEL MELGAR"]
[null,null,null,{"$f":"IF(ING!$D$21=E196,D195+1,0)","v":0},"UCAYALI","PADRE ABAD",null,"ANCASH OCROS OCROS",{"$f":"IF(AND(ING!$D$21=J196,ING!$V$21=K196),I195+1,0)","v":0},"ANCASH","OCROS","OCROS","021401",null,0,"PUNO","313. EDUCACION MOHO","UGEL MOHO"]
[null,null,null,{"$f":"IF(ING!$D$21=E197,D196+1,0)","v":0},"UCAYALI","PURUS",null,"ANCASH OCROS SAN CRISTOBAL DE RAJAN",{"$f":"IF(AND(ING!$D$21=J197,ING!$V$21=K197),I196+1,0)","v":0},"ANCASH","OCROS","SAN CRISTOBAL DE RAJAN","021408",null,0,"PUNO","311. UGEL PUNO","UGEL PUNO"]
[null,null,null,null,null,null,null,"ANCASH OCROS SAN PEDRO",{"$f":"IF(AND(ING!$D$21=J198,ING!$V$21=K198),I197+1,0)","v":0},"ANCASH","OCROS","SAN PEDRO","021409",null,0,"PUNO","305. EDUCACION PUTINA","UGEL SAN ANTONIO DE PUTINA"]
[null,null,null,null,null,null,null,"ANCASH OCROS SANTIAGO DE CHILCAS",{"$f":"IF(AND(ING!$D$21=J199,ING!$V$21=K199),I198+1,0)","v":0},"ANCASH","OCROS","SANTIAGO DE CHILCAS","021410",null,0,"PUNO","301. EDUCACION SAN ROMAN","UGEL SAN ROMAN"]
[null,null,null,null,null,null,null,"ANCASH PALLASCA BOLOGNESI",{"$f":"IF(AND(ING!$D$21=J200,ING!$V$21=K200),I199+1,0)","v":0},"ANCASH","PALLASCA","BOLOGNESI","021502",null,0,"PUNO","310. EDUCACION SANDIA","UGEL SANDIA"]
[null,null,null,null,null,null,null,"ANCASH PALLASCA CABANA",{"$f":"IF(AND(ING!$D$21=J201,ING!$V$21=K201),I200+1,0)","v":0},"ANCASH","PALLASCA","CABANA","021501",null,0,"PUNO","308. EDUCACION YUNGUYO","UGEL YUNGUYO"]
[null,null,null,null,null,null,null,"ANCASH PALLASCA CONCHUCOS",{"$f":"IF(AND(ING!$D$21=J202,ING!$V$21=K202),I201+1,0)","v":0},"ANCASH","PALLASCA","CONCHUCOS","021503",null,0,"SAN MARTIN","307. EDUCACION BELLAVISTA","UGEL BELLAVISTA"]
[null,null,null,null,null,null,null,"ANCASH PALLASCA HUACASCHUQUE",{"$f":"IF(AND(ING!$D$21=J203,ING!$V$21=K203),I202+1,0)","v":0},"ANCASH","PALLASCA","HUACASCHUQUE","021504",null,0,"SAN MARTIN","301. EDUCACION BAJO MAYO","UGEL EL DORADO"]
[null,null,null,null,null,null,null,"ANCASH PALLASCA HUANDOVAL",{"$f":"IF(AND(ING!$D$21=J204,ING!$V$21=K204),I203+1,0)","v":0},"ANCASH","PALLASCA","HUANDOVAL","021505",null,0,"SAN MARTIN","302. EDUCACION HUALLAGA CENTRAL","UGEL HUALLAGA"]
[null,null,null,null,null,null,null,"ANCASH PALLASCA LACABAMBA",{"$f":"IF(AND(ING!$D$21=J205,ING!$V$21=K205),I204+1,0)","v":0},"ANCASH","PALLASCA","LACABAMBA","021506",null,0,"SAN MARTIN","305. EDUCACION LAMAS","UGEL LAMAS"]
[null,null,null,null,null,null,null,"ANCASH PALLASCA LLAPO",{"$f":"IF(AND(ING!$D$21=J206,ING!$V$21=K206),I205+1,0)","v":0},"ANCASH","PALLASCA","LLAPO","021507",null,0,"SAN MARTIN","302. EDUCACION HUALLAGA CENTRAL","UGEL MARISCAL CACERES"]
[null,null,null,null,null,null,null,"ANCASH PALLASCA PALLASCA",{"$f":"IF(AND(ING!$D$21=J207,ING!$V$21=K207),I206+1,0)","v":0},"ANCASH","PALLASCA","PALLASCA","021508",null,0,"SAN MARTIN","300. EDUCACION SAN MARTIN","UGEL MOYOBAMBA"]
[null,null,null,null,null,null,null,"ANCASH PALLASCA PAMPAS",{"$f":"IF(AND(ING!$D$21=J208,ING!$V$21=K208),I207+1,0)","v":0},"ANCASH","PALLASCA","PAMPAS","021509",null,0,"SAN MARTIN","301. EDUCACION BAJO MAYO","UGEL PICOTA"]
[null,null,null,null,null,null,null,"ANCASH PALLASCA SANTA ROSA",{"$f":"IF(AND(ING!$D$21=J209,ING!$V$21=K209),I208+1,0)","v":0},"ANCASH","PALLASCA","SANTA ROSA","021510",null,0,"SAN MARTIN","306. EDUCACION RIOJA","UGEL RIOJA"]
[null,null,null,null,null,null,null,"ANCASH PALLASCA TAUCA",{"$f":"IF(AND(ING!$D$21=J210,ING!$V$21=K210),I209+1,0)","v":0},"ANCASH","PALLASCA","TAUCA","021511",null,0,"SAN MARTIN","301. EDUCACION BAJO MAYO","UGEL SAN MARTIN"]
[null,null,null,null,null,null,null,"ANCASH POMABAMBA HUAYLLAN",{"$f":"IF(AND(ING!$D$21=J211,ING!$V$21=K211),I210+1,0)","v":0},"ANCASH","POMABAMBA","HUAYLLAN","021602",null,0,"SAN MARTIN","303. EDUCACION ALTO HUALLAGA","UGEL TOCACHE"]
[null,null,null,null,null,null,null,"ANCASH POMABAMBA PAROBAMBA",{"$f":"IF(AND(ING!$D$21=J212,ING!$V$21=K212),I211+1,0)","v":0},"ANCASH","POMABAMBA","PAROBAMBA","021603",null,0,"TACNA","300. EDUCACION TACNA","UGEL CANDARAVE"]
[null,null,null,null,null,null,null,"ANCASH POMABAMBA POMABAMBA",{"$f":"IF(AND(ING!$D$21=J213,ING!$V$21=K213),I212+1,0)","v":0},"ANCASH","POMABAMBA","POMABAMBA","021601",null,0,"TACNA","300. EDUCACION TACNA","UGEL JORGE BASADRE"]
[null,null,null,null,null,null,null,"ANCASH POMABAMBA QUINUABAMBA",{"$f":"IF(AND(ING!$D$21=J214,ING!$V$21=K214),I213+1,0)","v":0},"ANCASH","POMABAMBA","QUINUABAMBA","021604",null,0,"TACNA","301. UGEL TACNA","UGEL TACNA"]
[null,null,null,null,null,null,null,"ANCASH RECUAY CATAC",{"$f":"IF(AND(ING!$D$21=J215,ING!$V$21=K215),I214+1,0)","v":0},"ANCASH","RECUAY","CATAC","021702",null,0,"TACNA","300. EDUCACION TACNA","UGEL TARATA"]
[null,null,null,null,null,null,null,"ANCASH RECUAY COTAPARACO",{"$f":"IF(AND(ING!$D$21=J216,ING!$V$21=K216),I215+1,0)","v":0},"ANCASH","RECUAY","COTAPARACO","021703",null,0,"TUMBES","302. EDUCACION UGEL CONTRALMIRANTE VILLAR ZORRITOS","UGEL CONTRALMIRANTE VILLAR"]
[null,null,null,null,null,null,null,"ANCASH RECUAY HUAYLLAPAMPA",{"$f":"IF(AND(ING!$D$21=J217,ING!$V$21=K217),I216+1,0)","v":0},"ANCASH","RECUAY","HUAYLLAPAMPA","021704",null,0,"TUMBES","301. EDUCACION UGEL TUMBES","UGEL TUMBES"]
[null,null,null,null,null,null,null,"ANCASH RECUAY LLACLLIN",{"$f":"IF(AND(ING!$D$21=J218,ING!$V$21=K218),I217+1,0)","v":0},"ANCASH","RECUAY","LLACLLIN","021705",null,0,"TUMBES","303. EDUCACION UGEL ZARUMILLA","UGEL ZARUMILLA"]
[null,null,null,null,null,null,null,"ANCASH RECUAY MARCA",{"$f":"IF(AND(ING!$D$21=J219,ING!$V$21=K219),I218+1,0)","v":0},"ANCASH","RECUAY","MARCA","021706",null,0,"UCAYALI","302. EDUCACION ATALAYA","UGEL ATALAYA"]
[null,null,null,null,null,null,null,"ANCASH RECUAY PAMPAS CHICO",{"$f":"IF(AND(ING!$D$21=J220,ING!$V$21=K220),I219+1,0)","v":0},"ANCASH","RECUAY","PAMPAS CHICO","021707",null,0,"UCAYALI","303. EDUCACION CORONEL PORTILLO","UGEL CORONEL PORTILLO"]
[null,null,null,null,null,null,null,"ANCASH RECUAY PARARIN",{"$f":"IF(AND(ING!$D$21=J221,ING!$V$21=K221),I220+1,0)","v":0},"ANCASH","RECUAY","PARARIN","021708",null,0,"UCAYALI","304. EDUCACION PADRE ABAD","UGEL PADRE ABAD"]
[null,null,null,null,null,null,null,"ANCASH RECUAY RECUAY",{"$f":"IF(AND(ING!$D$21=J222,ING!$V$21=K222),I221+1,0)","v":0},"ANCASH","RECUAY","RECUAY","021701",null,0,"UCAYALI","301. EDUCACION PURUS","UGEL PURUS"]
[null,null,null,null,null,null,null,"ANCASH RECUAY TAPACOCHA",{"$f":"IF(AND(ING!$D$21=J223,ING!$V$21=K223),I222+1,0)","v":0},"ANCASH","RECUAY","TAPACOCHA","021709"]
[null,null,null,null,null,null,null,"ANCASH RECUAY TICAPAMPA",{"$f":"IF(AND(ING!$D$21=J224,ING!$V$21=K224),I223+1,0)","v":0},"ANCASH","RECUAY","TICAPAMPA","021710"]
[null,null,null,null,null,null,null,"ANCASH SANTA CACERES DEL PERU",{"$f":"IF(AND(ING!$D$21=J225,ING!$V$21=K225),I224+1,0)","v":0},"ANCASH","SANTA","CACERES DEL PERU","021802"]
[null,null,null,null,null,null,null,"ANCASH SANTA CHIMBOTE",{"$f":"IF(AND(ING!$D$21=J226,ING!$V$21=K226),I225+1,0)","v":0},"ANCASH","SANTA","CHIMBOTE","021801"]
[null,null,null,null,null,null,null,"ANCASH SANTA COISHCO",{"$f":"IF(AND(ING!$D$21=J227,ING!$V$21=K227),I226+1,0)","v":0},"ANCASH","SANTA","COISHCO","021803"]
[null,null,null,null,null,null,null,"ANCASH SANTA MACATE",{"$f":"IF(AND(ING!$D$21=J228,ING!$V$21=K228),I227+1,0)","v":0},"ANCASH","SANTA","MACATE","021804"]
[null,null,null,null,null,null,null,"ANCASH SANTA MORO",{"$f":"IF(AND(ING!$D$21=J229,ING!$V$21=K229),I228+1,0)","v":0},"ANCASH","SANTA","MORO","021805"]
[null,null,null,null,null,null,null,"ANCASH SANTA NEPEÑA",{"$f":"IF(AND(ING!$D$21=J230,ING!$V$21=K230),I229+1,0)","v":0},"ANCASH","SANTA","NEPEÑA","021806"]
[null,null,null,null,null,null,null,"ANCASH SANTA NUEVO CHIMBOTE",{"$f":"IF(AND(ING!$D$21=J231,ING!$V$21=K231),I230+1,0)","v":0},"ANCASH","SANTA","NUEVO CHIMBOTE","021809"]
[null,null,null,null,null,null,null,"ANCASH SANTA SAMANCO",{"$f":"IF(AND(ING!$D$21=J232,ING!$V$21=K232),I231+1,0)","v":0},"ANCASH","SANTA","SAMANCO","021807"]
[null,null,null,null,null,null,null,"ANCASH SANTA SANTA",{"$f":"IF(AND(ING!$D$21=J233,ING!$V$21=K233),I232+1,0)","v":0},"ANCASH","SANTA","SANTA","021808"]
[null,null,null,null,null,null,null,"ANCASH SIHUAS ACOBAMBA",{"$f":"IF(AND(ING!$D$21=J234,ING!$V$21=K234),I233+1,0)","v":0},"ANCASH","SIHUAS","ACOBAMBA","021902"]
[null,null,null,null,null,null,null,"ANCASH SIHUAS ALFONSO UGARTE",{"$f":"IF(AND(ING!$D$21=J235,ING!$V$21=K235),I234+1,0)","v":0},"ANCASH","SIHUAS","ALFONSO UGARTE","021903"]
[null,null,null,null,null,null,null,"ANCASH SIHUAS CASHAPAMPA",{"$f":"IF(AND(ING!$D$21=J236,ING!$V$21=K236),I235+1,0)","v":0},"ANCASH","SIHUAS","CASHAPAMPA","021904"]
[null,null,null,null,null,null,null,"ANCASH SIHUAS CHINGALPO",{"$f":"IF(AND(ING!$D$21=J237,ING!$V$21=K237),I236+1,0)","v":0},"ANCASH","SIHUAS","CHINGALPO","021905"]
[null,null,null,null,null,null,null,"ANCASH SIHUAS HUAYLLABAMBA",{"$f":"IF(AND(ING!$D$21=J238,ING!$V$21=K238),I237+1,0)","v":0},"ANCASH","SIHUAS","HUAYLLABAMBA","021906"]
[null,null,null,null,null,null,null,"ANCASH SIHUAS QUICHES",{"$f":"IF(AND(ING!$D$21=J239,ING!$V$21=K239),I238+1,0)","v":0},"ANCASH","SIHUAS","QUICHES","021907"]
[null,null,null,null,null,null,null,"ANCASH SIHUAS RAGASH",{"$f":"IF(AND(ING!$D$21=J240,ING!$V$21=K240),I239+1,0)","v":0},"ANCASH","SIHUAS","RAGASH","021908"]
[null,null,null,null,null,null,null,"ANCASH SIHUAS SAN JUAN",{"$f":"IF(AND(ING!$D$21=J241,ING!$V$21=K241),I240+1,0)","v":0},"ANCASH","SIHUAS","SAN JUAN","021909"]
[null,null,null,null,null,null,null,"ANCASH SIHUAS SICSIBAMBA",{"$f":"IF(AND(ING!$D$21=J242,ING!$V$21=K242),I241+1,0)","v":0},"ANCASH","SIHUAS","SICSIBAMBA","021910"]
[null,null,null,null,null,null,null,"ANCASH SIHUAS SIHUAS",{"$f":"IF(AND(ING!$D$21=J243,ING!$V$21=K243),I242+1,0)","v":0},"ANCASH","SIHUAS","SIHUAS","021901"]
[null,null,null,null,null,null,null,"ANCASH YUNGAY CASCAPARA",{"$f":"IF(AND(ING!$D$21=J244,ING!$V$21=K244),I243+1,0)","v":0},"ANCASH","YUNGAY","CASCAPARA","022002"]
[null,null,null,null,null,null,null,"ANCASH YUNGAY MANCOS",{"$f":"IF(AND(ING!$D$21=J245,ING!$V$21=K245),I244+1,0)","v":0},"ANCASH","YUNGAY","MANCOS","022003"]
[null,null,null,null,null,null,null,"ANCASH YUNGAY MATACOTO",{"$f":"IF(AND(ING!$D$21=J246,ING!$V$21=K246),I245+1,0)","v":0},"ANCASH","YUNGAY","MATACOTO","022004"]
[null,null,null,null,null,null,null,"ANCASH YUNGAY QUILLO",{"$f":"IF(AND(ING!$D$21=J247,ING!$V$21=K247),I246+1,0)","v":0},"ANCASH","YUNGAY","QUILLO","022005"]
[null,null,null,null,null,null,null,"ANCASH YUNGAY RANRAHIRCA",{"$f":"IF(AND(ING!$D$21=J248,ING!$V$21=K248),I247+1,0)","v":0},"ANCASH","YUNGAY","RANRAHIRCA","022006"]
[null,null,null,null,null,null,null,"ANCASH YUNGAY SHUPLUY",{"$f":"IF(AND(ING!$D$21=J249,ING!$V$21=K249),I248+1,0)","v":0},"ANCASH","YUNGAY","SHUPLUY","022007"]
[null,null,null,null,null,null,null,"ANCASH YUNGAY YANAMA",{"$f":"IF(AND(ING!$D$21=J250,ING!$V$21=K250),I249+1,0)","v":0},"ANCASH","YUNGAY","YANAMA","022008"]
[null,null,null,null,null,null,null,"ANCASH YUNGAY YUNGAY",{"$f":"IF(AND(ING!$D$21=J251,ING!$V$21=K251),I250+1,0)","v":0},"ANCASH","YUNGAY","YUNGAY","022001"]
[null,null,null,null,null,null,null,"APURÍMAC ABANCAY ABANCAY",{"$f":"IF(AND(ING!$D$21=J252,ING!$V$21=K252),I251+1,0)","v":0},"APURÍMAC","ABANCAY","ABANCAY","030101"]
[null,null,null,null,null,null,null,"APURÍMAC ABANCAY CHACOCHE",{"$f":"IF(AND(ING!$D$21=J253,ING!$V$21=K253),I252+1,0)","v":0},"APURÍMAC","ABANCAY","CHACOCHE","030102"]
[null,null,null,null,null,null,null,"APURÍMAC ABANCAY CIRCA",{"$f":"IF(AND(ING!$D$21=J254,ING!$V$21=K254),I253+1,0)","v":0},"APURÍMAC","ABANCAY","CIRCA","030103"]
[null,null,null,null,null,null,null,"APURÍMAC ABANCAY CURAHUASI",{"$f":"IF(AND(ING!$D$21=J255,ING!$V$21=K255),I254+1,0)","v":0},"APURÍMAC","ABANCAY","CURAHUASI","030104"]
[null,null,null,null,null,null,null,"APURÍMAC ABANCAY HUANIPACA",{"$f":"IF(AND(ING!$D$21=J256,ING!$V$21=K256),I255+1,0)","v":0},"APURÍMAC","ABANCAY","HUANIPACA","030105"]
[null,null,null,null,null,null,null,"APURÍMAC ABANCAY LAMBRAMA",{"$f":"IF(AND(ING!$D$21=J257,ING!$V$21=K257),I256+1,0)","v":0},"APURÍMAC","ABANCAY","LAMBRAMA","030106"]
[null,null,null,null,null,null,null,"APURÍMAC ABANCAY PICHIRHUA",{"$f":"IF(AND(ING!$D$21=J258,ING!$V$21=K258),I257+1,0)","v":0},"APURÍMAC","ABANCAY","PICHIRHUA","030107"]
[null,null,null,null,null,null,null,{"$f":"J259&\" \"&K259&\" \"&L259","v":"APURÍMAC ABANCAY SAN PEDRO DE CACHORA"},{"$f":"IF(AND(ING!$D$21=J259,ING!$V$21=K259),I258+1,0)","v":0},"APURÍMAC","ABANCAY","SAN PEDRO DE CACHORA","030108"]
[null,null,null,null,null,null,null,"APURÍMAC ABANCAY TAMBURCO",{"$f":"IF(AND(ING!$D$21=J260,ING!$V$21=K260),I259+1,0)","v":0},"APURÍMAC","ABANCAY","TAMBURCO","030109"]
[null,null,null,null,null,null,null,"APURÍMAC ANDAHUAYLAS ANDAHUAYLAS",{"$f":"IF(AND(ING!$D$21=J261,ING!$V$21=K261),I260+1,0)","v":0},"APURÍMAC","ANDAHUAYLAS","ANDAHUAYLAS","030201"]
[null,null,null,null,null,null,null,"APURÍMAC ANDAHUAYLAS ANDARAPA",{"$f":"IF(AND(ING!$D$21=J262,ING!$V$21=K262),I261+1,0)","v":0},"APURÍMAC","ANDAHUAYLAS","ANDARAPA","030202"]
[null,null,null,null,null,null,null,"APURÍMAC ANDAHUAYLAS CHIARA",{"$f":"IF(AND(ING!$D$21=J263,ING!$V$21=K263),I262+1,0)","v":0},"APURÍMAC","ANDAHUAYLAS","CHIARA","030203"]
[null,null,null,null,null,null,null,"APURÍMAC ANDAHUAYLAS HUANCARAMA",{"$f":"IF(AND(ING!$D$21=J264,ING!$V$21=K264),I263+1,0)","v":0},"APURÍMAC","ANDAHUAYLAS","HUANCARAMA","030204"]
[null,null,null,null,null,null,null,"APURÍMAC ANDAHUAYLAS HUANCARAY",{"$f":"IF(AND(ING!$D$21=J265,ING!$V$21=K265),I264+1,0)","v":0},"APURÍMAC","ANDAHUAYLAS","HUANCARAY","030205"]
[null,null,null,null,null,null,null,"APURÍMAC ANDAHUAYLAS HUAYANA",{"$f":"IF(AND(ING!$D$21=J266,ING!$V$21=K266),I265+1,0)","v":0},"APURÍMAC","ANDAHUAYLAS","HUAYANA","030206"]
[null,null,null,null,null,null,null,"APURÍMAC ANDAHUAYLAS JOSE MARIA ARGUEDAS",{"$f":"IF(AND(ING!$D$21=J267,ING!$V$21=K267),I266+1,0)","v":0},"APURÍMAC","ANDAHUAYLAS","JOSE MARIA ARGUEDAS","030220"]
[null,null,null,null,null,null,null,"APURÍMAC ANDAHUAYLAS KAQUIABAMBA",{"$f":"IF(AND(ING!$D$21=J268,ING!$V$21=K268),I267+1,0)","v":0},"APURÍMAC","ANDAHUAYLAS","KAQUIABAMBA","030219"]
[null,null,null,null,null,null,null,"APURÍMAC ANDAHUAYLAS KISHUARA",{"$f":"IF(AND(ING!$D$21=J269,ING!$V$21=K269),I268+1,0)","v":0},"APURÍMAC","ANDAHUAYLAS","KISHUARA","030207"]
[null,null,null,null,null,null,null,"APURÍMAC ANDAHUAYLAS PACOBAMBA",{"$f":"IF(AND(ING!$D$21=J270,ING!$V$21=K270),I269+1,0)","v":0},"APURÍMAC","ANDAHUAYLAS","PACOBAMBA","030208"]
[null,null,null,null,null,null,null,"APURÍMAC ANDAHUAYLAS PACUCHA",{"$f":"IF(AND(ING!$D$21=J271,ING!$V$21=K271),I270+1,0)","v":0},"APURÍMAC","ANDAHUAYLAS","PACUCHA","030209"]
[null,null,null,null,null,null,null,"APURÍMAC ANDAHUAYLAS PAMPACHIRI",{"$f":"IF(AND(ING!$D$21=J272,ING!$V$21=K272),I271+1,0)","v":0},"APURÍMAC","ANDAHUAYLAS","PAMPACHIRI","030210"]
[null,null,null,null,null,null,null,"APURÍMAC ANDAHUAYLAS POMACOCHA",{"$f":"IF(AND(ING!$D$21=J273,ING!$V$21=K273),I272+1,0)","v":0},"APURÍMAC","ANDAHUAYLAS","POMACOCHA","030211"]
[null,null,null,null,null,null,null,"APURÍMAC ANDAHUAYLAS SAN ANTONIO DE CACHI",{"$f":"IF(AND(ING!$D$21=J274,ING!$V$21=K274),I273+1,0)","v":0},"APURÍMAC","ANDAHUAYLAS","SAN ANTONIO DE CACHI","030212"]
[null,null,null,null,null,null,null,"APURÍMAC ANDAHUAYLAS SAN JERONIMO",{"$f":"IF(AND(ING!$D$21=J275,ING!$V$21=K275),I274+1,0)","v":0},"APURÍMAC","ANDAHUAYLAS","SAN JERONIMO","030213"]
[null,null,null,null,null,null,null,"APURÍMAC ANDAHUAYLAS SAN MIGUEL DE CHACCRAMPA",{"$f":"IF(AND(ING!$D$21=J276,ING!$V$21=K276),I275+1,0)","v":0},"APURÍMAC","ANDAHUAYLAS","SAN MIGUEL DE CHACCRAMPA","030214"]
[null,null,null,null,null,null,null,"APURÍMAC ANDAHUAYLAS SANTA MARIA DE CHICMO",{"$f":"IF(AND(ING!$D$21=J277,ING!$V$21=K277),I276+1,0)","v":0},"APURÍMAC","ANDAHUAYLAS","SANTA MARIA DE CHICMO","030215"]
[null,null,null,null,null,null,null,"APURÍMAC ANDAHUAYLAS TALAVERA",{"$f":"IF(AND(ING!$D$21=J278,ING!$V$21=K278),I277+1,0)","v":0},"APURÍMAC","ANDAHUAYLAS","TALAVERA","030216"]
[null,null,null,null,null,null,null,"APURÍMAC ANDAHUAYLAS TUMAY HUARACA",{"$f":"IF(AND(ING!$D$21=J279,ING!$V$21=K279),I278+1,0)","v":0},"APURÍMAC","ANDAHUAYLAS","TUMAY HUARACA","030217"]
[null,null,null,null,null,null,null,"APURÍMAC ANDAHUAYLAS TURPO",{"$f":"IF(AND(ING!$D$21=J280,ING!$V$21=K280),I279+1,0)","v":0},"APURÍMAC","ANDAHUAYLAS","TURPO","030218"]
[null,null,null,null,null,null,null,"APURÍMAC ANTABAMBA ANTABAMBA",{"$f":"IF(AND(ING!$D$21=J281,ING!$V$21=K281),I280+1,0)","v":0},"APURÍMAC","ANTABAMBA","ANTABAMBA","030301"]
[null,null,null,null,null,null,null,"APURÍMAC ANTABAMBA EL ORO",{"$f":"IF(AND(ING!$D$21=J282,ING!$V$21=K282),I281+1,0)","v":0},"APURÍMAC","ANTABAMBA","EL ORO","030302"]
[null,null,null,null,null,null,null,"APURÍMAC ANTABAMBA HUAQUIRCA",{"$f":"IF(AND(ING!$D$21=J283,ING!$V$21=K283),I282+1,0)","v":0},"APURÍMAC","ANTABAMBA","HUAQUIRCA","030303"]
[null,null,null,null,null,null,null,"APURÍMAC ANTABAMBA JUAN ESPINOZA MEDRANO",{"$f":"IF(AND(ING!$D$21=J284,ING!$V$21=K284),I283+1,0)","v":0},"APURÍMAC","ANTABAMBA","JUAN ESPINOZA MEDRANO","030304"]
[null,null,null,null,null,null,null,"APURÍMAC ANTABAMBA OROPESA",{"$f":"IF(AND(ING!$D$21=J285,ING!$V$21=K285),I284+1,0)","v":0},"APURÍMAC","ANTABAMBA","OROPESA","030305"]
[null,null,null,null,null,null,null,"APURÍMAC ANTABAMBA PACHACONAS",{"$f":"IF(AND(ING!$D$21=J286,ING!$V$21=K286),I285+1,0)","v":0},"APURÍMAC","ANTABAMBA","PACHACONAS","030306"]
[null,null,null,null,null,null,null,"APURÍMAC ANTABAMBA SABAINO",{"$f":"IF(AND(ING!$D$21=J287,ING!$V$21=K287),I286+1,0)","v":0},"APURÍMAC","ANTABAMBA","SABAINO","030307"]
[null,null,null,null,null,null,null,"APURÍMAC AYMARAES CAPAYA",{"$f":"IF(AND(ING!$D$21=J288,ING!$V$21=K288),I287+1,0)","v":0},"APURÍMAC","AYMARAES","CAPAYA","030402"]
[null,null,null,null,null,null,null,"APURÍMAC AYMARAES CARAYBAMBA",{"$f":"IF(AND(ING!$D$21=J289,ING!$V$21=K289),I288+1,0)","v":0},"APURÍMAC","AYMARAES","CARAYBAMBA","030403"]
[null,null,null,null,null,null,null,"APURÍMAC AYMARAES CHALHUANCA",{"$f":"IF(AND(ING!$D$21=J290,ING!$V$21=K290),I289+1,0)","v":0},"APURÍMAC","AYMARAES","CHALHUANCA","030401"]
[null,null,null,null,null,null,null,"APURÍMAC AYMARAES CHAPIMARCA",{"$f":"IF(AND(ING!$D$21=J291,ING!$V$21=K291),I290+1,0)","v":0},"APURÍMAC","AYMARAES","CHAPIMARCA","030404"]
[null,null,null,null,null,null,null,"APURÍMAC AYMARAES COLCABAMBA",{"$f":"IF(AND(ING!$D$21=J292,ING!$V$21=K292),I291+1,0)","v":0},"APURÍMAC","AYMARAES","COLCABAMBA","030405"]
[null,null,null,null,null,null,null,"APURÍMAC AYMARAES COTARUSE",{"$f":"IF(AND(ING!$D$21=J293,ING!$V$21=K293),I292+1,0)","v":0},"APURÍMAC","AYMARAES","COTARUSE","030406"]
[null,null,null,null,null,null,null,"APURÍMAC AYMARAES IHUAYLLO",{"$f":"IF(AND(ING!$D$21=J294,ING!$V$21=K294),I293+1,0)","v":0},"APURÍMAC","AYMARAES","IHUAYLLO","030407"]
[null,null,null,null,null,null,null,"APURÍMAC AYMARAES JUSTO APU SAHUARAURA",{"$f":"IF(AND(ING!$D$21=J295,ING!$V$21=K295),I294+1,0)","v":0},"APURÍMAC","AYMARAES","JUSTO APU SAHUARAURA","030408"]
[null,null,null,null,null,null,null,"APURÍMAC AYMARAES LUCRE",{"$f":"IF(AND(ING!$D$21=J296,ING!$V$21=K296),I295+1,0)","v":0},"APURÍMAC","AYMARAES","LUCRE","030409"]
[null,null,null,null,null,null,null,"APURÍMAC AYMARAES POCOHUANCA",{"$f":"IF(AND(ING!$D$21=J297,ING!$V$21=K297),I296+1,0)","v":0},"APURÍMAC","AYMARAES","POCOHUANCA","030410"]
[null,null,null,null,null,null,null,"APURÍMAC AYMARAES SAN JUAN DE CHACÑA",{"$f":"IF(AND(ING!$D$21=J298,ING!$V$21=K298),I297+1,0)","v":0},"APURÍMAC","AYMARAES","SAN JUAN DE CHACÑA","030411"]
[null,null,null,null,null,null,null,"APURÍMAC AYMARAES SAÑAYCA",{"$f":"IF(AND(ING!$D$21=J299,ING!$V$21=K299),I298+1,0)","v":0},"APURÍMAC","AYMARAES","SAÑAYCA","030412"]
[null,null,null,null,null,null,null,"APURÍMAC AYMARAES SORAYA",{"$f":"IF(AND(ING!$D$21=J300,ING!$V$21=K300),I299+1,0)","v":0},"APURÍMAC","AYMARAES","SORAYA","030413"]
[null,null,null,null,null,null,null,"APURÍMAC AYMARAES TAPAIRIHUA",{"$f":"IF(AND(ING!$D$21=J301,ING!$V$21=K301),I300+1,0)","v":0},"APURÍMAC","AYMARAES","TAPAIRIHUA","030414"]
[null,null,null,null,null,null,null,"APURÍMAC AYMARAES TINTAY",{"$f":"IF(AND(ING!$D$21=J302,ING!$V$21=K302),I301+1,0)","v":0},"APURÍMAC","AYMARAES","TINTAY","030415"]
[null,null,null,null,null,null,null,"APURÍMAC AYMARAES TORAYA",{"$f":"IF(AND(ING!$D$21=J303,ING!$V$21=K303),I302+1,0)","v":0},"APURÍMAC","AYMARAES","TORAYA","030416"]
[null,null,null,null,null,null,null,"APURÍMAC AYMARAES YANACA",{"$f":"IF(AND(ING!$D$21=J304,ING!$V$21=K304),I303+1,0)","v":0},"APURÍMAC","AYMARAES","YANACA","030417"]
[null,null,null,null,null,null,null,"APURÍMAC CHINCHEROS ANCO_HUALLO",{"$f":"IF(AND(ING!$D$21=J305,ING!$V$21=K305),I304+1,0)","v":0},"APURÍMAC","CHINCHEROS","ANCO_HUALLO","030602"]
[null,null,null,null,null,null,null,"APURÍMAC CHINCHEROS CHINCHEROS",{"$f":"IF(AND(ING!$D$21=J306,ING!$V$21=K306),I305+1,0)","v":0},"APURÍMAC","CHINCHEROS","CHINCHEROS","030601"]
[null,null,null,null,null,null,null,"APURÍMAC CHINCHEROS COCHARCAS",{"$f":"IF(AND(ING!$D$21=J307,ING!$V$21=K307),I306+1,0)","v":0},"APURÍMAC","CHINCHEROS","COCHARCAS","030603"]
[null,null,null,null,null,null,null,"APURÍMAC CHINCHEROS EL PORVENIR",{"$f":"IF(AND(ING!$D$21=J308,ING!$V$21=K308),I307+1,0)","v":0},"APURÍMAC","CHINCHEROS","EL PORVENIR","030610"]
[null,null,null,null,null,null,null,"APURÍMAC CHINCHEROS HUACCANA",{"$f":"IF(AND(ING!$D$21=J309,ING!$V$21=K309),I308+1,0)","v":0},"APURÍMAC","CHINCHEROS","HUACCANA","030604"]
[null,null,null,null,null,null,null,"APURÍMAC CHINCHEROS LOS CHANKAS",{"$f":"IF(AND(ING!$D$21=J310,ING!$V$21=K310),I309+1,0)","v":0},"APURÍMAC","CHINCHEROS","LOS CHANKAS","030611"]
[null,null,null,null,null,null,null,"APURÍMAC CHINCHEROS OCOBAMBA",{"$f":"IF(AND(ING!$D$21=J311,ING!$V$21=K311),I310+1,0)","v":0},"APURÍMAC","CHINCHEROS","OCOBAMBA","030605"]
[null,null,null,null,null,null,null,"APURÍMAC CHINCHEROS ONGOY",{"$f":"IF(AND(ING!$D$21=J312,ING!$V$21=K312),I311+1,0)","v":0},"APURÍMAC","CHINCHEROS","ONGOY","030606"]
[null,null,null,null,null,null,null,"APURÍMAC CHINCHEROS RANRACANCHA",{"$f":"IF(AND(ING!$D$21=J313,ING!$V$21=K313),I312+1,0)","v":0},"APURÍMAC","CHINCHEROS","RANRACANCHA","030608"]
[null,null,null,null,null,null,null,"APURÍMAC CHINCHEROS ROCCHACC",{"$f":"IF(AND(ING!$D$21=J314,ING!$V$21=K314),I313+1,0)","v":0},"APURÍMAC","CHINCHEROS","ROCCHACC","030609"]
[null,null,null,null,null,null,null,"APURÍMAC CHINCHEROS URANMARCA",{"$f":"IF(AND(ING!$D$21=J315,ING!$V$21=K315),I314+1,0)","v":0},"APURÍMAC","CHINCHEROS","URANMARCA","030607"]
[null,null,null,null,null,null,null,"APURÍMAC COTABAMBAS CHALLHUAHUACHO",{"$f":"IF(AND(ING!$D$21=J316,ING!$V$21=K316),I315+1,0)","v":0},"APURÍMAC","COTABAMBAS","CHALLHUAHUACHO","030506"]
[null,null,null,null,null,null,null,"APURÍMAC COTABAMBAS COTABAMBAS",{"$f":"IF(AND(ING!$D$21=J317,ING!$V$21=K317),I316+1,0)","v":0},"APURÍMAC","COTABAMBAS","COTABAMBAS","030502"]
[null,null,null,null,null,null,null,"APURÍMAC COTABAMBAS COYLLURQUI",{"$f":"IF(AND(ING!$D$21=J318,ING!$V$21=K318),I317+1,0)","v":0},"APURÍMAC","COTABAMBAS","COYLLURQUI","030503"]
[null,null,null,null,null,null,null,"APURÍMAC COTABAMBAS HAQUIRA",{"$f":"IF(AND(ING!$D$21=J319,ING!$V$21=K319),I318+1,0)","v":0},"APURÍMAC","COTABAMBAS","HAQUIRA","030504"]
[null,null,null,null,null,null,null,"APURÍMAC COTABAMBAS MARA",{"$f":"IF(AND(ING!$D$21=J320,ING!$V$21=K320),I319+1,0)","v":0},"APURÍMAC","COTABAMBAS","MARA","030505"]
[null,null,null,null,null,null,null,"APURÍMAC COTABAMBAS TAMBOBAMBA",{"$f":"IF(AND(ING!$D$21=J321,ING!$V$21=K321),I320+1,0)","v":0},"APURÍMAC","COTABAMBAS","TAMBOBAMBA","030501"]
[null,null,null,null,null,null,null,"APURÍMAC GRAU CHUQUIBAMBILLA",{"$f":"IF(AND(ING!$D$21=J322,ING!$V$21=K322),I321+1,0)","v":0},"APURÍMAC","GRAU","CHUQUIBAMBILLA","030701"]
[null,null,null,null,null,null,null,{"$f":"J323&\" \"&K323&\" \"&L323","v":"APURÍMAC GRAU CURASCO"},{"$f":"IF(AND(ING!$D$21=J323,ING!$V$21=K323),I322+1,0)","v":0},"APURÍMAC","GRAU","CURASCO","030714"]
[null,null,null,null,null,null,null,"APURÍMAC GRAU CURPAHUASI",{"$f":"IF(AND(ING!$D$21=J324,ING!$V$21=K324),I323+1,0)","v":0},"APURÍMAC","GRAU","CURPAHUASI","030702"]
[null,null,null,null,null,null,null,"APURÍMAC GRAU GAMARRA",{"$f":"IF(AND(ING!$D$21=J325,ING!$V$21=K325),I324+1,0)","v":0},"APURÍMAC","GRAU","GAMARRA","030703"]
[null,null,null,null,null,null,null,"APURÍMAC GRAU HUAYLLATI",{"$f":"IF(AND(ING!$D$21=J326,ING!$V$21=K326),I325+1,0)","v":0},"APURÍMAC","GRAU","HUAYLLATI","030704"]
[null,null,null,null,null,null,null,"APURÍMAC GRAU MAMARA",{"$f":"IF(AND(ING!$D$21=J327,ING!$V$21=K327),I326+1,0)","v":0},"APURÍMAC","GRAU","MAMARA","030705"]
[null,null,null,null,null,null,null,"APURÍMAC GRAU MICAELA BASTIDAS",{"$f":"IF(AND(ING!$D$21=J328,ING!$V$21=K328),I327+1,0)","v":0},"APURÍMAC","GRAU","MICAELA BASTIDAS","030706"]
[null,null,null,null,null,null,null,"APURÍMAC GRAU PATAYPAMPA",{"$f":"IF(AND(ING!$D$21=J329,ING!$V$21=K329),I328+1,0)","v":0},"APURÍMAC","GRAU","PATAYPAMPA","030707"]
[null,null,null,null,null,null,null,"APURÍMAC GRAU PROGRESO",{"$f":"IF(AND(ING!$D$21=J330,ING!$V$21=K330),I329+1,0)","v":0},"APURÍMAC","GRAU","PROGRESO","030708"]
[null,null,null,null,null,null,null,"APURÍMAC GRAU SAN ANTONIO",{"$f":"IF(AND(ING!$D$21=J331,ING!$V$21=K331),I330+1,0)","v":0},"APURÍMAC","GRAU","SAN ANTONIO","030709"]
[null,null,null,null,null,null,null,"APURÍMAC GRAU SANTA ROSA",{"$f":"IF(AND(ING!$D$21=J332,ING!$V$21=K332),I331+1,0)","v":0},"APURÍMAC","GRAU","SANTA ROSA","030710"]
[null,null,null,null,null,null,null,"APURÍMAC GRAU TURPAY",{"$f":"IF(AND(ING!$D$21=J333,ING!$V$21=K333),I332+1,0)","v":0},"APURÍMAC","GRAU","TURPAY","030711"]
[null,null,null,null,null,null,null,"APURÍMAC GRAU VILCABAMBA",{"$f":"IF(AND(ING!$D$21=J334,ING!$V$21=K334),I333+1,0)","v":0},"APURÍMAC","GRAU","VILCABAMBA","030712"]
[null,null,null,null,null,null,null,"APURÍMAC GRAU VIRUNDO",{"$f":"IF(AND(ING!$D$21=J335,ING!$V$21=K335),I334+1,0)","v":0},"APURÍMAC","GRAU","VIRUNDO","030713"]
[null,null,null,null,null,null,null,"AREQUIPA AREQUIPA ALTO SELVA ALEGRE",{"$f":"IF(AND(ING!$D$21=J336,ING!$V$21=K336),I335+1,0)","v":0},"AREQUIPA","AREQUIPA","ALTO SELVA ALEGRE","040102"]
[null,null,null,null,null,null,null,"AREQUIPA AREQUIPA AREQUIPA",{"$f":"IF(AND(ING!$D$21=J337,ING!$V$21=K337),I336+1,0)","v":0},"AREQUIPA","AREQUIPA","AREQUIPA","040101"]
[null,null,null,null,null,null,null,"AREQUIPA AREQUIPA CAYMA",{"$f":"IF(AND(ING!$D$21=J338,ING!$V$21=K338),I337+1,0)","v":0},"AREQUIPA","AREQUIPA","CAYMA","040103"]
[null,null,null,null,null,null,null,"AREQUIPA AREQUIPA CERRO COLORADO",{"$f":"IF(AND(ING!$D$21=J339,ING!$V$21=K339),I338+1,0)","v":0},"AREQUIPA","AREQUIPA","CERRO COLORADO","040104"]
[null,null,null,null,null,null,null,"AREQUIPA AREQUIPA CHARACATO",{"$f":"IF(AND(ING!$D$21=J340,ING!$V$21=K340),I339+1,0)","v":0},"AREQUIPA","AREQUIPA","CHARACATO","040105"]
[null,null,null,null,null,null,null,"AREQUIPA AREQUIPA CHIGUATA",{"$f":"IF(AND(ING!$D$21=J341,ING!$V$21=K341),I340+1,0)","v":0},"AREQUIPA","AREQUIPA","CHIGUATA","040106"]
[null,null,null,null,null,null,null,"AREQUIPA AREQUIPA JACOBO HUNTER",{"$f":"IF(AND(ING!$D$21=J342,ING!$V$21=K342),I341+1,0)","v":0},"AREQUIPA","AREQUIPA","JACOBO HUNTER","040107"]
[null,null,null,null,null,null,null,"AREQUIPA AREQUIPA JOSE LUIS BUSTAMANTE Y RIVERO",{"$f":"IF(AND(ING!$D$21=J343,ING!$V$21=K343),I342+1,0)","v":0},"AREQUIPA","AREQUIPA","JOSE LUIS BUSTAMANTE Y RIVERO","040129"]
[null,null,null,null,null,null,null,"AREQUIPA AREQUIPA LA JOYA",{"$f":"IF(AND(ING!$D$21=J344,ING!$V$21=K344),I343+1,0)","v":0},"AREQUIPA","AREQUIPA","LA JOYA","040108"]
[null,null,null,null,null,null,null,"AREQUIPA AREQUIPA MARIANO MELGAR",{"$f":"IF(AND(ING!$D$21=J345,ING!$V$21=K345),I344+1,0)","v":0},"AREQUIPA","AREQUIPA","MARIANO MELGAR","040109"]
[null,null,null,null,null,null,null,"AREQUIPA AREQUIPA MIRAFLORES",{"$f":"IF(AND(ING!$D$21=J346,ING!$V$21=K346),I345+1,0)","v":0},"AREQUIPA","AREQUIPA","MIRAFLORES","040110"]
[null,null,null,null,null,null,null,"AREQUIPA AREQUIPA MOLLEBAYA",{"$f":"IF(AND(ING!$D$21=J347,ING!$V$21=K347),I346+1,0)","v":0},"AREQUIPA","AREQUIPA","MOLLEBAYA","040111"]
[null,null,null,null,null,null,null,"AREQUIPA AREQUIPA PAUCARPATA",{"$f":"IF(AND(ING!$D$21=J348,ING!$V$21=K348),I347+1,0)","v":0},"AREQUIPA","AREQUIPA","PAUCARPATA","040112"]
[null,null,null,null,null,null,null,"AREQUIPA AREQUIPA POCSI",{"$f":"IF(AND(ING!$D$21=J349,ING!$V$21=K349),I348+1,0)","v":0},"AREQUIPA","AREQUIPA","POCSI","040113"]
[null,null,null,null,null,null,null,"AREQUIPA AREQUIPA POLOBAYA",{"$f":"IF(AND(ING!$D$21=J350,ING!$V$21=K350),I349+1,0)","v":0},"AREQUIPA","AREQUIPA","POLOBAYA","040114"]
[null,null,null,null,null,null,null,"AREQUIPA AREQUIPA QUEQUEÑA",{"$f":"IF(AND(ING!$D$21=J351,ING!$V$21=K351),I350+1,0)","v":0},"AREQUIPA","AREQUIPA","QUEQUEÑA","040115"]
[null,null,null,null,null,null,null,"AREQUIPA AREQUIPA SABANDIA",{"$f":"IF(AND(ING!$D$21=J352,ING!$V$21=K352),I351+1,0)","v":0},"AREQUIPA","AREQUIPA","SABANDIA","040116"]
[null,null,null,null,null,null,null,"AREQUIPA AREQUIPA SACHACA",{"$f":"IF(AND(ING!$D$21=J353,ING!$V$21=K353),I352+1,0)","v":0},"AREQUIPA","AREQUIPA","SACHACA","040117"]
[null,null,null,null,null,null,null,"AREQUIPA AREQUIPA SAN JUAN DE SIGUAS",{"$f":"IF(AND(ING!$D$21=J354,ING!$V$21=K354),I353+1,0)","v":0},"AREQUIPA","AREQUIPA","SAN JUAN DE SIGUAS","040118"]
[null,null,null,null,null,null,null,"AREQUIPA AREQUIPA SAN JUAN DE TARUCANI",{"$f":"IF(AND(ING!$D$21=J355,ING!$V$21=K355),I354+1,0)","v":0},"AREQUIPA","AREQUIPA","SAN JUAN DE TARUCANI","040119"]
[null,null,null,null,null,null,null,"AREQUIPA AREQUIPA SANTA ISABEL DE SIGUAS",{"$f":"IF(AND(ING!$D$21=J356,ING!$V$21=K356),I355+1,0)","v":0},"AREQUIPA","AREQUIPA","SANTA ISABEL DE SIGUAS","040120"]
[null,null,null,null,null,null,null,"AREQUIPA AREQUIPA SANTA RITA DE SIGUAS",{"$f":"IF(AND(ING!$D$21=J357,ING!$V$21=K357),I356+1,0)","v":0},"AREQUIPA","AREQUIPA","SANTA RITA DE SIGUAS","040121"]
[null,null,null,null,null,null,null,"AREQUIPA AREQUIPA SOCABAYA",{"$f":"IF(AND(ING!$D$21=J358,ING!$V$21=K358),I357+1,0)","v":0},"AREQUIPA","AREQUIPA","SOCABAYA","040122"]
[null,null,null,null,null,null,null,"AREQUIPA AREQUIPA TIABAYA",{"$f":"IF(AND(ING!$D$21=J359,ING!$V$21=K359),I358+1,0)","v":0},"AREQUIPA","AREQUIPA","TIABAYA","040123"]
[null,null,null,null,null,null,null,"AREQUIPA AREQUIPA UCHUMAYO",{"$f":"IF(AND(ING!$D$21=J360,ING!$V$21=K360),I359+1,0)","v":0},"AREQUIPA","AREQUIPA","UCHUMAYO","040124"]
[null,null,null,null,null,null,null,"AREQUIPA AREQUIPA VITOR",{"$f":"IF(AND(ING!$D$21=J361,ING!$V$21=K361),I360+1,0)","v":0},"AREQUIPA","AREQUIPA","VITOR","040125"]
[null,null,null,null,null,null,null,"AREQUIPA AREQUIPA YANAHUARA",{"$f":"IF(AND(ING!$D$21=J362,ING!$V$21=K362),I361+1,0)","v":0},"AREQUIPA","AREQUIPA","YANAHUARA","040126"]
[null,null,null,null,null,null,null,"AREQUIPA AREQUIPA YARABAMBA",{"$f":"IF(AND(ING!$D$21=J363,ING!$V$21=K363),I362+1,0)","v":0},"AREQUIPA","AREQUIPA","YARABAMBA","040127"]
[null,null,null,null,null,null,null,"AREQUIPA AREQUIPA YURA",{"$f":"IF(AND(ING!$D$21=J364,ING!$V$21=K364),I363+1,0)","v":0},"AREQUIPA","AREQUIPA","YURA","040128"]
[null,null,null,null,null,null,null,"AREQUIPA CAMANA CAMANA",{"$f":"IF(AND(ING!$D$21=J365,ING!$V$21=K365),I364+1,0)","v":0},"AREQUIPA","CAMANA","CAMANA","040201"]
[null,null,null,null,null,null,null,"AREQUIPA CAMANA JOSE MARIA QUIMPER",{"$f":"IF(AND(ING!$D$21=J366,ING!$V$21=K366),I365+1,0)","v":0},"AREQUIPA","CAMANA","JOSE MARIA QUIMPER","040202"]
[null,null,null,null,null,null,null,"AREQUIPA CAMANA MARIANO NICOLAS VALCARCEL",{"$f":"IF(AND(ING!$D$21=J367,ING!$V$21=K367),I366+1,0)","v":0},"AREQUIPA","CAMANA","MARIANO NICOLAS VALCARCEL","040203"]
[null,null,null,null,null,null,null,"AREQUIPA CAMANA MARISCAL CACERES",{"$f":"IF(AND(ING!$D$21=J368,ING!$V$21=K368),I367+1,0)","v":0},"AREQUIPA","CAMANA","MARISCAL CACERES","040204"]
[null,null,null,null,null,null,null,"AREQUIPA CAMANA NICOLAS DE PIEROLA",{"$f":"IF(AND(ING!$D$21=J369,ING!$V$21=K369),I368+1,0)","v":0},"AREQUIPA","CAMANA","NICOLAS DE PIEROLA","040205"]
[null,null,null,null,null,null,null,"AREQUIPA CAMANA OCOÑA",{"$f":"IF(AND(ING!$D$21=J370,ING!$V$21=K370),I369+1,0)","v":0},"AREQUIPA","CAMANA","OCOÑA","040206"]
[null,null,null,null,null,null,null,"AREQUIPA CAMANA QUILCA",{"$f":"IF(AND(ING!$D$21=J371,ING!$V$21=K371),I370+1,0)","v":0},"AREQUIPA","CAMANA","QUILCA","040207"]
[null,null,null,null,null,null,null,"AREQUIPA CAMANA SAMUEL PASTOR",{"$f":"IF(AND(ING!$D$21=J372,ING!$V$21=K372),I371+1,0)","v":0},"AREQUIPA","CAMANA","SAMUEL PASTOR","040208"]
[null,null,null,null,null,null,null,"AREQUIPA CARAVELI ACARI",{"$f":"IF(AND(ING!$D$21=J373,ING!$V$21=K373),I372+1,0)","v":0},"AREQUIPA","CARAVELI","ACARI","040302"]
[null,null,null,null,null,null,null,"AREQUIPA CARAVELI ATICO",{"$f":"IF(AND(ING!$D$21=J374,ING!$V$21=K374),I373+1,0)","v":0},"AREQUIPA","CARAVELI","ATICO","040303"]
[null,null,null,null,null,null,null,"AREQUIPA CARAVELI ATIQUIPA",{"$f":"IF(AND(ING!$D$21=J375,ING!$V$21=K375),I374+1,0)","v":0},"AREQUIPA","CARAVELI","ATIQUIPA","040304"]
[null,null,null,null,null,null,null,"AREQUIPA CARAVELI BELLA UNION",{"$f":"IF(AND(ING!$D$21=J376,ING!$V$21=K376),I375+1,0)","v":0},"AREQUIPA","CARAVELI","BELLA UNION","040305"]
[null,null,null,null,null,null,null,"AREQUIPA CARAVELI CAHUACHO",{"$f":"IF(AND(ING!$D$21=J377,ING!$V$21=K377),I376+1,0)","v":0},"AREQUIPA","CARAVELI","CAHUACHO","040306"]
[null,null,null,null,null,null,null,"AREQUIPA CARAVELI CARAVELI",{"$f":"IF(AND(ING!$D$21=J378,ING!$V$21=K378),I377+1,0)","v":0},"AREQUIPA","CARAVELI","CARAVELI","040301"]
[null,null,null,null,null,null,null,"AREQUIPA CARAVELI CHALA",{"$f":"IF(AND(ING!$D$21=J379,ING!$V$21=K379),I378+1,0)","v":0},"AREQUIPA","CARAVELI","CHALA","040307"]
[null,null,null,null,null,null,null,"AREQUIPA CARAVELI CHAPARRA",{"$f":"IF(AND(ING!$D$21=J380,ING!$V$21=K380),I379+1,0)","v":0},"AREQUIPA","CARAVELI","CHAPARRA","040308"]
[null,null,null,null,null,null,null,"AREQUIPA CARAVELI HUANUHUANU",{"$f":"IF(AND(ING!$D$21=J381,ING!$V$21=K381),I380+1,0)","v":0},"AREQUIPA","CARAVELI","HUANUHUANU","040309"]
[null,null,null,null,null,null,null,"AREQUIPA CARAVELI JAQUI",{"$f":"IF(AND(ING!$D$21=J382,ING!$V$21=K382),I381+1,0)","v":0},"AREQUIPA","CARAVELI","JAQUI","040310"]
[null,null,null,null,null,null,null,"AREQUIPA CARAVELI LOMAS",{"$f":"IF(AND(ING!$D$21=J383,ING!$V$21=K383),I382+1,0)","v":0},"AREQUIPA","CARAVELI","LOMAS","040311"]
[null,null,null,null,null,null,null,"AREQUIPA CARAVELI QUICACHA",{"$f":"IF(AND(ING!$D$21=J384,ING!$V$21=K384),I383+1,0)","v":0},"AREQUIPA","CARAVELI","QUICACHA","040312"]
[null,null,null,null,null,null,null,"AREQUIPA CARAVELI YAUCA",{"$f":"IF(AND(ING!$D$21=J385,ING!$V$21=K385),I384+1,0)","v":0},"AREQUIPA","CARAVELI","YAUCA","040313"]
[null,null,null,null,null,null,null,"AREQUIPA CASTILLA ANDAGUA",{"$f":"IF(AND(ING!$D$21=J386,ING!$V$21=K386),I385+1,0)","v":0},"AREQUIPA","CASTILLA","ANDAGUA","040402"]
[null,null,null,null,null,null,null,{"$f":"J387&\" \"&K387&\" \"&L387","v":"AREQUIPA CASTILLA APLAO"},{"$f":"IF(AND(ING!$D$21=J387,ING!$V$21=K387),I386+1,0)","v":0},"AREQUIPA","CASTILLA","APLAO","040401"]
[null,null,null,null,null,null,null,"AREQUIPA CASTILLA AYO",{"$f":"IF(AND(ING!$D$21=J388,ING!$V$21=K388),I387+1,0)","v":0},"AREQUIPA","CASTILLA","AYO","040403"]
[null,null,null,null,null,null,null,"AREQUIPA CASTILLA CHACHAS",{"$f":"IF(AND(ING!$D$21=J389,ING!$V$21=K389),I388+1,0)","v":0},"AREQUIPA","CASTILLA","CHACHAS","040404"]
[null,null,null,null,null,null,null,"AREQUIPA CASTILLA CHILCAYMARCA",{"$f":"IF(AND(ING!$D$21=J390,ING!$V$21=K390),I389+1,0)","v":0},"AREQUIPA","CASTILLA","CHILCAYMARCA","040405"]
[null,null,null,null,null,null,null,"AREQUIPA CASTILLA CHOCO",{"$f":"IF(AND(ING!$D$21=J391,ING!$V$21=K391),I390+1,0)","v":0},"AREQUIPA","CASTILLA","CHOCO","040406"]
[null,null,null,null,null,null,null,"AREQUIPA CASTILLA HUANCARQUI",{"$f":"IF(AND(ING!$D$21=J392,ING!$V$21=K392),I391+1,0)","v":0},"AREQUIPA","CASTILLA","HUANCARQUI","040407"]
[null,null,null,null,null,null,null,"AREQUIPA CASTILLA MACHAGUAY",{"$f":"IF(AND(ING!$D$21=J393,ING!$V$21=K393),I392+1,0)","v":0},"AREQUIPA","CASTILLA","MACHAGUAY","040408"]
[null,null,null,null,null,null,null,"AREQUIPA CASTILLA ORCOPAMPA",{"$f":"IF(AND(ING!$D$21=J394,ING!$V$21=K394),I393+1,0)","v":0},"AREQUIPA","CASTILLA","ORCOPAMPA","040409"]
[null,null,null,null,null,null,null,"AREQUIPA CASTILLA PAMPACOLCA",{"$f":"IF(AND(ING!$D$21=J395,ING!$V$21=K395),I394+1,0)","v":0},"AREQUIPA","CASTILLA","PAMPACOLCA","040410"]
[null,null,null,null,null,null,null,"AREQUIPA CASTILLA TIPAN",{"$f":"IF(AND(ING!$D$21=J396,ING!$V$21=K396),I395+1,0)","v":0},"AREQUIPA","CASTILLA","TIPAN","040411"]
[null,null,null,null,null,null,null,"AREQUIPA CASTILLA UÑON",{"$f":"IF(AND(ING!$D$21=J397,ING!$V$21=K397),I396+1,0)","v":0},"AREQUIPA","CASTILLA","UÑON","040412"]
[null,null,null,null,null,null,null,"AREQUIPA CASTILLA URACA",{"$f":"IF(AND(ING!$D$21=J398,ING!$V$21=K398),I397+1,0)","v":0},"AREQUIPA","CASTILLA","URACA","040413"]
[null,null,null,null,null,null,null,"AREQUIPA CASTILLA VIRACO",{"$f":"IF(AND(ING!$D$21=J399,ING!$V$21=K399),I398+1,0)","v":0},"AREQUIPA","CASTILLA","VIRACO","040414"]
[null,null,null,null,null,null,null,"AREQUIPA CAYLLOMA ACHOMA",{"$f":"IF(AND(ING!$D$21=J400,ING!$V$21=K400),I399+1,0)","v":0},"AREQUIPA","CAYLLOMA","ACHOMA","040502"]
[null,null,null,null,null,null,null,"AREQUIPA CAYLLOMA CABANACONDE",{"$f":"IF(AND(ING!$D$21=J401,ING!$V$21=K401),I400+1,0)","v":0},"AREQUIPA","CAYLLOMA","CABANACONDE","040503"]
[null,null,null,null,null,null,null,"AREQUIPA CAYLLOMA CALLALLI",{"$f":"IF(AND(ING!$D$21=J402,ING!$V$21=K402),I401+1,0)","v":0},"AREQUIPA","CAYLLOMA","CALLALLI","040504"]
[null,null,null,null,null,null,null,"AREQUIPA CAYLLOMA CAYLLOMA",{"$f":"IF(AND(ING!$D$21=J403,ING!$V$21=K403),I402+1,0)","v":0},"AREQUIPA","CAYLLOMA","CAYLLOMA","040505"]
[null,null,null,null,null,null,null,"AREQUIPA CAYLLOMA CHIVAY",{"$f":"IF(AND(ING!$D$21=J404,ING!$V$21=K404),I403+1,0)","v":0},"AREQUIPA","CAYLLOMA","CHIVAY","040501"]
[null,null,null,null,null,null,null,"AREQUIPA CAYLLOMA COPORAQUE",{"$f":"IF(AND(ING!$D$21=J405,ING!$V$21=K405),I404+1,0)","v":0},"AREQUIPA","CAYLLOMA","COPORAQUE","040506"]
[null,null,null,null,null,null,null,"AREQUIPA CAYLLOMA HUAMBO",{"$f":"IF(AND(ING!$D$21=J406,ING!$V$21=K406),I405+1,0)","v":0},"AREQUIPA","CAYLLOMA","HUAMBO","040507"]
[null,null,null,null,null,null,null,"AREQUIPA CAYLLOMA HUANCA",{"$f":"IF(AND(ING!$D$21=J407,ING!$V$21=K407),I406+1,0)","v":0},"AREQUIPA","CAYLLOMA","HUANCA","040508"]
[null,null,null,null,null,null,null,"AREQUIPA CAYLLOMA ICHUPAMPA",{"$f":"IF(AND(ING!$D$21=J408,ING!$V$21=K408),I407+1,0)","v":0},"AREQUIPA","CAYLLOMA","ICHUPAMPA","040509"]
[null,null,null,null,null,null,null,"AREQUIPA CAYLLOMA LARI",{"$f":"IF(AND(ING!$D$21=J409,ING!$V$21=K409),I408+1,0)","v":0},"AREQUIPA","CAYLLOMA","LARI","040510"]
[null,null,null,null,null,null,null,"AREQUIPA CAYLLOMA LLUTA",{"$f":"IF(AND(ING!$D$21=J410,ING!$V$21=K410),I409+1,0)","v":0},"AREQUIPA","CAYLLOMA","LLUTA","040511"]
[null,null,null,null,null,null,null,"AREQUIPA CAYLLOMA MACA",{"$f":"IF(AND(ING!$D$21=J411,ING!$V$21=K411),I410+1,0)","v":0},"AREQUIPA","CAYLLOMA","MACA","040512"]
[null,null,null,null,null,null,null,"AREQUIPA CAYLLOMA MADRIGAL",{"$f":"IF(AND(ING!$D$21=J412,ING!$V$21=K412),I411+1,0)","v":0},"AREQUIPA","CAYLLOMA","MADRIGAL","040513"]
[null,null,null,null,null,null,null,"AREQUIPA CAYLLOMA MAJES",{"$f":"IF(AND(ING!$D$21=J413,ING!$V$21=K413),I412+1,0)","v":0},"AREQUIPA","CAYLLOMA","MAJES","040520"]
[null,null,null,null,null,null,null,"AREQUIPA CAYLLOMA SAN ANTONIO DE CHUCA",{"$f":"IF(AND(ING!$D$21=J414,ING!$V$21=K414),I413+1,0)","v":0},"AREQUIPA","CAYLLOMA","SAN ANTONIO DE CHUCA","040514"]
[null,null,null,null,null,null,null,"AREQUIPA CAYLLOMA SIBAYO",{"$f":"IF(AND(ING!$D$21=J415,ING!$V$21=K415),I414+1,0)","v":0},"AREQUIPA","CAYLLOMA","SIBAYO","040515"]
[null,null,null,null,null,null,null,"AREQUIPA CAYLLOMA TAPAY",{"$f":"IF(AND(ING!$D$21=J416,ING!$V$21=K416),I415+1,0)","v":0},"AREQUIPA","CAYLLOMA","TAPAY","040516"]
[null,null,null,null,null,null,null,"AREQUIPA CAYLLOMA TISCO",{"$f":"IF(AND(ING!$D$21=J417,ING!$V$21=K417),I416+1,0)","v":0},"AREQUIPA","CAYLLOMA","TISCO","040517"]
[null,null,null,null,null,null,null,"AREQUIPA CAYLLOMA TUTI",{"$f":"IF(AND(ING!$D$21=J418,ING!$V$21=K418),I417+1,0)","v":0},"AREQUIPA","CAYLLOMA","TUTI","040518"]
[null,null,null,null,null,null,null,"AREQUIPA CAYLLOMA YANQUE",{"$f":"IF(AND(ING!$D$21=J419,ING!$V$21=K419),I418+1,0)","v":0},"AREQUIPA","CAYLLOMA","YANQUE","040519"]
[null,null,null,null,null,null,null,"AREQUIPA CONDESUYOS ANDARAY",{"$f":"IF(AND(ING!$D$21=J420,ING!$V$21=K420),I419+1,0)","v":0},"AREQUIPA","CONDESUYOS","ANDARAY","040602"]
[null,null,null,null,null,null,null,"AREQUIPA CONDESUYOS CAYARANI",{"$f":"IF(AND(ING!$D$21=J421,ING!$V$21=K421),I420+1,0)","v":0},"AREQUIPA","CONDESUYOS","CAYARANI","040603"]
[null,null,null,null,null,null,null,"AREQUIPA CONDESUYOS CHICHAS",{"$f":"IF(AND(ING!$D$21=J422,ING!$V$21=K422),I421+1,0)","v":0},"AREQUIPA","CONDESUYOS","CHICHAS","040604"]
[null,null,null,null,null,null,null,"AREQUIPA CONDESUYOS CHUQUIBAMBA",{"$f":"IF(AND(ING!$D$21=J423,ING!$V$21=K423),I422+1,0)","v":0},"AREQUIPA","CONDESUYOS","CHUQUIBAMBA","040601"]
[null,null,null,null,null,null,null,"AREQUIPA CONDESUYOS IRAY",{"$f":"IF(AND(ING!$D$21=J424,ING!$V$21=K424),I423+1,0)","v":0},"AREQUIPA","CONDESUYOS","IRAY","040605"]
[null,null,null,null,null,null,null,"AREQUIPA CONDESUYOS RIO GRANDE",{"$f":"IF(AND(ING!$D$21=J425,ING!$V$21=K425),I424+1,0)","v":0},"AREQUIPA","CONDESUYOS","RIO GRANDE","040606"]
[null,null,null,null,null,null,null,"AREQUIPA CONDESUYOS SALAMANCA",{"$f":"IF(AND(ING!$D$21=J426,ING!$V$21=K426),I425+1,0)","v":0},"AREQUIPA","CONDESUYOS","SALAMANCA","040607"]
[null,null,null,null,null,null,null,"AREQUIPA CONDESUYOS YANAQUIHUA",{"$f":"IF(AND(ING!$D$21=J427,ING!$V$21=K427),I426+1,0)","v":0},"AREQUIPA","CONDESUYOS","YANAQUIHUA","040608"]
[null,null,null,null,null,null,null,"AREQUIPA ISLAY COCACHACRA",{"$f":"IF(AND(ING!$D$21=J428,ING!$V$21=K428),I427+1,0)","v":0},"AREQUIPA","ISLAY","COCACHACRA","040702"]
[null,null,null,null,null,null,null,"AREQUIPA ISLAY DEAN VALDIVIA",{"$f":"IF(AND(ING!$D$21=J429,ING!$V$21=K429),I428+1,0)","v":0},"AREQUIPA","ISLAY","DEAN VALDIVIA","040703"]
[null,null,null,null,null,null,null,"AREQUIPA ISLAY ISLAY",{"$f":"IF(AND(ING!$D$21=J430,ING!$V$21=K430),I429+1,0)","v":0},"AREQUIPA","ISLAY","ISLAY","040704"]
[null,null,null,null,null,null,null,"AREQUIPA ISLAY MEJIA",{"$f":"IF(AND(ING!$D$21=J431,ING!$V$21=K431),I430+1,0)","v":0},"AREQUIPA","ISLAY","MEJIA","040705"]
[null,null,null,null,null,null,null,"AREQUIPA ISLAY MOLLENDO",{"$f":"IF(AND(ING!$D$21=J432,ING!$V$21=K432),I431+1,0)","v":0},"AREQUIPA","ISLAY","MOLLENDO","040701"]
[null,null,null,null,null,null,null,"AREQUIPA ISLAY PUNTA DE BOMBON",{"$f":"IF(AND(ING!$D$21=J433,ING!$V$21=K433),I432+1,0)","v":0},"AREQUIPA","ISLAY","PUNTA DE BOMBON","040706"]
[null,null,null,null,null,null,null,"AREQUIPA LA UNION ALCA",{"$f":"IF(AND(ING!$D$21=J434,ING!$V$21=K434),I433+1,0)","v":0},"AREQUIPA","LA UNION","ALCA","040802"]
[null,null,null,null,null,null,null,"AREQUIPA LA UNION CHARCANA",{"$f":"IF(AND(ING!$D$21=J435,ING!$V$21=K435),I434+1,0)","v":0},"AREQUIPA","LA UNION","CHARCANA","040803"]
[null,null,null,null,null,null,null,"AREQUIPA LA UNION COTAHUASI",{"$f":"IF(AND(ING!$D$21=J436,ING!$V$21=K436),I435+1,0)","v":0},"AREQUIPA","LA UNION","COTAHUASI","040801"]
[null,null,null,null,null,null,null,"AREQUIPA LA UNION HUAYNACOTAS",{"$f":"IF(AND(ING!$D$21=J437,ING!$V$21=K437),I436+1,0)","v":0},"AREQUIPA","LA UNION","HUAYNACOTAS","040804"]
[null,null,null,null,null,null,null,"AREQUIPA LA UNION PAMPAMARCA",{"$f":"IF(AND(ING!$D$21=J438,ING!$V$21=K438),I437+1,0)","v":0},"AREQUIPA","LA UNION","PAMPAMARCA","040805"]
[null,null,null,null,null,null,null,"AREQUIPA LA UNION PUYCA",{"$f":"IF(AND(ING!$D$21=J439,ING!$V$21=K439),I438+1,0)","v":0},"AREQUIPA","LA UNION","PUYCA","040806"]
[null,null,null,null,null,null,null,"AREQUIPA LA UNION QUECHUALLA",{"$f":"IF(AND(ING!$D$21=J440,ING!$V$21=K440),I439+1,0)","v":0},"AREQUIPA","LA UNION","QUECHUALLA","040807"]
[null,null,null,null,null,null,null,"AREQUIPA LA UNION SAYLA",{"$f":"IF(AND(ING!$D$21=J441,ING!$V$21=K441),I440+1,0)","v":0},"AREQUIPA","LA UNION","SAYLA","040808"]
[null,null,null,null,null,null,null,"AREQUIPA LA UNION TAURIA",{"$f":"IF(AND(ING!$D$21=J442,ING!$V$21=K442),I441+1,0)","v":0},"AREQUIPA","LA UNION","TAURIA","040809"]
[null,null,null,null,null,null,null,"AREQUIPA LA UNION TOMEPAMPA",{"$f":"IF(AND(ING!$D$21=J443,ING!$V$21=K443),I442+1,0)","v":0},"AREQUIPA","LA UNION","TOMEPAMPA","040810"]
[null,null,null,null,null,null,null,"AREQUIPA LA UNION TORO",{"$f":"IF(AND(ING!$D$21=J444,ING!$V$21=K444),I443+1,0)","v":0},"AREQUIPA","LA UNION","TORO","040811"]
[null,null,null,null,null,null,null,"AYACUCHO CANGALLO CANGALLO",{"$f":"IF(AND(ING!$D$21=J445,ING!$V$21=K445),I444+1,0)","v":0},"AYACUCHO","CANGALLO","CANGALLO","050201"]
[null,null,null,null,null,null,null,"AYACUCHO CANGALLO CHUSCHI",{"$f":"IF(AND(ING!$D$21=J446,ING!$V$21=K446),I445+1,0)","v":0},"AYACUCHO","CANGALLO","CHUSCHI","050202"]
[null,null,null,null,null,null,null,"AYACUCHO CANGALLO LOS MOROCHUCOS",{"$f":"IF(AND(ING!$D$21=J447,ING!$V$21=K447),I446+1,0)","v":0},"AYACUCHO","CANGALLO","LOS MOROCHUCOS","050203"]
[null,null,null,null,null,null,null,"AYACUCHO CANGALLO MARIA PARADO DE BELLIDO",{"$f":"IF(AND(ING!$D$21=J448,ING!$V$21=K448),I447+1,0)","v":0},"AYACUCHO","CANGALLO","MARIA PARADO DE BELLIDO","050204"]
[null,null,null,null,null,null,null,"AYACUCHO CANGALLO PARAS",{"$f":"IF(AND(ING!$D$21=J449,ING!$V$21=K449),I448+1,0)","v":0},"AYACUCHO","CANGALLO","PARAS","050205"]
[null,null,null,null,null,null,null,"AYACUCHO CANGALLO TOTOS",{"$f":"IF(AND(ING!$D$21=J450,ING!$V$21=K450),I449+1,0)","v":0},"AYACUCHO","CANGALLO","TOTOS","050206"]
[null,null,null,null,null,null,null,{"$f":"J451&\" \"&K451&\" \"&L451","v":"AYACUCHO HUAMANGA ACOCRO"},{"$f":"IF(AND(ING!$D$21=J451,ING!$V$21=K451),I450+1,0)","v":0},"AYACUCHO","HUAMANGA","ACOCRO","050102"]
[null,null,null,null,null,null,null,"AYACUCHO HUAMANGA ACOS VINCHOS",{"$f":"IF(AND(ING!$D$21=J452,ING!$V$21=K452),I451+1,0)","v":0},"AYACUCHO","HUAMANGA","ACOS VINCHOS","050103"]
[null,null,null,null,null,null,null,"AYACUCHO HUAMANGA ANDRÉS AVELINO CÁCERES DORREGARAY",{"$f":"IF(AND(ING!$D$21=J453,ING!$V$21=K453),I452+1,0)","v":0},"AYACUCHO","HUAMANGA","ANDRÉS AVELINO CÁCERES DORREGARAY","050116"]
[null,null,null,null,null,null,null,"AYACUCHO HUAMANGA AYACUCHO",{"$f":"IF(AND(ING!$D$21=J454,ING!$V$21=K454),I453+1,0)","v":0},"AYACUCHO","HUAMANGA","AYACUCHO","050101"]
[null,null,null,null,null,null,null,"AYACUCHO HUAMANGA CARMEN ALTO",{"$f":"IF(AND(ING!$D$21=J455,ING!$V$21=K455),I454+1,0)","v":0},"AYACUCHO","HUAMANGA","CARMEN ALTO","050104"]
[null,null,null,null,null,null,null,"AYACUCHO HUAMANGA CHIARA",{"$f":"IF(AND(ING!$D$21=J456,ING!$V$21=K456),I455+1,0)","v":0},"AYACUCHO","HUAMANGA","CHIARA","050105"]
[null,null,null,null,null,null,null,"AYACUCHO HUAMANGA JESUS NAZARENO",{"$f":"IF(AND(ING!$D$21=J457,ING!$V$21=K457),I456+1,0)","v":0},"AYACUCHO","HUAMANGA","JESUS NAZARENO","050115"]
[null,null,null,null,null,null,null,"AYACUCHO HUAMANGA OCROS",{"$f":"IF(AND(ING!$D$21=J458,ING!$V$21=K458),I457+1,0)","v":0},"AYACUCHO","HUAMANGA","OCROS","050106"]
[null,null,null,null,null,null,null,"AYACUCHO HUAMANGA PACAYCASA",{"$f":"IF(AND(ING!$D$21=J459,ING!$V$21=K459),I458+1,0)","v":0},"AYACUCHO","HUAMANGA","PACAYCASA","050107"]
[null,null,null,null,null,null,null,"AYACUCHO HUAMANGA QUINUA",{"$f":"IF(AND(ING!$D$21=J460,ING!$V$21=K460),I459+1,0)","v":0},"AYACUCHO","HUAMANGA","QUINUA","050108"]
[null,null,null,null,null,null,null,"AYACUCHO HUAMANGA SAN JOSE DE TICLLAS",{"$f":"IF(AND(ING!$D$21=J461,ING!$V$21=K461),I460+1,0)","v":0},"AYACUCHO","HUAMANGA","SAN JOSE DE TICLLAS","050109"]
[null,null,null,null,null,null,null,"AYACUCHO HUAMANGA SAN JUAN BAUTISTA",{"$f":"IF(AND(ING!$D$21=J462,ING!$V$21=K462),I461+1,0)","v":0},"AYACUCHO","HUAMANGA","SAN JUAN BAUTISTA","050110"]
[null,null,null,null,null,null,null,"AYACUCHO HUAMANGA SANTIAGO DE PISCHA",{"$f":"IF(AND(ING!$D$21=J463,ING!$V$21=K463),I462+1,0)","v":0},"AYACUCHO","HUAMANGA","SANTIAGO DE PISCHA","050111"]
[null,null,null,null,null,null,null,"AYACUCHO HUAMANGA SOCOS",{"$f":"IF(AND(ING!$D$21=J464,ING!$V$21=K464),I463+1,0)","v":0},"AYACUCHO","HUAMANGA","SOCOS","050112"]
[null,null,null,null,null,null,null,"AYACUCHO HUAMANGA TAMBILLO",{"$f":"IF(AND(ING!$D$21=J465,ING!$V$21=K465),I464+1,0)","v":0},"AYACUCHO","HUAMANGA","TAMBILLO","050113"]
[null,null,null,null,null,null,null,"AYACUCHO HUAMANGA VINCHOS",{"$f":"IF(AND(ING!$D$21=J466,ING!$V$21=K466),I465+1,0)","v":0},"AYACUCHO","HUAMANGA","VINCHOS","050114"]
[null,null,null,null,null,null,null,"AYACUCHO HUANCA SANCOS CARAPO",{"$f":"IF(AND(ING!$D$21=J467,ING!$V$21=K467),I466+1,0)","v":0},"AYACUCHO","HUANCA SANCOS","CARAPO","050302"]
[null,null,null,null,null,null,null,"AYACUCHO HUANCA SANCOS SACSAMARCA",{"$f":"IF(AND(ING!$D$21=J468,ING!$V$21=K468),I467+1,0)","v":0},"AYACUCHO","HUANCA SANCOS","SACSAMARCA","050303"]
[null,null,null,null,null,null,null,"AYACUCHO HUANCA SANCOS SANCOS",{"$f":"IF(AND(ING!$D$21=J469,ING!$V$21=K469),I468+1,0)","v":0},"AYACUCHO","HUANCA SANCOS","SANCOS","050301"]
[null,null,null,null,null,null,null,"AYACUCHO HUANCA SANCOS SANTIAGO DE LUCANAMARCA",{"$f":"IF(AND(ING!$D$21=J470,ING!$V$21=K470),I469+1,0)","v":0},"AYACUCHO","HUANCA SANCOS","SANTIAGO DE LUCANAMARCA","050304"]
[null,null,null,null,null,null,null,"AYACUCHO HUANTA AYAHUANCO",{"$f":"IF(AND(ING!$D$21=J471,ING!$V$21=K471),I470+1,0)","v":0},"AYACUCHO","HUANTA","AYAHUANCO","050402"]
[null,null,null,null,null,null,null,"AYACUCHO HUANTA CANAYRE",{"$f":"IF(AND(ING!$D$21=J472,ING!$V$21=K472),I471+1,0)","v":0},"AYACUCHO","HUANTA","CANAYRE","050409"]
[null,null,null,null,null,null,null,"AYACUCHO HUANTA CHACA",{"$f":"IF(AND(ING!$D$21=J473,ING!$V$21=K473),I472+1,0)","v":0},"AYACUCHO","HUANTA","CHACA","050412"]
[null,null,null,null,null,null,null,"AYACUCHO HUANTA HUAMANGUILLA",{"$f":"IF(AND(ING!$D$21=J474,ING!$V$21=K474),I473+1,0)","v":0},"AYACUCHO","HUANTA","HUAMANGUILLA","050403"]
[null,null,null,null,null,null,null,"AYACUCHO HUANTA HUANTA",{"$f":"IF(AND(ING!$D$21=J475,ING!$V$21=K475),I474+1,0)","v":0},"AYACUCHO","HUANTA","HUANTA","050401"]
[null,null,null,null,null,null,null,"AYACUCHO HUANTA IGUAIN",{"$f":"IF(AND(ING!$D$21=J476,ING!$V$21=K476),I475+1,0)","v":0},"AYACUCHO","HUANTA","IGUAIN","050404"]
[null,null,null,null,null,null,null,"AYACUCHO HUANTA LLOCHEGUA",{"$f":"IF(AND(ING!$D$21=J477,ING!$V$21=K477),I476+1,0)","v":0},"AYACUCHO","HUANTA","LLOCHEGUA","050408"]
[null,null,null,null,null,null,null,"AYACUCHO HUANTA LURICOCHA",{"$f":"IF(AND(ING!$D$21=J478,ING!$V$21=K478),I477+1,0)","v":0},"AYACUCHO","HUANTA","LURICOCHA","050405"]
[null,null,null,null,null,null,null,"AYACUCHO HUANTA PUCACOLPA",{"$f":"IF(AND(ING!$D$21=J479,ING!$V$21=K479),I478+1,0)","v":0},"AYACUCHO","HUANTA","PUCACOLPA","050411"]
[null,null,null,null,null,null,null,"AYACUCHO HUANTA SANTILLANA",{"$f":"IF(AND(ING!$D$21=J480,ING!$V$21=K480),I479+1,0)","v":0},"AYACUCHO","HUANTA","SANTILLANA","050406"]
[null,null,null,null,null,null,null,"AYACUCHO HUANTA SIVIA",{"$f":"IF(AND(ING!$D$21=J481,ING!$V$21=K481),I480+1,0)","v":0},"AYACUCHO","HUANTA","SIVIA","050407"]
[null,null,null,null,null,null,null,"AYACUCHO HUANTA UCHURACCAY",{"$f":"IF(AND(ING!$D$21=J482,ING!$V$21=K482),I481+1,0)","v":0},"AYACUCHO","HUANTA","UCHURACCAY","050410"]
[null,null,null,null,null,null,null,"AYACUCHO LA MAR ANCHIHUAY",{"$f":"IF(AND(ING!$D$21=J483,ING!$V$21=K483),I482+1,0)","v":0},"AYACUCHO","LA MAR","ANCHIHUAY","050510"]
[null,null,null,null,null,null,null,"AYACUCHO LA MAR ANCO",{"$f":"IF(AND(ING!$D$21=J484,ING!$V$21=K484),I483+1,0)","v":0},"AYACUCHO","LA MAR","ANCO","050502"]
[null,null,null,null,null,null,null,"AYACUCHO LA MAR AYNA",{"$f":"IF(AND(ING!$D$21=J485,ING!$V$21=K485),I484+1,0)","v":0},"AYACUCHO","LA MAR","AYNA","050503"]
[null,null,null,null,null,null,null,"AYACUCHO LA MAR CHILCAS",{"$f":"IF(AND(ING!$D$21=J486,ING!$V$21=K486),I485+1,0)","v":0},"AYACUCHO","LA MAR","CHILCAS","050504"]
[null,null,null,null,null,null,null,"AYACUCHO LA MAR CHUNGUI",{"$f":"IF(AND(ING!$D$21=J487,ING!$V$21=K487),I486+1,0)","v":0},"AYACUCHO","LA MAR","CHUNGUI","050505"]
[null,null,null,null,null,null,null,"AYACUCHO LA MAR LUIS CARRANZA",{"$f":"IF(AND(ING!$D$21=J488,ING!$V$21=K488),I487+1,0)","v":0},"AYACUCHO","LA MAR","LUIS CARRANZA","050506"]
[null,null,null,null,null,null,null,"AYACUCHO LA MAR ORONCCOY",{"$f":"IF(AND(ING!$D$21=J489,ING!$V$21=K489),I488+1,0)","v":0},"AYACUCHO","LA MAR","ORONCCOY","050511"]
[null,null,null,null,null,null,null,"AYACUCHO LA MAR SAMUGARI",{"$f":"IF(AND(ING!$D$21=J490,ING!$V$21=K490),I489+1,0)","v":0},"AYACUCHO","LA MAR","SAMUGARI","050509"]
[null,null,null,null,null,null,null,"AYACUCHO LA MAR SAN MIGUEL",{"$f":"IF(AND(ING!$D$21=J491,ING!$V$21=K491),I490+1,0)","v":0},"AYACUCHO","LA MAR","SAN MIGUEL","050501"]
[null,null,null,null,null,null,null,"AYACUCHO LA MAR SANTA ROSA",{"$f":"IF(AND(ING!$D$21=J492,ING!$V$21=K492),I491+1,0)","v":0},"AYACUCHO","LA MAR","SANTA ROSA","050507"]
[null,null,null,null,null,null,null,"AYACUCHO LA MAR TAMBO",{"$f":"IF(AND(ING!$D$21=J493,ING!$V$21=K493),I492+1,0)","v":0},"AYACUCHO","LA MAR","TAMBO","050508"]
[null,null,null,null,null,null,null,"AYACUCHO LUCANAS AUCARA",{"$f":"IF(AND(ING!$D$21=J494,ING!$V$21=K494),I493+1,0)","v":0},"AYACUCHO","LUCANAS","AUCARA","050602"]
[null,null,null,null,null,null,null,"AYACUCHO LUCANAS CABANA",{"$f":"IF(AND(ING!$D$21=J495,ING!$V$21=K495),I494+1,0)","v":0},"AYACUCHO","LUCANAS","CABANA","050603"]
[null,null,null,null,null,null,null,"AYACUCHO LUCANAS CARMEN SALCEDO",{"$f":"IF(AND(ING!$D$21=J496,ING!$V$21=K496),I495+1,0)","v":0},"AYACUCHO","LUCANAS","CARMEN SALCEDO","050604"]
[null,null,null,null,null,null,null,"AYACUCHO LUCANAS CHAVIÑA",{"$f":"IF(AND(ING!$D$21=J497,ING!$V$21=K497),I496+1,0)","v":0},"AYACUCHO","LUCANAS","CHAVIÑA","050605"]
[null,null,null,null,null,null,null,"AYACUCHO LUCANAS CHIPAO",{"$f":"IF(AND(ING!$D$21=J498,ING!$V$21=K498),I497+1,0)","v":0},"AYACUCHO","LUCANAS","CHIPAO","050606"]
[null,null,null,null,null,null,null,"AYACUCHO LUCANAS HUAC-HUAS",{"$f":"IF(AND(ING!$D$21=J499,ING!$V$21=K499),I498+1,0)","v":0},"AYACUCHO","LUCANAS","HUAC-HUAS","050607"]
[null,null,null,null,null,null,null,"AYACUCHO LUCANAS LARAMATE",{"$f":"IF(AND(ING!$D$21=J500,ING!$V$21=K500),I499+1,0)","v":0},"AYACUCHO","LUCANAS","LARAMATE","050608"]
[null,null,null,null,null,null,null,"AYACUCHO LUCANAS LEONCIO PRADO",{"$f":"IF(AND(ING!$D$21=J501,ING!$V$21=K501),I500+1,0)","v":0},"AYACUCHO","LUCANAS","LEONCIO PRADO","050609"]
[null,null,null,null,null,null,null,"AYACUCHO LUCANAS LLAUTA",{"$f":"IF(AND(ING!$D$21=J502,ING!$V$21=K502),I501+1,0)","v":0},"AYACUCHO","LUCANAS","LLAUTA","050610"]
[null,null,null,null,null,null,null,"AYACUCHO LUCANAS LUCANAS",{"$f":"IF(AND(ING!$D$21=J503,ING!$V$21=K503),I502+1,0)","v":0},"AYACUCHO","LUCANAS","LUCANAS","050611"]
[null,null,null,null,null,null,null,"AYACUCHO LUCANAS OCAÑA",{"$f":"IF(AND(ING!$D$21=J504,ING!$V$21=K504),I503+1,0)","v":0},"AYACUCHO","LUCANAS","OCAÑA","050612"]
[null,null,null,null,null,null,null,"AYACUCHO LUCANAS OTOCA",{"$f":"IF(AND(ING!$D$21=J505,ING!$V$21=K505),I504+1,0)","v":0},"AYACUCHO","LUCANAS","OTOCA","050613"]
[null,null,null,null,null,null,null,"AYACUCHO LUCANAS PUQUIO",{"$f":"IF(AND(ING!$D$21=J506,ING!$V$21=K506),I505+1,0)","v":0},"AYACUCHO","LUCANAS","PUQUIO","050601"]
[null,null,null,null,null,null,null,"AYACUCHO LUCANAS SAISA",{"$f":"IF(AND(ING!$D$21=J507,ING!$V$21=K507),I506+1,0)","v":0},"AYACUCHO","LUCANAS","SAISA","050614"]
[null,null,null,null,null,null,null,"AYACUCHO LUCANAS SAN CRISTOBAL",{"$f":"IF(AND(ING!$D$21=J508,ING!$V$21=K508),I507+1,0)","v":0},"AYACUCHO","LUCANAS","SAN CRISTOBAL","050615"]
[null,null,null,null,null,null,null,"AYACUCHO LUCANAS SAN JUAN",{"$f":"IF(AND(ING!$D$21=J509,ING!$V$21=K509),I508+1,0)","v":0},"AYACUCHO","LUCANAS","SAN JUAN","050616"]
[null,null,null,null,null,null,null,"AYACUCHO LUCANAS SAN PEDRO",{"$f":"IF(AND(ING!$D$21=J510,ING!$V$21=K510),I509+1,0)","v":0},"AYACUCHO","LUCANAS","SAN PEDRO","050617"]
[null,null,null,null,null,null,null,"AYACUCHO LUCANAS SAN PEDRO DE PALCO",{"$f":"IF(AND(ING!$D$21=J511,ING!$V$21=K511),I510+1,0)","v":0},"AYACUCHO","LUCANAS","SAN PEDRO DE PALCO","050618"]
[null,null,null,null,null,null,null,"AYACUCHO LUCANAS SANCOS",{"$f":"IF(AND(ING!$D$21=J512,ING!$V$21=K512),I511+1,0)","v":0},"AYACUCHO","LUCANAS","SANCOS","050619"]
[null,null,null,null,null,null,null,"AYACUCHO LUCANAS SANTA ANA DE HUAYCAHUACHO",{"$f":"IF(AND(ING!$D$21=J513,ING!$V$21=K513),I512+1,0)","v":0},"AYACUCHO","LUCANAS","SANTA ANA DE HUAYCAHUACHO","050620"]
[null,null,null,null,null,null,null,"AYACUCHO LUCANAS SANTA LUCIA",{"$f":"IF(AND(ING!$D$21=J514,ING!$V$21=K514),I513+1,0)","v":0},"AYACUCHO","LUCANAS","SANTA LUCIA","050621"]
[null,null,null,null,null,null,null,{"$f":"J515&\" \"&K515&\" \"&L515","v":"AYACUCHO PARINACOCHAS CHUMPI"},{"$f":"IF(AND(ING!$D$21=J515,ING!$V$21=K515),I514+1,0)","v":0},"AYACUCHO","PARINACOCHAS","CHUMPI","050702"]
[null,null,null,null,null,null,null,"AYACUCHO PARINACOCHAS CORACORA",{"$f":"IF(AND(ING!$D$21=J516,ING!$V$21=K516),I515+1,0)","v":0},"AYACUCHO","PARINACOCHAS","CORACORA","050701"]
[null,null,null,null,null,null,null,"AYACUCHO PARINACOCHAS CORONEL CASTAÑEDA",{"$f":"IF(AND(ING!$D$21=J517,ING!$V$21=K517),I516+1,0)","v":0},"AYACUCHO","PARINACOCHAS","CORONEL CASTAÑEDA","050703"]
[null,null,null,null,null,null,null,"AYACUCHO PARINACOCHAS PACAPAUSA",{"$f":"IF(AND(ING!$D$21=J518,ING!$V$21=K518),I517+1,0)","v":0},"AYACUCHO","PARINACOCHAS","PACAPAUSA","050704"]
[null,null,null,null,null,null,null,"AYACUCHO PARINACOCHAS PULLO",{"$f":"IF(AND(ING!$D$21=J519,ING!$V$21=K519),I518+1,0)","v":0},"AYACUCHO","PARINACOCHAS","PULLO","050705"]
[null,null,null,null,null,null,null,"AYACUCHO PARINACOCHAS PUYUSCA",{"$f":"IF(AND(ING!$D$21=J520,ING!$V$21=K520),I519+1,0)","v":0},"AYACUCHO","PARINACOCHAS","PUYUSCA","050706"]
[null,null,null,null,null,null,null,"AYACUCHO PARINACOCHAS SAN FRANCISCO DE RAVACAYCO",{"$f":"IF(AND(ING!$D$21=J521,ING!$V$21=K521),I520+1,0)","v":0},"AYACUCHO","PARINACOCHAS","SAN FRANCISCO DE RAVACAYCO","050707"]
[null,null,null,null,null,null,null,"AYACUCHO PARINACOCHAS UPAHUACHO",{"$f":"IF(AND(ING!$D$21=J522,ING!$V$21=K522),I521+1,0)","v":0},"AYACUCHO","PARINACOCHAS","UPAHUACHO","050708"]
[null,null,null,null,null,null,null,"AYACUCHO PAUCAR DEL SARA SARA COLTA",{"$f":"IF(AND(ING!$D$21=J523,ING!$V$21=K523),I522+1,0)","v":0},"AYACUCHO","PAUCAR DEL SARA SARA","COLTA","050802"]
[null,null,null,null,null,null,null,"AYACUCHO PAUCAR DEL SARA SARA CORCULLA",{"$f":"IF(AND(ING!$D$21=J524,ING!$V$21=K524),I523+1,0)","v":0},"AYACUCHO","PAUCAR DEL SARA SARA","CORCULLA","050803"]
[null,null,null,null,null,null,null,"AYACUCHO PAUCAR DEL SARA SARA LAMPA",{"$f":"IF(AND(ING!$D$21=J525,ING!$V$21=K525),I524+1,0)","v":0},"AYACUCHO","PAUCAR DEL SARA SARA","LAMPA","050804"]
[null,null,null,null,null,null,null,"AYACUCHO PAUCAR DEL SARA SARA MARCABAMBA",{"$f":"IF(AND(ING!$D$21=J526,ING!$V$21=K526),I525+1,0)","v":0},"AYACUCHO","PAUCAR DEL SARA SARA","MARCABAMBA","050805"]
[null,null,null,null,null,null,null,"AYACUCHO PAUCAR DEL SARA SARA OYOLO",{"$f":"IF(AND(ING!$D$21=J527,ING!$V$21=K527),I526+1,0)","v":0},"AYACUCHO","PAUCAR DEL SARA SARA","OYOLO","050806"]
[null,null,null,null,null,null,null,"AYACUCHO PAUCAR DEL SARA SARA PARARCA",{"$f":"IF(AND(ING!$D$21=J528,ING!$V$21=K528),I527+1,0)","v":0},"AYACUCHO","PAUCAR DEL SARA SARA","PARARCA","050807"]
[null,null,null,null,null,null,null,"AYACUCHO PAUCAR DEL SARA SARA PAUSA",{"$f":"IF(AND(ING!$D$21=J529,ING!$V$21=K529),I528+1,0)","v":0},"AYACUCHO","PAUCAR DEL SARA SARA","PAUSA","050801"]
[null,null,null,null,null,null,null,"AYACUCHO PAUCAR DEL SARA SARA SAN JAVIER DE ALPABAMBA",{"$f":"IF(AND(ING!$D$21=J530,ING!$V$21=K530),I529+1,0)","v":0},"AYACUCHO","PAUCAR DEL SARA SARA","SAN JAVIER DE ALPABAMBA","050808"]
[null,null,null,null,null,null,null,"AYACUCHO PAUCAR DEL SARA SARA SAN JOSE DE USHUA",{"$f":"IF(AND(ING!$D$21=J531,ING!$V$21=K531),I530+1,0)","v":0},"AYACUCHO","PAUCAR DEL SARA SARA","SAN JOSE DE USHUA","050809"]
[null,null,null,null,null,null,null,"AYACUCHO PAUCAR DEL SARA SARA SARA SARA",{"$f":"IF(AND(ING!$D$21=J532,ING!$V$21=K532),I531+1,0)","v":0},"AYACUCHO","PAUCAR DEL SARA SARA","SARA SARA","050810"]
[null,null,null,null,null,null,null,"AYACUCHO SUCRE BELEN",{"$f":"IF(AND(ING!$D$21=J533,ING!$V$21=K533),I532+1,0)","v":0},"AYACUCHO","SUCRE","BELEN","050902"]
[null,null,null,null,null,null,null,"AYACUCHO SUCRE CHALCOS",{"$f":"IF(AND(ING!$D$21=J534,ING!$V$21=K534),I533+1,0)","v":0},"AYACUCHO","SUCRE","CHALCOS","050903"]
[null,null,null,null,null,null,null,"AYACUCHO SUCRE CHILCAYOC",{"$f":"IF(AND(ING!$D$21=J535,ING!$V$21=K535),I534+1,0)","v":0},"AYACUCHO","SUCRE","CHILCAYOC","050904"]
[null,null,null,null,null,null,null,"AYACUCHO SUCRE HUACAÑA",{"$f":"IF(AND(ING!$D$21=J536,ING!$V$21=K536),I535+1,0)","v":0},"AYACUCHO","SUCRE","HUACAÑA","050905"]
[null,null,null,null,null,null,null,"AYACUCHO SUCRE MORCOLLA",{"$f":"IF(AND(ING!$D$21=J537,ING!$V$21=K537),I536+1,0)","v":0},"AYACUCHO","SUCRE","MORCOLLA","050906"]
[null,null,null,null,null,null,null,"AYACUCHO SUCRE PAICO",{"$f":"IF(AND(ING!$D$21=J538,ING!$V$21=K538),I537+1,0)","v":0},"AYACUCHO","SUCRE","PAICO","050907"]
[null,null,null,null,null,null,null,"AYACUCHO SUCRE QUEROBAMBA",{"$f":"IF(AND(ING!$D$21=J539,ING!$V$21=K539),I538+1,0)","v":0},"AYACUCHO","SUCRE","QUEROBAMBA","050901"]
[null,null,null,null,null,null,null,"AYACUCHO SUCRE SAN PEDRO DE LARCAY",{"$f":"IF(AND(ING!$D$21=J540,ING!$V$21=K540),I539+1,0)","v":0},"AYACUCHO","SUCRE","SAN PEDRO DE LARCAY","050908"]
[null,null,null,null,null,null,null,"AYACUCHO SUCRE SAN SALVADOR DE QUIJE",{"$f":"IF(AND(ING!$D$21=J541,ING!$V$21=K541),I540+1,0)","v":0},"AYACUCHO","SUCRE","SAN SALVADOR DE QUIJE","050909"]
[null,null,null,null,null,null,null,"AYACUCHO SUCRE SANTIAGO DE PAUCARAY",{"$f":"IF(AND(ING!$D$21=J542,ING!$V$21=K542),I541+1,0)","v":0},"AYACUCHO","SUCRE","SANTIAGO DE PAUCARAY","050910"]
[null,null,null,null,null,null,null,"AYACUCHO SUCRE SORAS",{"$f":"IF(AND(ING!$D$21=J543,ING!$V$21=K543),I542+1,0)","v":0},"AYACUCHO","SUCRE","SORAS","050911"]
[null,null,null,null,null,null,null,"AYACUCHO VICTOR FAJARDO ALCAMENCA",{"$f":"IF(AND(ING!$D$21=J544,ING!$V$21=K544),I543+1,0)","v":0},"AYACUCHO","VICTOR FAJARDO","ALCAMENCA","051002"]
[null,null,null,null,null,null,null,"AYACUCHO VICTOR FAJARDO APONGO",{"$f":"IF(AND(ING!$D$21=J545,ING!$V$21=K545),I544+1,0)","v":0},"AYACUCHO","VICTOR FAJARDO","APONGO","051003"]
[null,null,null,null,null,null,null,"AYACUCHO VICTOR FAJARDO ASQUIPATA",{"$f":"IF(AND(ING!$D$21=J546,ING!$V$21=K546),I545+1,0)","v":0},"AYACUCHO","VICTOR FAJARDO","ASQUIPATA","051004"]
[null,null,null,null,null,null,null,"AYACUCHO VICTOR FAJARDO CANARIA",{"$f":"IF(AND(ING!$D$21=J547,ING!$V$21=K547),I546+1,0)","v":0},"AYACUCHO","VICTOR FAJARDO","CANARIA","051005"]
[null,null,null,null,null,null,null,"AYACUCHO VICTOR FAJARDO CAYARA",{"$f":"IF(AND(ING!$D$21=J548,ING!$V$21=K548),I547+1,0)","v":0},"AYACUCHO","VICTOR FAJARDO","CAYARA","051006"]
[null,null,null,null,null,null,null,"AYACUCHO VICTOR FAJARDO COLCA",{"$f":"IF(AND(ING!$D$21=J549,ING!$V$21=K549),I548+1,0)","v":0},"AYACUCHO","VICTOR FAJARDO","COLCA","051007"]
[null,null,null,null,null,null,null,"AYACUCHO VICTOR FAJARDO HUAMANQUIQUIA",{"$f":"IF(AND(ING!$D$21=J550,ING!$V$21=K550),I549+1,0)","v":0},"AYACUCHO","VICTOR FAJARDO","HUAMANQUIQUIA","051008"]
[null,null,null,null,null,null,null,"AYACUCHO VICTOR FAJARDO HUANCAPI",{"$f":"IF(AND(ING!$D$21=J551,ING!$V$21=K551),I550+1,0)","v":0},"AYACUCHO","VICTOR FAJARDO","HUANCAPI","051001"]
[null,null,null,null,null,null,null,"AYACUCHO VICTOR FAJARDO HUANCARAYLLA",{"$f":"IF(AND(ING!$D$21=J552,ING!$V$21=K552),I551+1,0)","v":0},"AYACUCHO","VICTOR FAJARDO","HUANCARAYLLA","051009"]
[null,null,null,null,null,null,null,"AYACUCHO VICTOR FAJARDO HUAYA",{"$f":"IF(AND(ING!$D$21=J553,ING!$V$21=K553),I552+1,0)","v":0},"AYACUCHO","VICTOR FAJARDO","HUAYA","051010"]
[null,null,null,null,null,null,null,"AYACUCHO VICTOR FAJARDO SARHUA",{"$f":"IF(AND(ING!$D$21=J554,ING!$V$21=K554),I553+1,0)","v":0},"AYACUCHO","VICTOR FAJARDO","SARHUA","051011"]
[null,null,null,null,null,null,null,"AYACUCHO VICTOR FAJARDO VILCANCHOS",{"$f":"IF(AND(ING!$D$21=J555,ING!$V$21=K555),I554+1,0)","v":0},"AYACUCHO","VICTOR FAJARDO","VILCANCHOS","051012"]
[null,null,null,null,null,null,null,"AYACUCHO VILCAS HUAMAN ACCOMARCA",{"$f":"IF(AND(ING!$D$21=J556,ING!$V$21=K556),I555+1,0)","v":0},"AYACUCHO","VILCAS HUAMAN","ACCOMARCA","051102"]
[null,null,null,null,null,null,null,"AYACUCHO VILCAS HUAMAN CARHUANCA",{"$f":"IF(AND(ING!$D$21=J557,ING!$V$21=K557),I556+1,0)","v":0},"AYACUCHO","VILCAS HUAMAN","CARHUANCA","051103"]
[null,null,null,null,null,null,null,"AYACUCHO VILCAS HUAMAN CONCEPCION",{"$f":"IF(AND(ING!$D$21=J558,ING!$V$21=K558),I557+1,0)","v":0},"AYACUCHO","VILCAS HUAMAN","CONCEPCION","051104"]
[null,null,null,null,null,null,null,"AYACUCHO VILCAS HUAMAN HUAMBALPA",{"$f":"IF(AND(ING!$D$21=J559,ING!$V$21=K559),I558+1,0)","v":0},"AYACUCHO","VILCAS HUAMAN","HUAMBALPA","051105"]
[null,null,null,null,null,null,null,"AYACUCHO VILCAS HUAMAN INDEPENDENCIA",{"$f":"IF(AND(ING!$D$21=J560,ING!$V$21=K560),I559+1,0)","v":0},"AYACUCHO","VILCAS HUAMAN","INDEPENDENCIA","051106"]
[null,null,null,null,null,null,null,"AYACUCHO VILCAS HUAMAN SAURAMA",{"$f":"IF(AND(ING!$D$21=J561,ING!$V$21=K561),I560+1,0)","v":0},"AYACUCHO","VILCAS HUAMAN","SAURAMA","051107"]
[null,null,null,null,null,null,null,"AYACUCHO VILCAS HUAMAN VILCAS HUAMAN",{"$f":"IF(AND(ING!$D$21=J562,ING!$V$21=K562),I561+1,0)","v":0},"AYACUCHO","VILCAS HUAMAN","VILCAS HUAMAN","051101"]
[null,null,null,null,null,null,null,"AYACUCHO VILCAS HUAMAN VISCHONGO",{"$f":"IF(AND(ING!$D$21=J563,ING!$V$21=K563),I562+1,0)","v":0},"AYACUCHO","VILCAS HUAMAN","VISCHONGO","051108"]
[null,null,null,null,null,null,null,"CAJAMARCA CAJABAMBA CACHACHI",{"$f":"IF(AND(ING!$D$21=J564,ING!$V$21=K564),I563+1,0)","v":0},"CAJAMARCA","CAJABAMBA","CACHACHI","060202"]
[null,null,null,null,null,null,null,"CAJAMARCA CAJABAMBA CAJABAMBA",{"$f":"IF(AND(ING!$D$21=J565,ING!$V$21=K565),I564+1,0)","v":0},"CAJAMARCA","CAJABAMBA","CAJABAMBA","060201"]
[null,null,null,null,null,null,null,"CAJAMARCA CAJABAMBA CONDEBAMBA",{"$f":"IF(AND(ING!$D$21=J566,ING!$V$21=K566),I565+1,0)","v":0},"CAJAMARCA","CAJABAMBA","CONDEBAMBA","060203"]
[null,null,null,null,null,null,null,"CAJAMARCA CAJABAMBA SITACOCHA",{"$f":"IF(AND(ING!$D$21=J567,ING!$V$21=K567),I566+1,0)","v":0},"CAJAMARCA","CAJABAMBA","SITACOCHA","060204"]
[null,null,null,null,null,null,null,"CAJAMARCA CAJAMARCA ASUNCION",{"$f":"IF(AND(ING!$D$21=J568,ING!$V$21=K568),I567+1,0)","v":0},"CAJAMARCA","CAJAMARCA","ASUNCION","060102"]
[null,null,null,null,null,null,null,"CAJAMARCA CAJAMARCA CAJAMARCA",{"$f":"IF(AND(ING!$D$21=J569,ING!$V$21=K569),I568+1,0)","v":0},"CAJAMARCA","CAJAMARCA","CAJAMARCA","060101"]
[null,null,null,null,null,null,null,"CAJAMARCA CAJAMARCA CHETILLA",{"$f":"IF(AND(ING!$D$21=J570,ING!$V$21=K570),I569+1,0)","v":0},"CAJAMARCA","CAJAMARCA","CHETILLA","060103"]
[null,null,null,null,null,null,null,"CAJAMARCA CAJAMARCA COSPAN",{"$f":"IF(AND(ING!$D$21=J571,ING!$V$21=K571),I570+1,0)","v":0},"CAJAMARCA","CAJAMARCA","COSPAN","060104"]
[null,null,null,null,null,null,null,"CAJAMARCA CAJAMARCA ENCAÑADA",{"$f":"IF(AND(ING!$D$21=J572,ING!$V$21=K572),I571+1,0)","v":0},"CAJAMARCA","CAJAMARCA","ENCAÑADA","060105"]
[null,null,null,null,null,null,null,"CAJAMARCA CAJAMARCA JESUS",{"$f":"IF(AND(ING!$D$21=J573,ING!$V$21=K573),I572+1,0)","v":0},"CAJAMARCA","CAJAMARCA","JESUS","060106"]
[null,null,null,null,null,null,null,"CAJAMARCA CAJAMARCA LLACANORA",{"$f":"IF(AND(ING!$D$21=J574,ING!$V$21=K574),I573+1,0)","v":0},"CAJAMARCA","CAJAMARCA","LLACANORA","060107"]
[null,null,null,null,null,null,null,"CAJAMARCA CAJAMARCA LOS BAÑOS DEL INCA",{"$f":"IF(AND(ING!$D$21=J575,ING!$V$21=K575),I574+1,0)","v":0},"CAJAMARCA","CAJAMARCA","LOS BAÑOS DEL INCA","060108"]
[null,null,null,null,null,null,null,"CAJAMARCA CAJAMARCA MAGDALENA",{"$f":"IF(AND(ING!$D$21=J576,ING!$V$21=K576),I575+1,0)","v":0},"CAJAMARCA","CAJAMARCA","MAGDALENA","060109"]
[null,null,null,null,null,null,null,"CAJAMARCA CAJAMARCA MATARA",{"$f":"IF(AND(ING!$D$21=J577,ING!$V$21=K577),I576+1,0)","v":0},"CAJAMARCA","CAJAMARCA","MATARA","060110"]
[null,null,null,null,null,null,null,"CAJAMARCA CAJAMARCA NAMORA",{"$f":"IF(AND(ING!$D$21=J578,ING!$V$21=K578),I577+1,0)","v":0},"CAJAMARCA","CAJAMARCA","NAMORA","060111"]
[null,null,null,null,null,null,null,{"$f":"J579&\" \"&K579&\" \"&L579","v":"CAJAMARCA CAJAMARCA SAN JUAN"},{"$f":"IF(AND(ING!$D$21=J579,ING!$V$21=K579),I578+1,0)","v":0},"CAJAMARCA","CAJAMARCA","SAN JUAN","060112"]
[null,null,null,null,null,null,null,"CAJAMARCA CELENDIN CELENDIN",{"$f":"IF(AND(ING!$D$21=J580,ING!$V$21=K580),I579+1,0)","v":0},"CAJAMARCA","CELENDIN","CELENDIN","060301"]
[null,null,null,null,null,null,null,"CAJAMARCA CELENDIN CHUMUCH",{"$f":"IF(AND(ING!$D$21=J581,ING!$V$21=K581),I580+1,0)","v":0},"CAJAMARCA","CELENDIN","CHUMUCH","060302"]
[null,null,null,null,null,null,null,"CAJAMARCA CELENDIN CORTEGANA",{"$f":"IF(AND(ING!$D$21=J582,ING!$V$21=K582),I581+1,0)","v":0},"CAJAMARCA","CELENDIN","CORTEGANA","060303"]
[null,null,null,null,null,null,null,"CAJAMARCA CELENDIN HUASMIN",{"$f":"IF(AND(ING!$D$21=J583,ING!$V$21=K583),I582+1,0)","v":0},"CAJAMARCA","CELENDIN","HUASMIN","060304"]
[null,null,null,null,null,null,null,"CAJAMARCA CELENDIN JORGE CHAVEZ",{"$f":"IF(AND(ING!$D$21=J584,ING!$V$21=K584),I583+1,0)","v":0},"CAJAMARCA","CELENDIN","JORGE CHAVEZ","060305"]
[null,null,null,null,null,null,null,"CAJAMARCA CELENDIN JOSE GALVEZ",{"$f":"IF(AND(ING!$D$21=J585,ING!$V$21=K585),I584+1,0)","v":0},"CAJAMARCA","CELENDIN","JOSE GALVEZ","060306"]
[null,null,null,null,null,null,null,"CAJAMARCA CELENDIN LA LIBERTAD DE PALLAN",{"$f":"IF(AND(ING!$D$21=J586,ING!$V$21=K586),I585+1,0)","v":0},"CAJAMARCA","CELENDIN","LA LIBERTAD DE PALLAN","060312"]
[null,null,null,null,null,null,null,"CAJAMARCA CELENDIN MIGUEL IGLESIAS",{"$f":"IF(AND(ING!$D$21=J587,ING!$V$21=K587),I586+1,0)","v":0},"CAJAMARCA","CELENDIN","MIGUEL IGLESIAS","060307"]
[null,null,null,null,null,null,null,"CAJAMARCA CELENDIN OXAMARCA",{"$f":"IF(AND(ING!$D$21=J588,ING!$V$21=K588),I587+1,0)","v":0},"CAJAMARCA","CELENDIN","OXAMARCA","060308"]
[null,null,null,null,null,null,null,"CAJAMARCA CELENDIN SOROCHUCO",{"$f":"IF(AND(ING!$D$21=J589,ING!$V$21=K589),I588+1,0)","v":0},"CAJAMARCA","CELENDIN","SOROCHUCO","060309"]
[null,null,null,null,null,null,null,"CAJAMARCA CELENDIN SUCRE",{"$f":"IF(AND(ING!$D$21=J590,ING!$V$21=K590),I589+1,0)","v":0},"CAJAMARCA","CELENDIN","SUCRE","060310"]
[null,null,null,null,null,null,null,"CAJAMARCA CELENDIN UTCO",{"$f":"IF(AND(ING!$D$21=J591,ING!$V$21=K591),I590+1,0)","v":0},"CAJAMARCA","CELENDIN","UTCO","060311"]
[null,null,null,null,null,null,null,"CAJAMARCA CHOTA ANGUIA",{"$f":"IF(AND(ING!$D$21=J592,ING!$V$21=K592),I591+1,0)","v":0},"CAJAMARCA","CHOTA","ANGUIA","060402"]
[null,null,null,null,null,null,null,"CAJAMARCA CHOTA CHADIN",{"$f":"IF(AND(ING!$D$21=J593,ING!$V$21=K593),I592+1,0)","v":0},"CAJAMARCA","CHOTA","CHADIN","060403"]
[null,null,null,null,null,null,null,"CAJAMARCA CHOTA CHALAMARCA",{"$f":"IF(AND(ING!$D$21=J594,ING!$V$21=K594),I593+1,0)","v":0},"CAJAMARCA","CHOTA","CHALAMARCA","060419"]
[null,null,null,null,null,null,null,"CAJAMARCA CHOTA CHIGUIRIP",{"$f":"IF(AND(ING!$D$21=J595,ING!$V$21=K595),I594+1,0)","v":0},"CAJAMARCA","CHOTA","CHIGUIRIP","060404"]
[null,null,null,null,null,null,null,"CAJAMARCA CHOTA CHIMBAN",{"$f":"IF(AND(ING!$D$21=J596,ING!$V$21=K596),I595+1,0)","v":0},"CAJAMARCA","CHOTA","CHIMBAN","060405"]
[null,null,null,null,null,null,null,"CAJAMARCA CHOTA CHOROPAMPA",{"$f":"IF(AND(ING!$D$21=J597,ING!$V$21=K597),I596+1,0)","v":0},"CAJAMARCA","CHOTA","CHOROPAMPA","060406"]
[null,null,null,null,null,null,null,"CAJAMARCA CHOTA CHOTA",{"$f":"IF(AND(ING!$D$21=J598,ING!$V$21=K598),I597+1,0)","v":0},"CAJAMARCA","CHOTA","CHOTA","060401"]
[null,null,null,null,null,null,null,"CAJAMARCA CHOTA COCHABAMBA",{"$f":"IF(AND(ING!$D$21=J599,ING!$V$21=K599),I598+1,0)","v":0},"CAJAMARCA","CHOTA","COCHABAMBA","060407"]
[null,null,null,null,null,null,null,"CAJAMARCA CHOTA CONCHAN",{"$f":"IF(AND(ING!$D$21=J600,ING!$V$21=K600),I599+1,0)","v":0},"CAJAMARCA","CHOTA","CONCHAN","060408"]
[null,null,null,null,null,null,null,"CAJAMARCA CHOTA HUAMBOS",{"$f":"IF(AND(ING!$D$21=J601,ING!$V$21=K601),I600+1,0)","v":0},"CAJAMARCA","CHOTA","HUAMBOS","060409"]
[null,null,null,null,null,null,null,"CAJAMARCA CHOTA LAJAS",{"$f":"IF(AND(ING!$D$21=J602,ING!$V$21=K602),I601+1,0)","v":0},"CAJAMARCA","CHOTA","LAJAS","060410"]
[null,null,null,null,null,null,null,"CAJAMARCA CHOTA LLAMA",{"$f":"IF(AND(ING!$D$21=J603,ING!$V$21=K603),I602+1,0)","v":0},"CAJAMARCA","CHOTA","LLAMA","060411"]
[null,null,null,null,null,null,null,"CAJAMARCA CHOTA MIRACOSTA",{"$f":"IF(AND(ING!$D$21=J604,ING!$V$21=K604),I603+1,0)","v":0},"CAJAMARCA","CHOTA","MIRACOSTA","060412"]
[null,null,null,null,null,null,null,"CAJAMARCA CHOTA PACCHA",{"$f":"IF(AND(ING!$D$21=J605,ING!$V$21=K605),I604+1,0)","v":0},"CAJAMARCA","CHOTA","PACCHA","060413"]
[null,null,null,null,null,null,null,"CAJAMARCA CHOTA PION",{"$f":"IF(AND(ING!$D$21=J606,ING!$V$21=K606),I605+1,0)","v":0},"CAJAMARCA","CHOTA","PION","060414"]
[null,null,null,null,null,null,null,"CAJAMARCA CHOTA QUEROCOTO",{"$f":"IF(AND(ING!$D$21=J607,ING!$V$21=K607),I606+1,0)","v":0},"CAJAMARCA","CHOTA","QUEROCOTO","060415"]
[null,null,null,null,null,null,null,"CAJAMARCA CHOTA SAN JUAN DE LICUPIS",{"$f":"IF(AND(ING!$D$21=J608,ING!$V$21=K608),I607+1,0)","v":0},"CAJAMARCA","CHOTA","SAN JUAN DE LICUPIS","060416"]
[null,null,null,null,null,null,null,"CAJAMARCA CHOTA TACABAMBA",{"$f":"IF(AND(ING!$D$21=J609,ING!$V$21=K609),I608+1,0)","v":0},"CAJAMARCA","CHOTA","TACABAMBA","060417"]
[null,null,null,null,null,null,null,"CAJAMARCA CHOTA TOCMOCHE",{"$f":"IF(AND(ING!$D$21=J610,ING!$V$21=K610),I609+1,0)","v":0},"CAJAMARCA","CHOTA","TOCMOCHE","060418"]
[null,null,null,null,null,null,null,"CAJAMARCA CONTUMAZA CHILETE",{"$f":"IF(AND(ING!$D$21=J611,ING!$V$21=K611),I610+1,0)","v":0},"CAJAMARCA","CONTUMAZA","CHILETE","060502"]
[null,null,null,null,null,null,null,"CAJAMARCA CONTUMAZA CONTUMAZA",{"$f":"IF(AND(ING!$D$21=J612,ING!$V$21=K612),I611+1,0)","v":0},"CAJAMARCA","CONTUMAZA","CONTUMAZA","060501"]
[null,null,null,null,null,null,null,"CAJAMARCA CONTUMAZA CUPISNIQUE",{"$f":"IF(AND(ING!$D$21=J613,ING!$V$21=K613),I612+1,0)","v":0},"CAJAMARCA","CONTUMAZA","CUPISNIQUE","060503"]
[null,null,null,null,null,null,null,"CAJAMARCA CONTUMAZA GUZMANGO",{"$f":"IF(AND(ING!$D$21=J614,ING!$V$21=K614),I613+1,0)","v":0},"CAJAMARCA","CONTUMAZA","GUZMANGO","060504"]
[null,null,null,null,null,null,null,"CAJAMARCA CONTUMAZA SAN BENITO",{"$f":"IF(AND(ING!$D$21=J615,ING!$V$21=K615),I614+1,0)","v":0},"CAJAMARCA","CONTUMAZA","SAN BENITO","060505"]
[null,null,null,null,null,null,null,"CAJAMARCA CONTUMAZA SANTA CRUZ DE TOLED",{"$f":"IF(AND(ING!$D$21=J616,ING!$V$21=K616),I615+1,0)","v":0},"CAJAMARCA","CONTUMAZA","SANTA CRUZ DE TOLED","060506"]
[null,null,null,null,null,null,null,"CAJAMARCA CONTUMAZA TANTARICA",{"$f":"IF(AND(ING!$D$21=J617,ING!$V$21=K617),I616+1,0)","v":0},"CAJAMARCA","CONTUMAZA","TANTARICA","060507"]
[null,null,null,null,null,null,null,"CAJAMARCA CONTUMAZA YONAN",{"$f":"IF(AND(ING!$D$21=J618,ING!$V$21=K618),I617+1,0)","v":0},"CAJAMARCA","CONTUMAZA","YONAN","060508"]
[null,null,null,null,null,null,null,"CAJAMARCA CUTERVO CALLAYUC",{"$f":"IF(AND(ING!$D$21=J619,ING!$V$21=K619),I618+1,0)","v":0},"CAJAMARCA","CUTERVO","CALLAYUC","060602"]
[null,null,null,null,null,null,null,"CAJAMARCA CUTERVO CHOROS",{"$f":"IF(AND(ING!$D$21=J620,ING!$V$21=K620),I619+1,0)","v":0},"CAJAMARCA","CUTERVO","CHOROS","060603"]
[null,null,null,null,null,null,null,"CAJAMARCA CUTERVO CUJILLO",{"$f":"IF(AND(ING!$D$21=J621,ING!$V$21=K621),I620+1,0)","v":0},"CAJAMARCA","CUTERVO","CUJILLO","060604"]
[null,null,null,null,null,null,null,"CAJAMARCA CUTERVO CUTERVO",{"$f":"IF(AND(ING!$D$21=J622,ING!$V$21=K622),I621+1,0)","v":0},"CAJAMARCA","CUTERVO","CUTERVO","060601"]
[null,null,null,null,null,null,null,"CAJAMARCA CUTERVO LA RAMADA",{"$f":"IF(AND(ING!$D$21=J623,ING!$V$21=K623),I622+1,0)","v":0},"CAJAMARCA","CUTERVO","LA RAMADA","060605"]
[null,null,null,null,null,null,null,"CAJAMARCA CUTERVO PIMPINGOS",{"$f":"IF(AND(ING!$D$21=J624,ING!$V$21=K624),I623+1,0)","v":0},"CAJAMARCA","CUTERVO","PIMPINGOS","060606"]
[null,null,null,null,null,null,null,"CAJAMARCA CUTERVO QUEROCOTILLO",{"$f":"IF(AND(ING!$D$21=J625,ING!$V$21=K625),I624+1,0)","v":0},"CAJAMARCA","CUTERVO","QUEROCOTILLO","060607"]
[null,null,null,null,null,null,null,"CAJAMARCA CUTERVO SAN ANDRES DE CUTERVO",{"$f":"IF(AND(ING!$D$21=J626,ING!$V$21=K626),I625+1,0)","v":0},"CAJAMARCA","CUTERVO","SAN ANDRES DE CUTERVO","060608"]
[null,null,null,null,null,null,null,"CAJAMARCA CUTERVO SAN JUAN DE CUTERVO",{"$f":"IF(AND(ING!$D$21=J627,ING!$V$21=K627),I626+1,0)","v":0},"CAJAMARCA","CUTERVO","SAN JUAN DE CUTERVO","060609"]
[null,null,null,null,null,null,null,"CAJAMARCA CUTERVO SAN LUIS DE LUCMA",{"$f":"IF(AND(ING!$D$21=J628,ING!$V$21=K628),I627+1,0)","v":0},"CAJAMARCA","CUTERVO","SAN LUIS DE LUCMA","060610"]
[null,null,null,null,null,null,null,"CAJAMARCA CUTERVO SANTA CRUZ",{"$f":"IF(AND(ING!$D$21=J629,ING!$V$21=K629),I628+1,0)","v":0},"CAJAMARCA","CUTERVO","SANTA CRUZ","060611"]
[null,null,null,null,null,null,null,"CAJAMARCA CUTERVO SANTO DOMINGO DE LA CAPILLA",{"$f":"IF(AND(ING!$D$21=J630,ING!$V$21=K630),I629+1,0)","v":0},"CAJAMARCA","CUTERVO","SANTO DOMINGO DE LA CAPILLA","060612"]
[null,null,null,null,null,null,null,"CAJAMARCA CUTERVO SANTO TOMAS",{"$f":"IF(AND(ING!$D$21=J631,ING!$V$21=K631),I630+1,0)","v":0},"CAJAMARCA","CUTERVO","SANTO TOMAS","060613"]
[null,null,null,null,null,null,null,"CAJAMARCA CUTERVO SOCOTA",{"$f":"IF(AND(ING!$D$21=J632,ING!$V$21=K632),I631+1,0)","v":0},"CAJAMARCA","CUTERVO","SOCOTA","060614"]
[null,null,null,null,null,null,null,"CAJAMARCA CUTERVO TORIBIO CASANOVA",{"$f":"IF(AND(ING!$D$21=J633,ING!$V$21=K633),I632+1,0)","v":0},"CAJAMARCA","CUTERVO","TORIBIO CASANOVA","060615"]
[null,null,null,null,null,null,null,"CAJAMARCA HUALGAYOC BAMBAMARCA",{"$f":"IF(AND(ING!$D$21=J634,ING!$V$21=K634),I633+1,0)","v":0},"CAJAMARCA","HUALGAYOC","BAMBAMARCA","060701"]
[null,null,null,null,null,null,null,"CAJAMARCA HUALGAYOC CHUGUR",{"$f":"IF(AND(ING!$D$21=J635,ING!$V$21=K635),I634+1,0)","v":0},"CAJAMARCA","HUALGAYOC","CHUGUR","060702"]
[null,null,null,null,null,null,null,"CAJAMARCA HUALGAYOC HUALGAYOC",{"$f":"IF(AND(ING!$D$21=J636,ING!$V$21=K636),I635+1,0)","v":0},"CAJAMARCA","HUALGAYOC","HUALGAYOC","060703"]
[null,null,null,null,null,null,null,"CAJAMARCA JAEN BELLAVISTA",{"$f":"IF(AND(ING!$D$21=J637,ING!$V$21=K637),I636+1,0)","v":0},"CAJAMARCA","JAEN","BELLAVISTA","060802"]
[null,null,null,null,null,null,null,"CAJAMARCA JAEN CHONTALI",{"$f":"IF(AND(ING!$D$21=J638,ING!$V$21=K638),I637+1,0)","v":0},"CAJAMARCA","JAEN","CHONTALI","060803"]
[null,null,null,null,null,null,null,"CAJAMARCA JAEN COLASAY",{"$f":"IF(AND(ING!$D$21=J639,ING!$V$21=K639),I638+1,0)","v":0},"CAJAMARCA","JAEN","COLASAY","060804"]
[null,null,null,null,null,null,null,"CAJAMARCA JAEN HUABAL",{"$f":"IF(AND(ING!$D$21=J640,ING!$V$21=K640),I639+1,0)","v":0},"CAJAMARCA","JAEN","HUABAL","060805"]
[null,null,null,null,null,null,null,"CAJAMARCA JAEN JAEN",{"$f":"IF(AND(ING!$D$21=J641,ING!$V$21=K641),I640+1,0)","v":0},"CAJAMARCA","JAEN","JAEN","060801"]
[null,null,null,null,null,null,null,"CAJAMARCA JAEN LAS PIRIAS",{"$f":"IF(AND(ING!$D$21=J642,ING!$V$21=K642),I641+1,0)","v":0},"CAJAMARCA","JAEN","LAS PIRIAS","060806"]
[null,null,null,null,null,null,null,{"$f":"J643&\" \"&K643&\" \"&L643","v":"CAJAMARCA JAEN POMAHUACA"},{"$f":"IF(AND(ING!$D$21=J643,ING!$V$21=K643),I642+1,0)","v":0},"CAJAMARCA","JAEN","POMAHUACA","060807"]
[null,null,null,null,null,null,null,"CAJAMARCA JAEN PUCARA",{"$f":"IF(AND(ING!$D$21=J644,ING!$V$21=K644),I643+1,0)","v":0},"CAJAMARCA","JAEN","PUCARA","060808"]
[null,null,null,null,null,null,null,"CAJAMARCA JAEN SALLIQUE",{"$f":"IF(AND(ING!$D$21=J645,ING!$V$21=K645),I644+1,0)","v":0},"CAJAMARCA","JAEN","SALLIQUE","060809"]
[null,null,null,null,null,null,null,"CAJAMARCA JAEN SAN FELIPE",{"$f":"IF(AND(ING!$D$21=J646,ING!$V$21=K646),I645+1,0)","v":0},"CAJAMARCA","JAEN","SAN FELIPE","060810"]
[null,null,null,null,null,null,null,"CAJAMARCA JAEN SAN JOSE DEL ALTO",{"$f":"IF(AND(ING!$D$21=J647,ING!$V$21=K647),I646+1,0)","v":0},"CAJAMARCA","JAEN","SAN JOSE DEL ALTO","060811"]
[null,null,null,null,null,null,null,"CAJAMARCA JAEN SANTA ROSA",{"$f":"IF(AND(ING!$D$21=J648,ING!$V$21=K648),I647+1,0)","v":0},"CAJAMARCA","JAEN","SANTA ROSA","060812"]
[null,null,null,null,null,null,null,"CAJAMARCA SAN IGNACIO CHIRINOS",{"$f":"IF(AND(ING!$D$21=J649,ING!$V$21=K649),I648+1,0)","v":1},"CAJAMARCA","SAN IGNACIO","CHIRINOS","060902"]
[null,null,null,null,null,null,null,"CAJAMARCA SAN IGNACIO HUARANGO",{"$f":"IF(AND(ING!$D$21=J650,ING!$V$21=K650),I649+1,0)","v":2},"CAJAMARCA","SAN IGNACIO","HUARANGO","060903"]
[null,null,null,null,null,null,null,"CAJAMARCA SAN IGNACIO LA COIPA",{"$f":"IF(AND(ING!$D$21=J651,ING!$V$21=K651),I650+1,0)","v":3},"CAJAMARCA","SAN IGNACIO","LA COIPA","060904"]
[null,null,null,null,null,null,null,"CAJAMARCA SAN IGNACIO NAMBALLE",{"$f":"IF(AND(ING!$D$21=J652,ING!$V$21=K652),I651+1,0)","v":4},"CAJAMARCA","SAN IGNACIO","NAMBALLE","060905"]
[null,null,null,null,null,null,null,"CAJAMARCA SAN IGNACIO SAN IGNACIO",{"$f":"IF(AND(ING!$D$21=J653,ING!$V$21=K653),I652+1,0)","v":5},"CAJAMARCA","SAN IGNACIO","SAN IGNACIO","060901"]
[null,null,null,null,null,null,null,"CAJAMARCA SAN IGNACIO SAN JOSE DE LOURDES",{"$f":"IF(AND(ING!$D$21=J654,ING!$V$21=K654),I653+1,0)","v":6},"CAJAMARCA","SAN IGNACIO","SAN JOSE DE LOURDES","060906"]
[null,null,null,null,null,null,null,"CAJAMARCA SAN IGNACIO TABACONAS",{"$f":"IF(AND(ING!$D$21=J655,ING!$V$21=K655),I654+1,0)","v":7},"CAJAMARCA","SAN IGNACIO","TABACONAS","060907"]
[null,null,null,null,null,null,null,"CAJAMARCA SAN MARCOS CHANCAY",{"$f":"IF(AND(ING!$D$21=J656,ING!$V$21=K656),I655+1,0)","v":0},"CAJAMARCA","SAN MARCOS","CHANCAY","061002"]
[null,null,null,null,null,null,null,"CAJAMARCA SAN MARCOS EDUARDO VILLANUEVA",{"$f":"IF(AND(ING!$D$21=J657,ING!$V$21=K657),I656+1,0)","v":0},"CAJAMARCA","SAN MARCOS","EDUARDO VILLANUEVA","061003"]
[null,null,null,null,null,null,null,"CAJAMARCA SAN MARCOS GREGORIO PITA",{"$f":"IF(AND(ING!$D$21=J658,ING!$V$21=K658),I657+1,0)","v":0},"CAJAMARCA","SAN MARCOS","GREGORIO PITA","061004"]
[null,null,null,null,null,null,null,"CAJAMARCA SAN MARCOS ICHOCAN",{"$f":"IF(AND(ING!$D$21=J659,ING!$V$21=K659),I658+1,0)","v":0},"CAJAMARCA","SAN MARCOS","ICHOCAN","061005"]
[null,null,null,null,null,null,null,"CAJAMARCA SAN MARCOS JOSE MANUEL QUIROZ",{"$f":"IF(AND(ING!$D$21=J660,ING!$V$21=K660),I659+1,0)","v":0},"CAJAMARCA","SAN MARCOS","JOSE MANUEL QUIROZ","061006"]
[null,null,null,null,null,null,null,"CAJAMARCA SAN MARCOS JOSE SABOGAL",{"$f":"IF(AND(ING!$D$21=J661,ING!$V$21=K661),I660+1,0)","v":0},"CAJAMARCA","SAN MARCOS","JOSE SABOGAL","061007"]
[null,null,null,null,null,null,null,"CAJAMARCA SAN MARCOS PEDRO GALVEZ",{"$f":"IF(AND(ING!$D$21=J662,ING!$V$21=K662),I661+1,0)","v":0},"CAJAMARCA","SAN MARCOS","PEDRO GALVEZ","061001"]
[null,null,null,null,null,null,null,"CAJAMARCA SAN MIGUEL BOLIVAR",{"$f":"IF(AND(ING!$D$21=J663,ING!$V$21=K663),I662+1,0)","v":0},"CAJAMARCA","SAN MIGUEL","BOLIVAR","061102"]
[null,null,null,null,null,null,null,"CAJAMARCA SAN MIGUEL CALQUIS",{"$f":"IF(AND(ING!$D$21=J664,ING!$V$21=K664),I663+1,0)","v":0},"CAJAMARCA","SAN MIGUEL","CALQUIS","061103"]
[null,null,null,null,null,null,null,"CAJAMARCA SAN MIGUEL CATILLUC",{"$f":"IF(AND(ING!$D$21=J665,ING!$V$21=K665),I664+1,0)","v":0},"CAJAMARCA","SAN MIGUEL","CATILLUC","061104"]
[null,null,null,null,null,null,null,"CAJAMARCA SAN MIGUEL EL PRADO",{"$f":"IF(AND(ING!$D$21=J666,ING!$V$21=K666),I665+1,0)","v":0},"CAJAMARCA","SAN MIGUEL","EL PRADO","061105"]
[null,null,null,null,null,null,null,"CAJAMARCA SAN MIGUEL LA FLORIDA",{"$f":"IF(AND(ING!$D$21=J667,ING!$V$21=K667),I666+1,0)","v":0},"CAJAMARCA","SAN MIGUEL","LA FLORIDA","061106"]
[null,null,null,null,null,null,null,"CAJAMARCA SAN MIGUEL LLAPA",{"$f":"IF(AND(ING!$D$21=J668,ING!$V$21=K668),I667+1,0)","v":0},"CAJAMARCA","SAN MIGUEL","LLAPA","061107"]
[null,null,null,null,null,null,null,"CAJAMARCA SAN MIGUEL NANCHOC",{"$f":"IF(AND(ING!$D$21=J669,ING!$V$21=K669),I668+1,0)","v":0},"CAJAMARCA","SAN MIGUEL","NANCHOC","061108"]
[null,null,null,null,null,null,null,"CAJAMARCA SAN MIGUEL NIEPOS",{"$f":"IF(AND(ING!$D$21=J670,ING!$V$21=K670),I669+1,0)","v":0},"CAJAMARCA","SAN MIGUEL","NIEPOS","061109"]
[null,null,null,null,null,null,null,"CAJAMARCA SAN MIGUEL SAN GREGORIO",{"$f":"IF(AND(ING!$D$21=J671,ING!$V$21=K671),I670+1,0)","v":0},"CAJAMARCA","SAN MIGUEL","SAN GREGORIO","061110"]
[null,null,null,null,null,null,null,"CAJAMARCA SAN MIGUEL SAN MIGUEL",{"$f":"IF(AND(ING!$D$21=J672,ING!$V$21=K672),I671+1,0)","v":0},"CAJAMARCA","SAN MIGUEL","SAN MIGUEL","061101"]
[null,null,null,null,null,null,null,"CAJAMARCA SAN MIGUEL SAN SILVESTRE DE COCHAN",{"$f":"IF(AND(ING!$D$21=J673,ING!$V$21=K673),I672+1,0)","v":0},"CAJAMARCA","SAN MIGUEL","SAN SILVESTRE DE COCHAN","061111"]
[null,null,null,null,null,null,null,"CAJAMARCA SAN MIGUEL TONGOD",{"$f":"IF(AND(ING!$D$21=J674,ING!$V$21=K674),I673+1,0)","v":0},"CAJAMARCA","SAN MIGUEL","TONGOD","061112"]
[null,null,null,null,null,null,null,"CAJAMARCA SAN MIGUEL UNION AGUA BLANCA",{"$f":"IF(AND(ING!$D$21=J675,ING!$V$21=K675),I674+1,0)","v":0},"CAJAMARCA","SAN MIGUEL","UNION AGUA BLANCA","061113"]
[null,null,null,null,null,null,null,"CAJAMARCA SAN PABLO SAN BERNARDINO",{"$f":"IF(AND(ING!$D$21=J676,ING!$V$21=K676),I675+1,0)","v":0},"CAJAMARCA","SAN PABLO","SAN BERNARDINO","061202"]
[null,null,null,null,null,null,null,"CAJAMARCA SAN PABLO SAN LUIS",{"$f":"IF(AND(ING!$D$21=J677,ING!$V$21=K677),I676+1,0)","v":0},"CAJAMARCA","SAN PABLO","SAN LUIS","061203"]
[null,null,null,null,null,null,null,"CAJAMARCA SAN PABLO SAN PABLO",{"$f":"IF(AND(ING!$D$21=J678,ING!$V$21=K678),I677+1,0)","v":0},"CAJAMARCA","SAN PABLO","SAN PABLO","061201"]
[null,null,null,null,null,null,null,"CAJAMARCA SAN PABLO TUMBADEN",{"$f":"IF(AND(ING!$D$21=J679,ING!$V$21=K679),I678+1,0)","v":0},"CAJAMARCA","SAN PABLO","TUMBADEN","061204"]
[null,null,null,null,null,null,null,"CAJAMARCA SANTA CRUZ ANDABAMBA",{"$f":"IF(AND(ING!$D$21=J680,ING!$V$21=K680),I679+1,0)","v":0},"CAJAMARCA","SANTA CRUZ","ANDABAMBA","061302"]
[null,null,null,null,null,null,null,"CAJAMARCA SANTA CRUZ CATACHE",{"$f":"IF(AND(ING!$D$21=J681,ING!$V$21=K681),I680+1,0)","v":0},"CAJAMARCA","SANTA CRUZ","CATACHE","061303"]
[null,null,null,null,null,null,null,"CAJAMARCA SANTA CRUZ CHANCAYBAÑOS",{"$f":"IF(AND(ING!$D$21=J682,ING!$V$21=K682),I681+1,0)","v":0},"CAJAMARCA","SANTA CRUZ","CHANCAYBAÑOS","061304"]
[null,null,null,null,null,null,null,"CAJAMARCA SANTA CRUZ LA ESPERANZA",{"$f":"IF(AND(ING!$D$21=J683,ING!$V$21=K683),I682+1,0)","v":0},"CAJAMARCA","SANTA CRUZ","LA ESPERANZA","061305"]
[null,null,null,null,null,null,null,"CAJAMARCA SANTA CRUZ NINABAMBA",{"$f":"IF(AND(ING!$D$21=J684,ING!$V$21=K684),I683+1,0)","v":0},"CAJAMARCA","SANTA CRUZ","NINABAMBA","061306"]
[null,null,null,null,null,null,null,"CAJAMARCA SANTA CRUZ PULAN",{"$f":"IF(AND(ING!$D$21=J685,ING!$V$21=K685),I684+1,0)","v":0},"CAJAMARCA","SANTA CRUZ","PULAN","061307"]
[null,null,null,null,null,null,null,"CAJAMARCA SANTA CRUZ SANTA CRUZ",{"$f":"IF(AND(ING!$D$21=J686,ING!$V$21=K686),I685+1,0)","v":0},"CAJAMARCA","SANTA CRUZ","SANTA CRUZ","061301"]
[null,null,null,null,null,null,null,"CAJAMARCA SANTA CRUZ SAUCEPAMPA",{"$f":"IF(AND(ING!$D$21=J687,ING!$V$21=K687),I686+1,0)","v":0},"CAJAMARCA","SANTA CRUZ","SAUCEPAMPA","061308"]
[null,null,null,null,null,null,null,"CAJAMARCA SANTA CRUZ SEXI",{"$f":"IF(AND(ING!$D$21=J688,ING!$V$21=K688),I687+1,0)","v":0},"CAJAMARCA","SANTA CRUZ","SEXI","061309"]
[null,null,null,null,null,null,null,"CAJAMARCA SANTA CRUZ UTICYACU",{"$f":"IF(AND(ING!$D$21=J689,ING!$V$21=K689),I688+1,0)","v":0},"CAJAMARCA","SANTA CRUZ","UTICYACU","061310"]
[null,null,null,null,null,null,null,"CAJAMARCA SANTA CRUZ YAUYUCAN",{"$f":"IF(AND(ING!$D$21=J690,ING!$V$21=K690),I689+1,0)","v":0},"CAJAMARCA","SANTA CRUZ","YAUYUCAN","061311"]
[null,null,null,null,null,null,null,"CALLAO CALLAO BELLAVISTA",{"$f":"IF(AND(ING!$D$21=J691,ING!$V$21=K691),I690+1,0)","v":0},"CALLAO","CALLAO","BELLAVISTA","070102"]
[null,null,null,null,null,null,null,"CALLAO CALLAO CALLAO",{"$f":"IF(AND(ING!$D$21=J692,ING!$V$21=K692),I691+1,0)","v":0},"CALLAO","CALLAO","CALLAO","070101"]
[null,null,null,null,null,null,null,"CALLAO CALLAO CARMEN DE LA LEGUA REYNOSO",{"$f":"IF(AND(ING!$D$21=J693,ING!$V$21=K693),I692+1,0)","v":0},"CALLAO","CALLAO","CARMEN DE LA LEGUA REYNOSO","070103"]
[null,null,null,null,null,null,null,"CALLAO CALLAO LA PERLA",{"$f":"IF(AND(ING!$D$21=J694,ING!$V$21=K694),I693+1,0)","v":0},"CALLAO","CALLAO","LA PERLA","070104"]
[null,null,null,null,null,null,null,"CALLAO CALLAO LA PUNTA",{"$f":"IF(AND(ING!$D$21=J695,ING!$V$21=K695),I694+1,0)","v":0},"CALLAO","CALLAO","LA PUNTA","070105"]
[null,null,null,null,null,null,null,"CALLAO CALLAO MI PERÚ",{"$f":"IF(AND(ING!$D$21=J696,ING!$V$21=K696),I695+1,0)","v":0},"CALLAO","CALLAO","MI PERÚ","070107"]
[null,null,null,null,null,null,null,"CALLAO CALLAO VENTANILLA",{"$f":"IF(AND(ING!$D$21=J697,ING!$V$21=K697),I696+1,0)","v":0},"CALLAO","CALLAO","VENTANILLA","070106"]
[null,null,null,null,null,null,null,"CUSCO ACOMAYO ACOMAYO",{"$f":"IF(AND(ING!$D$21=J698,ING!$V$21=K698),I697+1,0)","v":0},"CUSCO","ACOMAYO","ACOMAYO","080201"]
[null,null,null,null,null,null,null,"CUSCO ACOMAYO ACOPIA",{"$f":"IF(AND(ING!$D$21=J699,ING!$V$21=K699),I698+1,0)","v":0},"CUSCO","ACOMAYO","ACOPIA","080202"]
[null,null,null,null,null,null,null,"CUSCO ACOMAYO ACOS",{"$f":"IF(AND(ING!$D$21=J700,ING!$V$21=K700),I699+1,0)","v":0},"CUSCO","ACOMAYO","ACOS","080203"]
[null,null,null,null,null,null,null,"CUSCO ACOMAYO MOSOC LLACTA",{"$f":"IF(AND(ING!$D$21=J701,ING!$V$21=K701),I700+1,0)","v":0},"CUSCO","ACOMAYO","MOSOC LLACTA","080204"]
[null,null,null,null,null,null,null,"CUSCO ACOMAYO POMACANCHI",{"$f":"IF(AND(ING!$D$21=J702,ING!$V$21=K702),I701+1,0)","v":0},"CUSCO","ACOMAYO","POMACANCHI","080205"]
[null,null,null,null,null,null,null,"CUSCO ACOMAYO RONDOCAN",{"$f":"IF(AND(ING!$D$21=J703,ING!$V$21=K703),I702+1,0)","v":0},"CUSCO","ACOMAYO","RONDOCAN","080206"]
[null,null,null,null,null,null,null,"CUSCO ACOMAYO SANGARARA",{"$f":"IF(AND(ING!$D$21=J704,ING!$V$21=K704),I703+1,0)","v":0},"CUSCO","ACOMAYO","SANGARARA","080207"]
[null,null,null,null,null,null,null,"CUSCO ANTA ANCAHUASI",{"$f":"IF(AND(ING!$D$21=J705,ING!$V$21=K705),I704+1,0)","v":0},"CUSCO","ANTA","ANCAHUASI","080302"]
[null,null,null,null,null,null,null,"CUSCO ANTA ANTA",{"$f":"IF(AND(ING!$D$21=J706,ING!$V$21=K706),I705+1,0)","v":0},"CUSCO","ANTA","ANTA","080301"]
[null,null,null,null,null,null,null,{"$f":"J707&\" \"&K707&\" \"&L707","v":"CUSCO ANTA CACHIMAYO"},{"$f":"IF(AND(ING!$D$21=J707,ING!$V$21=K707),I706+1,0)","v":0},"CUSCO","ANTA","CACHIMAYO","080303"]
[null,null,null,null,null,null,null,"CUSCO ANTA CHINCHAYPUJIO",{"$f":"IF(AND(ING!$D$21=J708,ING!$V$21=K708),I707+1,0)","v":0},"CUSCO","ANTA","CHINCHAYPUJIO","080304"]
[null,null,null,null,null,null,null,"CUSCO ANTA HUAROCONDO",{"$f":"IF(AND(ING!$D$21=J709,ING!$V$21=K709),I708+1,0)","v":0},"CUSCO","ANTA","HUAROCONDO","080305"]
[null,null,null,null,null,null,null,"CUSCO ANTA LIMATAMBO",{"$f":"IF(AND(ING!$D$21=J710,ING!$V$21=K710),I709+1,0)","v":0},"CUSCO","ANTA","LIMATAMBO","080306"]
[null,null,null,null,null,null,null,"CUSCO ANTA MOLLEPATA",{"$f":"IF(AND(ING!$D$21=J711,ING!$V$21=K711),I710+1,0)","v":0},"CUSCO","ANTA","MOLLEPATA","080307"]
[null,null,null,null,null,null,null,"CUSCO ANTA PUCYURA",{"$f":"IF(AND(ING!$D$21=J712,ING!$V$21=K712),I711+1,0)","v":0},"CUSCO","ANTA","PUCYURA","080308"]
[null,null,null,null,null,null,null,"CUSCO ANTA ZURITE",{"$f":"IF(AND(ING!$D$21=J713,ING!$V$21=K713),I712+1,0)","v":0},"CUSCO","ANTA","ZURITE","080309"]
[null,null,null,null,null,null,null,"CUSCO CALCA CALCA",{"$f":"IF(AND(ING!$D$21=J714,ING!$V$21=K714),I713+1,0)","v":0},"CUSCO","CALCA","CALCA","080401"]
[null,null,null,null,null,null,null,"CUSCO CALCA COYA",{"$f":"IF(AND(ING!$D$21=J715,ING!$V$21=K715),I714+1,0)","v":0},"CUSCO","CALCA","COYA","080402"]
[null,null,null,null,null,null,null,"CUSCO CALCA LAMAY",{"$f":"IF(AND(ING!$D$21=J716,ING!$V$21=K716),I715+1,0)","v":0},"CUSCO","CALCA","LAMAY","080403"]
[null,null,null,null,null,null,null,"CUSCO CALCA LARES",{"$f":"IF(AND(ING!$D$21=J717,ING!$V$21=K717),I716+1,0)","v":0},"CUSCO","CALCA","LARES","080404"]
[null,null,null,null,null,null,null,"CUSCO CALCA PISAC",{"$f":"IF(AND(ING!$D$21=J718,ING!$V$21=K718),I717+1,0)","v":0},"CUSCO","CALCA","PISAC","080405"]
[null,null,null,null,null,null,null,"CUSCO CALCA SAN SALVADOR",{"$f":"IF(AND(ING!$D$21=J719,ING!$V$21=K719),I718+1,0)","v":0},"CUSCO","CALCA","SAN SALVADOR","080406"]
[null,null,null,null,null,null,null,"CUSCO CALCA TARAY",{"$f":"IF(AND(ING!$D$21=J720,ING!$V$21=K720),I719+1,0)","v":0},"CUSCO","CALCA","TARAY","080407"]
[null,null,null,null,null,null,null,"CUSCO CALCA YANATILE",{"$f":"IF(AND(ING!$D$21=J721,ING!$V$21=K721),I720+1,0)","v":0},"CUSCO","CALCA","YANATILE","080408"]
[null,null,null,null,null,null,null,"CUSCO CANAS CHECCA",{"$f":"IF(AND(ING!$D$21=J722,ING!$V$21=K722),I721+1,0)","v":0},"CUSCO","CANAS","CHECCA","080502"]
[null,null,null,null,null,null,null,"CUSCO CANAS KUNTURKANKI",{"$f":"IF(AND(ING!$D$21=J723,ING!$V$21=K723),I722+1,0)","v":0},"CUSCO","CANAS","KUNTURKANKI","080503"]
[null,null,null,null,null,null,null,"CUSCO CANAS LANGUI",{"$f":"IF(AND(ING!$D$21=J724,ING!$V$21=K724),I723+1,0)","v":0},"CUSCO","CANAS","LANGUI","080504"]
[null,null,null,null,null,null,null,"CUSCO CANAS LAYO",{"$f":"IF(AND(ING!$D$21=J725,ING!$V$21=K725),I724+1,0)","v":0},"CUSCO","CANAS","LAYO","080505"]
[null,null,null,null,null,null,null,"CUSCO CANAS PAMPAMARCA",{"$f":"IF(AND(ING!$D$21=J726,ING!$V$21=K726),I725+1,0)","v":0},"CUSCO","CANAS","PAMPAMARCA","080506"]
[null,null,null,null,null,null,null,"CUSCO CANAS QUEHUE",{"$f":"IF(AND(ING!$D$21=J727,ING!$V$21=K727),I726+1,0)","v":0},"CUSCO","CANAS","QUEHUE","080507"]
[null,null,null,null,null,null,null,"CUSCO CANAS TUPAC AMARU",{"$f":"IF(AND(ING!$D$21=J728,ING!$V$21=K728),I727+1,0)","v":0},"CUSCO","CANAS","TUPAC AMARU","080508"]
[null,null,null,null,null,null,null,"CUSCO CANAS YANAOCA",{"$f":"IF(AND(ING!$D$21=J729,ING!$V$21=K729),I728+1,0)","v":0},"CUSCO","CANAS","YANAOCA","080501"]
[null,null,null,null,null,null,null,"CUSCO CANCHIS CHECACUPE",{"$f":"IF(AND(ING!$D$21=J730,ING!$V$21=K730),I729+1,0)","v":0},"CUSCO","CANCHIS","CHECACUPE","080602"]
[null,null,null,null,null,null,null,"CUSCO CANCHIS COMBAPATA",{"$f":"IF(AND(ING!$D$21=J731,ING!$V$21=K731),I730+1,0)","v":0},"CUSCO","CANCHIS","COMBAPATA","080603"]
[null,null,null,null,null,null,null,"CUSCO CANCHIS MARANGANI",{"$f":"IF(AND(ING!$D$21=J732,ING!$V$21=K732),I731+1,0)","v":0},"CUSCO","CANCHIS","MARANGANI","080604"]
[null,null,null,null,null,null,null,"CUSCO CANCHIS PITUMARCA",{"$f":"IF(AND(ING!$D$21=J733,ING!$V$21=K733),I732+1,0)","v":0},"CUSCO","CANCHIS","PITUMARCA","080605"]
[null,null,null,null,null,null,null,"CUSCO CANCHIS SAN PABLO",{"$f":"IF(AND(ING!$D$21=J734,ING!$V$21=K734),I733+1,0)","v":0},"CUSCO","CANCHIS","SAN PABLO","080606"]
[null,null,null,null,null,null,null,"CUSCO CANCHIS SAN PEDRO",{"$f":"IF(AND(ING!$D$21=J735,ING!$V$21=K735),I734+1,0)","v":0},"CUSCO","CANCHIS","SAN PEDRO","080607"]
[null,null,null,null,null,null,null,"CUSCO CANCHIS SICUANI",{"$f":"IF(AND(ING!$D$21=J736,ING!$V$21=K736),I735+1,0)","v":0},"CUSCO","CANCHIS","SICUANI","080601"]
[null,null,null,null,null,null,null,"CUSCO CANCHIS TINTA",{"$f":"IF(AND(ING!$D$21=J737,ING!$V$21=K737),I736+1,0)","v":0},"CUSCO","CANCHIS","TINTA","080608"]
[null,null,null,null,null,null,null,"CUSCO CHUMBIVILCAS CAPACMARCA",{"$f":"IF(AND(ING!$D$21=J738,ING!$V$21=K738),I737+1,0)","v":0},"CUSCO","CHUMBIVILCAS","CAPACMARCA","080702"]
[null,null,null,null,null,null,null,"CUSCO CHUMBIVILCAS CHAMACA",{"$f":"IF(AND(ING!$D$21=J739,ING!$V$21=K739),I738+1,0)","v":0},"CUSCO","CHUMBIVILCAS","CHAMACA","080703"]
[null,null,null,null,null,null,null,"CUSCO CHUMBIVILCAS COLQUEMARCA",{"$f":"IF(AND(ING!$D$21=J740,ING!$V$21=K740),I739+1,0)","v":0},"CUSCO","CHUMBIVILCAS","COLQUEMARCA","080704"]
[null,null,null,null,null,null,null,"CUSCO CHUMBIVILCAS LIVITACA",{"$f":"IF(AND(ING!$D$21=J741,ING!$V$21=K741),I740+1,0)","v":0},"CUSCO","CHUMBIVILCAS","LIVITACA","080705"]
[null,null,null,null,null,null,null,"CUSCO CHUMBIVILCAS LLUSCO",{"$f":"IF(AND(ING!$D$21=J742,ING!$V$21=K742),I741+1,0)","v":0},"CUSCO","CHUMBIVILCAS","LLUSCO","080706"]
[null,null,null,null,null,null,null,"CUSCO CHUMBIVILCAS QUIÑOTA",{"$f":"IF(AND(ING!$D$21=J743,ING!$V$21=K743),I742+1,0)","v":0},"CUSCO","CHUMBIVILCAS","QUIÑOTA","080707"]
[null,null,null,null,null,null,null,"CUSCO CHUMBIVILCAS SANTO TOMAS",{"$f":"IF(AND(ING!$D$21=J744,ING!$V$21=K744),I743+1,0)","v":0},"CUSCO","CHUMBIVILCAS","SANTO TOMAS","080701"]
[null,null,null,null,null,null,null,"CUSCO CHUMBIVILCAS VELILLE",{"$f":"IF(AND(ING!$D$21=J745,ING!$V$21=K745),I744+1,0)","v":0},"CUSCO","CHUMBIVILCAS","VELILLE","080708"]
[null,null,null,null,null,null,null,"CUSCO CUSCO CCORCA",{"$f":"IF(AND(ING!$D$21=J746,ING!$V$21=K746),I745+1,0)","v":0},"CUSCO","CUSCO","CCORCA","080102"]
[null,null,null,null,null,null,null,"CUSCO CUSCO CUSCO",{"$f":"IF(AND(ING!$D$21=J747,ING!$V$21=K747),I746+1,0)","v":0},"CUSCO","CUSCO","CUSCO","080101"]
[null,null,null,null,null,null,null,"CUSCO CUSCO POROY",{"$f":"IF(AND(ING!$D$21=J748,ING!$V$21=K748),I747+1,0)","v":0},"CUSCO","CUSCO","POROY","080103"]
[null,null,null,null,null,null,null,"CUSCO CUSCO SAN JERONIMO",{"$f":"IF(AND(ING!$D$21=J749,ING!$V$21=K749),I748+1,0)","v":0},"CUSCO","CUSCO","SAN JERONIMO","080104"]
[null,null,null,null,null,null,null,"CUSCO CUSCO SAN SEBASTIAN",{"$f":"IF(AND(ING!$D$21=J750,ING!$V$21=K750),I749+1,0)","v":0},"CUSCO","CUSCO","SAN SEBASTIAN","080105"]
[null,null,null,null,null,null,null,"CUSCO CUSCO SANTIAGO",{"$f":"IF(AND(ING!$D$21=J751,ING!$V$21=K751),I750+1,0)","v":0},"CUSCO","CUSCO","SANTIAGO","080106"]
[null,null,null,null,null,null,null,"CUSCO CUSCO SAYLLA",{"$f":"IF(AND(ING!$D$21=J752,ING!$V$21=K752),I751+1,0)","v":0},"CUSCO","CUSCO","SAYLLA","080107"]
[null,null,null,null,null,null,null,"CUSCO CUSCO WANCHAQ",{"$f":"IF(AND(ING!$D$21=J753,ING!$V$21=K753),I752+1,0)","v":0},"CUSCO","CUSCO","WANCHAQ","080108"]
[null,null,null,null,null,null,null,"CUSCO ESPINAR ALTO PICHIGUA",{"$f":"IF(AND(ING!$D$21=J754,ING!$V$21=K754),I753+1,0)","v":0},"CUSCO","ESPINAR","ALTO PICHIGUA","080808"]
[null,null,null,null,null,null,null,"CUSCO ESPINAR CONDOROMA",{"$f":"IF(AND(ING!$D$21=J755,ING!$V$21=K755),I754+1,0)","v":0},"CUSCO","ESPINAR","CONDOROMA","080802"]
[null,null,null,null,null,null,null,"CUSCO ESPINAR COPORAQUE",{"$f":"IF(AND(ING!$D$21=J756,ING!$V$21=K756),I755+1,0)","v":0},"CUSCO","ESPINAR","COPORAQUE","080803"]
[null,null,null,null,null,null,null,"CUSCO ESPINAR ESPINAR",{"$f":"IF(AND(ING!$D$21=J757,ING!$V$21=K757),I756+1,0)","v":0},"CUSCO","ESPINAR","ESPINAR","080801"]
[null,null,null,null,null,null,null,"CUSCO ESPINAR OCORURO",{"$f":"IF(AND(ING!$D$21=J758,ING!$V$21=K758),I757+1,0)","v":0},"CUSCO","ESPINAR","OCORURO","080804"]
[null,null,null,null,null,null,null,"CUSCO ESPINAR PALLPATA",{"$f":"IF(AND(ING!$D$21=J759,ING!$V$21=K759),I758+1,0)","v":0},"CUSCO","ESPINAR","PALLPATA","080805"]
[null,null,null,null,null,null,null,"CUSCO ESPINAR PICHIGUA",{"$f":"IF(AND(ING!$D$21=J760,ING!$V$21=K760),I759+1,0)","v":0},"CUSCO","ESPINAR","PICHIGUA","080806"]
[null,null,null,null,null,null,null,"CUSCO ESPINAR SUYCKUTAMBO",{"$f":"IF(AND(ING!$D$21=J761,ING!$V$21=K761),I760+1,0)","v":0},"CUSCO","ESPINAR","SUYCKUTAMBO","080807"]
[null,null,null,null,null,null,null,"CUSCO LA CONVENCION ECHARATE",{"$f":"IF(AND(ING!$D$21=J762,ING!$V$21=K762),I761+1,0)","v":0},"CUSCO","LA CONVENCION","ECHARATE","080902"]
[null,null,null,null,null,null,null,"CUSCO LA CONVENCION HUAYOPATA",{"$f":"IF(AND(ING!$D$21=J763,ING!$V$21=K763),I762+1,0)","v":0},"CUSCO","LA CONVENCION","HUAYOPATA","080903"]
[null,null,null,null,null,null,null,"CUSCO LA CONVENCION INKAWASI",{"$f":"IF(AND(ING!$D$21=J764,ING!$V$21=K764),I763+1,0)","v":0},"CUSCO","LA CONVENCION","INKAWASI","080911"]
[null,null,null,null,null,null,null,"CUSCO LA CONVENCION KIMBIRI",{"$f":"IF(AND(ING!$D$21=J765,ING!$V$21=K765),I764+1,0)","v":0},"CUSCO","LA CONVENCION","KIMBIRI","080907"]
[null,null,null,null,null,null,null,"CUSCO LA CONVENCION MARANURA",{"$f":"IF(AND(ING!$D$21=J766,ING!$V$21=K766),I765+1,0)","v":0},"CUSCO","LA CONVENCION","MARANURA","080904"]
[null,null,null,null,null,null,null,"CUSCO LA CONVENCION MEGANTONI",{"$f":"IF(AND(ING!$D$21=J767,ING!$V$21=K767),I766+1,0)","v":0},"CUSCO","LA CONVENCION","MEGANTONI","080914"]
[null,null,null,null,null,null,null,"CUSCO LA CONVENCION OCOBAMBA",{"$f":"IF(AND(ING!$D$21=J768,ING!$V$21=K768),I767+1,0)","v":0},"CUSCO","LA CONVENCION","OCOBAMBA","080905"]
[null,null,null,null,null,null,null,"CUSCO LA CONVENCION PICHARI",{"$f":"IF(AND(ING!$D$21=J769,ING!$V$21=K769),I768+1,0)","v":0},"CUSCO","LA CONVENCION","PICHARI","080910"]
[null,null,null,null,null,null,null,"CUSCO LA CONVENCION QUELLOUNO",{"$f":"IF(AND(ING!$D$21=J770,ING!$V$21=K770),I769+1,0)","v":0},"CUSCO","LA CONVENCION","QUELLOUNO","080906"]
[null,null,null,null,null,null,null,{"$f":"J771&\" \"&K771&\" \"&L771","v":"CUSCO LA CONVENCION SANTA ANA"},{"$f":"IF(AND(ING!$D$21=J771,ING!$V$21=K771),I770+1,0)","v":0},"CUSCO","LA CONVENCION","SANTA ANA","080901"]
[null,null,null,null,null,null,null,"CUSCO LA CONVENCION SANTA TERESA",{"$f":"IF(AND(ING!$D$21=J772,ING!$V$21=K772),I771+1,0)","v":0},"CUSCO","LA CONVENCION","SANTA TERESA","080908"]
[null,null,null,null,null,null,null,"CUSCO LA CONVENCION VILCABAMBA",{"$f":"IF(AND(ING!$D$21=J773,ING!$V$21=K773),I772+1,0)","v":0},"CUSCO","LA CONVENCION","VILCABAMBA","080909"]
[null,null,null,null,null,null,null,"CUSCO LA CONVENCION VILLA KINTIARINA",{"$f":"IF(AND(ING!$D$21=J774,ING!$V$21=K774),I773+1,0)","v":0},"CUSCO","LA CONVENCION","VILLA KINTIARINA","080913"]
[null,null,null,null,null,null,null,"CUSCO LA CONVENCION VILLA VIRGEN",{"$f":"IF(AND(ING!$D$21=J775,ING!$V$21=K775),I774+1,0)","v":0},"CUSCO","LA CONVENCION","VILLA VIRGEN","080912"]
[null,null,null,null,null,null,null,"CUSCO PARURO ACCHA",{"$f":"IF(AND(ING!$D$21=J776,ING!$V$21=K776),I775+1,0)","v":0},"CUSCO","PARURO","ACCHA","081002"]
[null,null,null,null,null,null,null,"CUSCO PARURO CCAPI",{"$f":"IF(AND(ING!$D$21=J777,ING!$V$21=K777),I776+1,0)","v":0},"CUSCO","PARURO","CCAPI","081003"]
[null,null,null,null,null,null,null,"CUSCO PARURO COLCHA",{"$f":"IF(AND(ING!$D$21=J778,ING!$V$21=K778),I777+1,0)","v":0},"CUSCO","PARURO","COLCHA","081004"]
[null,null,null,null,null,null,null,"CUSCO PARURO HUANOQUITE",{"$f":"IF(AND(ING!$D$21=J779,ING!$V$21=K779),I778+1,0)","v":0},"CUSCO","PARURO","HUANOQUITE","081005"]
[null,null,null,null,null,null,null,"CUSCO PARURO OMACHA",{"$f":"IF(AND(ING!$D$21=J780,ING!$V$21=K780),I779+1,0)","v":0},"CUSCO","PARURO","OMACHA","081006"]
[null,null,null,null,null,null,null,"CUSCO PARURO PACCARITAMBO",{"$f":"IF(AND(ING!$D$21=J781,ING!$V$21=K781),I780+1,0)","v":0},"CUSCO","PARURO","PACCARITAMBO","081007"]
[null,null,null,null,null,null,null,"CUSCO PARURO PARURO",{"$f":"IF(AND(ING!$D$21=J782,ING!$V$21=K782),I781+1,0)","v":0},"CUSCO","PARURO","PARURO","081001"]
[null,null,null,null,null,null,null,"CUSCO PARURO PILLPINTO",{"$f":"IF(AND(ING!$D$21=J783,ING!$V$21=K783),I782+1,0)","v":0},"CUSCO","PARURO","PILLPINTO","081008"]
[null,null,null,null,null,null,null,"CUSCO PARURO YAURISQUE",{"$f":"IF(AND(ING!$D$21=J784,ING!$V$21=K784),I783+1,0)","v":0},"CUSCO","PARURO","YAURISQUE","081009"]
[null,null,null,null,null,null,null,"CUSCO PAUCARTAMBO CAICAY",{"$f":"IF(AND(ING!$D$21=J785,ING!$V$21=K785),I784+1,0)","v":0},"CUSCO","PAUCARTAMBO","CAICAY","081102"]
[null,null,null,null,null,null,null,"CUSCO PAUCARTAMBO CHALLABAMBA",{"$f":"IF(AND(ING!$D$21=J786,ING!$V$21=K786),I785+1,0)","v":0},"CUSCO","PAUCARTAMBO","CHALLABAMBA","081103"]
[null,null,null,null,null,null,null,"CUSCO PAUCARTAMBO COLQUEPATA",{"$f":"IF(AND(ING!$D$21=J787,ING!$V$21=K787),I786+1,0)","v":0},"CUSCO","PAUCARTAMBO","COLQUEPATA","081104"]
[null,null,null,null,null,null,null,"CUSCO PAUCARTAMBO HUANCARANI",{"$f":"IF(AND(ING!$D$21=J788,ING!$V$21=K788),I787+1,0)","v":0},"CUSCO","PAUCARTAMBO","HUANCARANI","081105"]
[null,null,null,null,null,null,null,"CUSCO PAUCARTAMBO KOSÑIPATA",{"$f":"IF(AND(ING!$D$21=J789,ING!$V$21=K789),I788+1,0)","v":0},"CUSCO","PAUCARTAMBO","KOSÑIPATA","081106"]
[null,null,null,null,null,null,null,"CUSCO PAUCARTAMBO PAUCARTAMBO",{"$f":"IF(AND(ING!$D$21=J790,ING!$V$21=K790),I789+1,0)","v":0},"CUSCO","PAUCARTAMBO","PAUCARTAMBO","081101"]
[null,null,null,null,null,null,null,"CUSCO QUISPICANCHI ANDAHUAYLILLAS",{"$f":"IF(AND(ING!$D$21=J791,ING!$V$21=K791),I790+1,0)","v":0},"CUSCO","QUISPICANCHI","ANDAHUAYLILLAS","081202"]
[null,null,null,null,null,null,null,"CUSCO QUISPICANCHI CAMANTI",{"$f":"IF(AND(ING!$D$21=J792,ING!$V$21=K792),I791+1,0)","v":0},"CUSCO","QUISPICANCHI","CAMANTI","081203"]
[null,null,null,null,null,null,null,"CUSCO QUISPICANCHI CCARHUAYO",{"$f":"IF(AND(ING!$D$21=J793,ING!$V$21=K793),I792+1,0)","v":0},"CUSCO","QUISPICANCHI","CCARHUAYO","081204"]
[null,null,null,null,null,null,null,"CUSCO QUISPICANCHI CCATCA",{"$f":"IF(AND(ING!$D$21=J794,ING!$V$21=K794),I793+1,0)","v":0},"CUSCO","QUISPICANCHI","CCATCA","081205"]
[null,null,null,null,null,null,null,"CUSCO QUISPICANCHI CUSIPATA",{"$f":"IF(AND(ING!$D$21=J795,ING!$V$21=K795),I794+1,0)","v":0},"CUSCO","QUISPICANCHI","CUSIPATA","081206"]
[null,null,null,null,null,null,null,"CUSCO QUISPICANCHI HUARO",{"$f":"IF(AND(ING!$D$21=J796,ING!$V$21=K796),I795+1,0)","v":0},"CUSCO","QUISPICANCHI","HUARO","081207"]
[null,null,null,null,null,null,null,"CUSCO QUISPICANCHI LUCRE",{"$f":"IF(AND(ING!$D$21=J797,ING!$V$21=K797),I796+1,0)","v":0},"CUSCO","QUISPICANCHI","LUCRE","081208"]
[null,null,null,null,null,null,null,"CUSCO QUISPICANCHI MARCAPATA",{"$f":"IF(AND(ING!$D$21=J798,ING!$V$21=K798),I797+1,0)","v":0},"CUSCO","QUISPICANCHI","MARCAPATA","081209"]
[null,null,null,null,null,null,null,"CUSCO QUISPICANCHI OCONGATE",{"$f":"IF(AND(ING!$D$21=J799,ING!$V$21=K799),I798+1,0)","v":0},"CUSCO","QUISPICANCHI","OCONGATE","081210"]
[null,null,null,null,null,null,null,"CUSCO QUISPICANCHI OROPESA",{"$f":"IF(AND(ING!$D$21=J800,ING!$V$21=K800),I799+1,0)","v":0},"CUSCO","QUISPICANCHI","OROPESA","081211"]
[null,null,null,null,null,null,null,"CUSCO QUISPICANCHI QUIQUIJANA",{"$f":"IF(AND(ING!$D$21=J801,ING!$V$21=K801),I800+1,0)","v":0},"CUSCO","QUISPICANCHI","QUIQUIJANA","081212"]
[null,null,null,null,null,null,null,"CUSCO QUISPICANCHI URCOS",{"$f":"IF(AND(ING!$D$21=J802,ING!$V$21=K802),I801+1,0)","v":0},"CUSCO","QUISPICANCHI","URCOS","081201"]
[null,null,null,null,null,null,null,"CUSCO URUBAMBA CHINCHERO",{"$f":"IF(AND(ING!$D$21=J803,ING!$V$21=K803),I802+1,0)","v":0},"CUSCO","URUBAMBA","CHINCHERO","081302"]
[null,null,null,null,null,null,null,"CUSCO URUBAMBA HUAYLLABAMBA",{"$f":"IF(AND(ING!$D$21=J804,ING!$V$21=K804),I803+1,0)","v":0},"CUSCO","URUBAMBA","HUAYLLABAMBA","081303"]
[null,null,null,null,null,null,null,"CUSCO URUBAMBA MACHUPICCHU",{"$f":"IF(AND(ING!$D$21=J805,ING!$V$21=K805),I804+1,0)","v":0},"CUSCO","URUBAMBA","MACHUPICCHU","081304"]
[null,null,null,null,null,null,null,"CUSCO URUBAMBA MARAS",{"$f":"IF(AND(ING!$D$21=J806,ING!$V$21=K806),I805+1,0)","v":0},"CUSCO","URUBAMBA","MARAS","081305"]
[null,null,null,null,null,null,null,"CUSCO URUBAMBA OLLANTAYTAMBO",{"$f":"IF(AND(ING!$D$21=J807,ING!$V$21=K807),I806+1,0)","v":0},"CUSCO","URUBAMBA","OLLANTAYTAMBO","081306"]
[null,null,null,null,null,null,null,"CUSCO URUBAMBA URUBAMBA",{"$f":"IF(AND(ING!$D$21=J808,ING!$V$21=K808),I807+1,0)","v":0},"CUSCO","URUBAMBA","URUBAMBA","081301"]
[null,null,null,null,null,null,null,"CUSCO URUBAMBA YUCAY",{"$f":"IF(AND(ING!$D$21=J809,ING!$V$21=K809),I808+1,0)","v":0},"CUSCO","URUBAMBA","YUCAY","081307"]
[null,null,null,null,null,null,null,"HUANCAVELICA ACOBAMBA ACOBAMBA",{"$f":"IF(AND(ING!$D$21=J810,ING!$V$21=K810),I809+1,0)","v":0},"HUANCAVELICA","ACOBAMBA","ACOBAMBA","090201"]
[null,null,null,null,null,null,null,"HUANCAVELICA ACOBAMBA ANDABAMBA",{"$f":"IF(AND(ING!$D$21=J811,ING!$V$21=K811),I810+1,0)","v":0},"HUANCAVELICA","ACOBAMBA","ANDABAMBA","090202"]
[null,null,null,null,null,null,null,"HUANCAVELICA ACOBAMBA ANTA",{"$f":"IF(AND(ING!$D$21=J812,ING!$V$21=K812),I811+1,0)","v":0},"HUANCAVELICA","ACOBAMBA","ANTA","090203"]
[null,null,null,null,null,null,null,"HUANCAVELICA ACOBAMBA CAJA",{"$f":"IF(AND(ING!$D$21=J813,ING!$V$21=K813),I812+1,0)","v":0},"HUANCAVELICA","ACOBAMBA","CAJA","090204"]
[null,null,null,null,null,null,null,"HUANCAVELICA ACOBAMBA MARCAS",{"$f":"IF(AND(ING!$D$21=J814,ING!$V$21=K814),I813+1,0)","v":0},"HUANCAVELICA","ACOBAMBA","MARCAS","090205"]
[null,null,null,null,null,null,null,"HUANCAVELICA ACOBAMBA PAUCARA",{"$f":"IF(AND(ING!$D$21=J815,ING!$V$21=K815),I814+1,0)","v":0},"HUANCAVELICA","ACOBAMBA","PAUCARA","090206"]
[null,null,null,null,null,null,null,"HUANCAVELICA ACOBAMBA POMACOCHA",{"$f":"IF(AND(ING!$D$21=J816,ING!$V$21=K816),I815+1,0)","v":0},"HUANCAVELICA","ACOBAMBA","POMACOCHA","090207"]
[null,null,null,null,null,null,null,"HUANCAVELICA ACOBAMBA ROSARIO",{"$f":"IF(AND(ING!$D$21=J817,ING!$V$21=K817),I816+1,0)","v":0},"HUANCAVELICA","ACOBAMBA","ROSARIO","090208"]
[null,null,null,null,null,null,null,"HUANCAVELICA ANGARAES ANCHONGA",{"$f":"IF(AND(ING!$D$21=J818,ING!$V$21=K818),I817+1,0)","v":0},"HUANCAVELICA","ANGARAES","ANCHONGA","090302"]
[null,null,null,null,null,null,null,"HUANCAVELICA ANGARAES CALLANMARCA",{"$f":"IF(AND(ING!$D$21=J819,ING!$V$21=K819),I818+1,0)","v":0},"HUANCAVELICA","ANGARAES","CALLANMARCA","090303"]
[null,null,null,null,null,null,null,"HUANCAVELICA ANGARAES CCOCHACCASA",{"$f":"IF(AND(ING!$D$21=J820,ING!$V$21=K820),I819+1,0)","v":0},"HUANCAVELICA","ANGARAES","CCOCHACCASA","090304"]
[null,null,null,null,null,null,null,"HUANCAVELICA ANGARAES CHINCHO",{"$f":"IF(AND(ING!$D$21=J821,ING!$V$21=K821),I820+1,0)","v":0},"HUANCAVELICA","ANGARAES","CHINCHO","090305"]
[null,null,null,null,null,null,null,"HUANCAVELICA ANGARAES CONGALLA",{"$f":"IF(AND(ING!$D$21=J822,ING!$V$21=K822),I821+1,0)","v":0},"HUANCAVELICA","ANGARAES","CONGALLA","090306"]
[null,null,null,null,null,null,null,"HUANCAVELICA ANGARAES HUANCA-HUANCA",{"$f":"IF(AND(ING!$D$21=J823,ING!$V$21=K823),I822+1,0)","v":0},"HUANCAVELICA","ANGARAES","HUANCA-HUANCA","090307"]
[null,null,null,null,null,null,null,"HUANCAVELICA ANGARAES HUAYLLAY GRANDE",{"$f":"IF(AND(ING!$D$21=J824,ING!$V$21=K824),I823+1,0)","v":0},"HUANCAVELICA","ANGARAES","HUAYLLAY GRANDE","090308"]
[null,null,null,null,null,null,null,"HUANCAVELICA ANGARAES JULCAMARCA",{"$f":"IF(AND(ING!$D$21=J825,ING!$V$21=K825),I824+1,0)","v":0},"HUANCAVELICA","ANGARAES","JULCAMARCA","090309"]
[null,null,null,null,null,null,null,"HUANCAVELICA ANGARAES LIRCAY",{"$f":"IF(AND(ING!$D$21=J826,ING!$V$21=K826),I825+1,0)","v":0},"HUANCAVELICA","ANGARAES","LIRCAY","090301"]
[null,null,null,null,null,null,null,"HUANCAVELICA ANGARAES SAN ANTONIO DE ANTAPARCO",{"$f":"IF(AND(ING!$D$21=J827,ING!$V$21=K827),I826+1,0)","v":0},"HUANCAVELICA","ANGARAES","SAN ANTONIO DE ANTAPARCO","090310"]
[null,null,null,null,null,null,null,"HUANCAVELICA ANGARAES SANTO TOMAS DE PATA",{"$f":"IF(AND(ING!$D$21=J828,ING!$V$21=K828),I827+1,0)","v":0},"HUANCAVELICA","ANGARAES","SANTO TOMAS DE PATA","090311"]
[null,null,null,null,null,null,null,"HUANCAVELICA ANGARAES SECCLLA",{"$f":"IF(AND(ING!$D$21=J829,ING!$V$21=K829),I828+1,0)","v":0},"HUANCAVELICA","ANGARAES","SECCLLA","090312"]
[null,null,null,null,null,null,null,"HUANCAVELICA CASTROVIRREYNA ARMA",{"$f":"IF(AND(ING!$D$21=J830,ING!$V$21=K830),I829+1,0)","v":0},"HUANCAVELICA","CASTROVIRREYNA","ARMA","090402"]
[null,null,null,null,null,null,null,"HUANCAVELICA CASTROVIRREYNA AURAHUA",{"$f":"IF(AND(ING!$D$21=J831,ING!$V$21=K831),I830+1,0)","v":0},"HUANCAVELICA","CASTROVIRREYNA","AURAHUA","090403"]
[null,null,null,null,null,null,null,"HUANCAVELICA CASTROVIRREYNA CAPILLAS",{"$f":"IF(AND(ING!$D$21=J832,ING!$V$21=K832),I831+1,0)","v":0},"HUANCAVELICA","CASTROVIRREYNA","CAPILLAS","090404"]
[null,null,null,null,null,null,null,"HUANCAVELICA CASTROVIRREYNA CASTROVIRREYNA",{"$f":"IF(AND(ING!$D$21=J833,ING!$V$21=K833),I832+1,0)","v":0},"HUANCAVELICA","CASTROVIRREYNA","CASTROVIRREYNA","090401"]
[null,null,null,null,null,null,null,"HUANCAVELICA CASTROVIRREYNA CHUPAMARCA",{"$f":"IF(AND(ING!$D$21=J834,ING!$V$21=K834),I833+1,0)","v":0},"HUANCAVELICA","CASTROVIRREYNA","CHUPAMARCA","090405"]
[null,null,null,null,null,null,null,{"$f":"J835&\" \"&K835&\" \"&L835","v":"HUANCAVELICA CASTROVIRREYNA COCAS"},{"$f":"IF(AND(ING!$D$21=J835,ING!$V$21=K835),I834+1,0)","v":0},"HUANCAVELICA","CASTROVIRREYNA","COCAS","090406"]
[null,null,null,null,null,null,null,"HUANCAVELICA CASTROVIRREYNA HUACHOS",{"$f":"IF(AND(ING!$D$21=J836,ING!$V$21=K836),I835+1,0)","v":0},"HUANCAVELICA","CASTROVIRREYNA","HUACHOS","090407"]
[null,null,null,null,null,null,null,"HUANCAVELICA CASTROVIRREYNA HUAMATAMBO",{"$f":"IF(AND(ING!$D$21=J837,ING!$V$21=K837),I836+1,0)","v":0},"HUANCAVELICA","CASTROVIRREYNA","HUAMATAMBO","090408"]
[null,null,null,null,null,null,null,"HUANCAVELICA CASTROVIRREYNA MOLLEPAMPA",{"$f":"IF(AND(ING!$D$21=J838,ING!$V$21=K838),I837+1,0)","v":0},"HUANCAVELICA","CASTROVIRREYNA","MOLLEPAMPA","090409"]
[null,null,null,null,null,null,null,"HUANCAVELICA CASTROVIRREYNA SAN JUAN",{"$f":"IF(AND(ING!$D$21=J839,ING!$V$21=K839),I838+1,0)","v":0},"HUANCAVELICA","CASTROVIRREYNA","SAN JUAN","090410"]
[null,null,null,null,null,null,null,"HUANCAVELICA CASTROVIRREYNA SANTA ANA",{"$f":"IF(AND(ING!$D$21=J840,ING!$V$21=K840),I839+1,0)","v":0},"HUANCAVELICA","CASTROVIRREYNA","SANTA ANA","090411"]
[null,null,null,null,null,null,null,"HUANCAVELICA CASTROVIRREYNA TANTARA",{"$f":"IF(AND(ING!$D$21=J841,ING!$V$21=K841),I840+1,0)","v":0},"HUANCAVELICA","CASTROVIRREYNA","TANTARA","090412"]
[null,null,null,null,null,null,null,"HUANCAVELICA CASTROVIRREYNA TICRAPO",{"$f":"IF(AND(ING!$D$21=J842,ING!$V$21=K842),I841+1,0)","v":0},"HUANCAVELICA","CASTROVIRREYNA","TICRAPO","090413"]
[null,null,null,null,null,null,null,"HUANCAVELICA CHURCAMPA ANCO",{"$f":"IF(AND(ING!$D$21=J843,ING!$V$21=K843),I842+1,0)","v":0},"HUANCAVELICA","CHURCAMPA","ANCO","090502"]
[null,null,null,null,null,null,null,"HUANCAVELICA CHURCAMPA CHINCHIHUASI",{"$f":"IF(AND(ING!$D$21=J844,ING!$V$21=K844),I843+1,0)","v":0},"HUANCAVELICA","CHURCAMPA","CHINCHIHUASI","090503"]
[null,null,null,null,null,null,null,"HUANCAVELICA CHURCAMPA CHURCAMPA",{"$f":"IF(AND(ING!$D$21=J845,ING!$V$21=K845),I844+1,0)","v":0},"HUANCAVELICA","CHURCAMPA","CHURCAMPA","090501"]
[null,null,null,null,null,null,null,"HUANCAVELICA CHURCAMPA COSME",{"$f":"IF(AND(ING!$D$21=J846,ING!$V$21=K846),I845+1,0)","v":0},"HUANCAVELICA","CHURCAMPA","COSME","090511"]
[null,null,null,null,null,null,null,"HUANCAVELICA CHURCAMPA EL CARMEN",{"$f":"IF(AND(ING!$D$21=J847,ING!$V$21=K847),I846+1,0)","v":0},"HUANCAVELICA","CHURCAMPA","EL CARMEN","090504"]
[null,null,null,null,null,null,null,"HUANCAVELICA CHURCAMPA LA MERCED",{"$f":"IF(AND(ING!$D$21=J848,ING!$V$21=K848),I847+1,0)","v":0},"HUANCAVELICA","CHURCAMPA","LA MERCED","090505"]
[null,null,null,null,null,null,null,"HUANCAVELICA CHURCAMPA LOCROJA",{"$f":"IF(AND(ING!$D$21=J849,ING!$V$21=K849),I848+1,0)","v":0},"HUANCAVELICA","CHURCAMPA","LOCROJA","090506"]
[null,null,null,null,null,null,null,"HUANCAVELICA CHURCAMPA PACHAMARCA",{"$f":"IF(AND(ING!$D$21=J850,ING!$V$21=K850),I849+1,0)","v":0},"HUANCAVELICA","CHURCAMPA","PACHAMARCA","090510"]
[null,null,null,null,null,null,null,"HUANCAVELICA CHURCAMPA PAUCARBAMBA",{"$f":"IF(AND(ING!$D$21=J851,ING!$V$21=K851),I850+1,0)","v":0},"HUANCAVELICA","CHURCAMPA","PAUCARBAMBA","090507"]
[null,null,null,null,null,null,null,"HUANCAVELICA CHURCAMPA SAN MIGUEL DE MAYOCC",{"$f":"IF(AND(ING!$D$21=J852,ING!$V$21=K852),I851+1,0)","v":0},"HUANCAVELICA","CHURCAMPA","SAN MIGUEL DE MAYOCC","090508"]
[null,null,null,null,null,null,null,"HUANCAVELICA CHURCAMPA SAN PEDRO DE CORIS",{"$f":"IF(AND(ING!$D$21=J853,ING!$V$21=K853),I852+1,0)","v":0},"HUANCAVELICA","CHURCAMPA","SAN PEDRO DE CORIS","090509"]
[null,null,null,null,null,null,null,"HUANCAVELICA HUANCAVELICA ACOBAMBILLA",{"$f":"IF(AND(ING!$D$21=J854,ING!$V$21=K854),I853+1,0)","v":0},"HUANCAVELICA","HUANCAVELICA","ACOBAMBILLA","090102"]
[null,null,null,null,null,null,null,"HUANCAVELICA HUANCAVELICA ACORIA",{"$f":"IF(AND(ING!$D$21=J855,ING!$V$21=K855),I854+1,0)","v":0},"HUANCAVELICA","HUANCAVELICA","ACORIA","090103"]
[null,null,null,null,null,null,null,"HUANCAVELICA HUANCAVELICA ASCENSION",{"$f":"IF(AND(ING!$D$21=J856,ING!$V$21=K856),I855+1,0)","v":0},"HUANCAVELICA","HUANCAVELICA","ASCENSION","090118"]
[null,null,null,null,null,null,null,"HUANCAVELICA HUANCAVELICA CONAYCA",{"$f":"IF(AND(ING!$D$21=J857,ING!$V$21=K857),I856+1,0)","v":0},"HUANCAVELICA","HUANCAVELICA","CONAYCA","090104"]
[null,null,null,null,null,null,null,"HUANCAVELICA HUANCAVELICA CUENCA",{"$f":"IF(AND(ING!$D$21=J858,ING!$V$21=K858),I857+1,0)","v":0},"HUANCAVELICA","HUANCAVELICA","CUENCA","090105"]
[null,null,null,null,null,null,null,"HUANCAVELICA HUANCAVELICA HUACHOCOLPA",{"$f":"IF(AND(ING!$D$21=J859,ING!$V$21=K859),I858+1,0)","v":0},"HUANCAVELICA","HUANCAVELICA","HUACHOCOLPA","090106"]
[null,null,null,null,null,null,null,"HUANCAVELICA HUANCAVELICA HUANCAVELICA",{"$f":"IF(AND(ING!$D$21=J860,ING!$V$21=K860),I859+1,0)","v":0},"HUANCAVELICA","HUANCAVELICA","HUANCAVELICA","090101"]
[null,null,null,null,null,null,null,"HUANCAVELICA HUANCAVELICA HUANDO",{"$f":"IF(AND(ING!$D$21=J861,ING!$V$21=K861),I860+1,0)","v":0},"HUANCAVELICA","HUANCAVELICA","HUANDO","090119"]
[null,null,null,null,null,null,null,"HUANCAVELICA HUANCAVELICA HUAYLLAHUARA",{"$f":"IF(AND(ING!$D$21=J862,ING!$V$21=K862),I861+1,0)","v":0},"HUANCAVELICA","HUANCAVELICA","HUAYLLAHUARA","090107"]
[null,null,null,null,null,null,null,"HUANCAVELICA HUANCAVELICA IZCUCHACA",{"$f":"IF(AND(ING!$D$21=J863,ING!$V$21=K863),I862+1,0)","v":0},"HUANCAVELICA","HUANCAVELICA","IZCUCHACA","090108"]
[null,null,null,null,null,null,null,"HUANCAVELICA HUANCAVELICA LARIA",{"$f":"IF(AND(ING!$D$21=J864,ING!$V$21=K864),I863+1,0)","v":0},"HUANCAVELICA","HUANCAVELICA","LARIA","090109"]
[null,null,null,null,null,null,null,"HUANCAVELICA HUANCAVELICA MANTA",{"$f":"IF(AND(ING!$D$21=J865,ING!$V$21=K865),I864+1,0)","v":0},"HUANCAVELICA","HUANCAVELICA","MANTA","090110"]
[null,null,null,null,null,null,null,"HUANCAVELICA HUANCAVELICA MARISCAL CACERES",{"$f":"IF(AND(ING!$D$21=J866,ING!$V$21=K866),I865+1,0)","v":0},"HUANCAVELICA","HUANCAVELICA","MARISCAL CACERES","090111"]
[null,null,null,null,null,null,null,"HUANCAVELICA HUANCAVELICA MOYA",{"$f":"IF(AND(ING!$D$21=J867,ING!$V$21=K867),I866+1,0)","v":0},"HUANCAVELICA","HUANCAVELICA","MOYA","090112"]
[null,null,null,null,null,null,null,"HUANCAVELICA HUANCAVELICA NUEVO OCCORO",{"$f":"IF(AND(ING!$D$21=J868,ING!$V$21=K868),I867+1,0)","v":0},"HUANCAVELICA","HUANCAVELICA","NUEVO OCCORO","090113"]
[null,null,null,null,null,null,null,"HUANCAVELICA HUANCAVELICA PALCA",{"$f":"IF(AND(ING!$D$21=J869,ING!$V$21=K869),I868+1,0)","v":0},"HUANCAVELICA","HUANCAVELICA","PALCA","090114"]
[null,null,null,null,null,null,null,"HUANCAVELICA HUANCAVELICA PILCHACA",{"$f":"IF(AND(ING!$D$21=J870,ING!$V$21=K870),I869+1,0)","v":0},"HUANCAVELICA","HUANCAVELICA","PILCHACA","090115"]
[null,null,null,null,null,null,null,"HUANCAVELICA HUANCAVELICA VILCA",{"$f":"IF(AND(ING!$D$21=J871,ING!$V$21=K871),I870+1,0)","v":0},"HUANCAVELICA","HUANCAVELICA","VILCA","090116"]
[null,null,null,null,null,null,null,"HUANCAVELICA HUANCAVELICA YAULI",{"$f":"IF(AND(ING!$D$21=J872,ING!$V$21=K872),I871+1,0)","v":0},"HUANCAVELICA","HUANCAVELICA","YAULI","090117"]
[null,null,null,null,null,null,null,"HUANCAVELICA HUAYTARA AYAVI",{"$f":"IF(AND(ING!$D$21=J873,ING!$V$21=K873),I872+1,0)","v":0},"HUANCAVELICA","HUAYTARA","AYAVI","090602"]
[null,null,null,null,null,null,null,"HUANCAVELICA HUAYTARA CORDOVA",{"$f":"IF(AND(ING!$D$21=J874,ING!$V$21=K874),I873+1,0)","v":0},"HUANCAVELICA","HUAYTARA","CORDOVA","090603"]
[null,null,null,null,null,null,null,"HUANCAVELICA HUAYTARA HUAYACUNDO ARMA",{"$f":"IF(AND(ING!$D$21=J875,ING!$V$21=K875),I874+1,0)","v":0},"HUANCAVELICA","HUAYTARA","HUAYACUNDO ARMA","090604"]
[null,null,null,null,null,null,null,"HUANCAVELICA HUAYTARA HUAYTARA",{"$f":"IF(AND(ING!$D$21=J876,ING!$V$21=K876),I875+1,0)","v":0},"HUANCAVELICA","HUAYTARA","HUAYTARA","090601"]
[null,null,null,null,null,null,null,"HUANCAVELICA HUAYTARA LARAMARCA",{"$f":"IF(AND(ING!$D$21=J877,ING!$V$21=K877),I876+1,0)","v":0},"HUANCAVELICA","HUAYTARA","LARAMARCA","090605"]
[null,null,null,null,null,null,null,"HUANCAVELICA HUAYTARA OCOYO",{"$f":"IF(AND(ING!$D$21=J878,ING!$V$21=K878),I877+1,0)","v":0},"HUANCAVELICA","HUAYTARA","OCOYO","090606"]
[null,null,null,null,null,null,null,"HUANCAVELICA HUAYTARA PILPICHACA",{"$f":"IF(AND(ING!$D$21=J879,ING!$V$21=K879),I878+1,0)","v":0},"HUANCAVELICA","HUAYTARA","PILPICHACA","090607"]
[null,null,null,null,null,null,null,"HUANCAVELICA HUAYTARA QUERCO",{"$f":"IF(AND(ING!$D$21=J880,ING!$V$21=K880),I879+1,0)","v":0},"HUANCAVELICA","HUAYTARA","QUERCO","090608"]
[null,null,null,null,null,null,null,"HUANCAVELICA HUAYTARA QUITO-ARMA",{"$f":"IF(AND(ING!$D$21=J881,ING!$V$21=K881),I880+1,0)","v":0},"HUANCAVELICA","HUAYTARA","QUITO-ARMA","090609"]
[null,null,null,null,null,null,null,"HUANCAVELICA HUAYTARA SAN ANTONIO DE CUSICANCHA",{"$f":"IF(AND(ING!$D$21=J882,ING!$V$21=K882),I881+1,0)","v":0},"HUANCAVELICA","HUAYTARA","SAN ANTONIO DE CUSICANCHA","090610"]
[null,null,null,null,null,null,null,"HUANCAVELICA HUAYTARA SAN FRANCISCO DE SANGAYAICO",{"$f":"IF(AND(ING!$D$21=J883,ING!$V$21=K883),I882+1,0)","v":0},"HUANCAVELICA","HUAYTARA","SAN FRANCISCO DE SANGAYAICO","090611"]
[null,null,null,null,null,null,null,"HUANCAVELICA HUAYTARA SAN ISIDRO",{"$f":"IF(AND(ING!$D$21=J884,ING!$V$21=K884),I883+1,0)","v":0},"HUANCAVELICA","HUAYTARA","SAN ISIDRO","090612"]
[null,null,null,null,null,null,null,"HUANCAVELICA HUAYTARA SANTIAGO DE CHOCORVOS",{"$f":"IF(AND(ING!$D$21=J885,ING!$V$21=K885),I884+1,0)","v":0},"HUANCAVELICA","HUAYTARA","SANTIAGO DE CHOCORVOS","090613"]
[null,null,null,null,null,null,null,"HUANCAVELICA HUAYTARA SANTIAGO DE QUIRAHUARA",{"$f":"IF(AND(ING!$D$21=J886,ING!$V$21=K886),I885+1,0)","v":0},"HUANCAVELICA","HUAYTARA","SANTIAGO DE QUIRAHUARA","090614"]
[null,null,null,null,null,null,null,"HUANCAVELICA HUAYTARA SANTO DOMINGO DE CAPILLAS",{"$f":"IF(AND(ING!$D$21=J887,ING!$V$21=K887),I886+1,0)","v":0},"HUANCAVELICA","HUAYTARA","SANTO DOMINGO DE CAPILLAS","090615"]
[null,null,null,null,null,null,null,"HUANCAVELICA HUAYTARA TAMBO",{"$f":"IF(AND(ING!$D$21=J888,ING!$V$21=K888),I887+1,0)","v":0},"HUANCAVELICA","HUAYTARA","TAMBO","090616"]
[null,null,null,null,null,null,null,"HUANCAVELICA TAYACAJA ACOSTAMBO",{"$f":"IF(AND(ING!$D$21=J889,ING!$V$21=K889),I888+1,0)","v":0},"HUANCAVELICA","TAYACAJA","ACOSTAMBO","090702"]
[null,null,null,null,null,null,null,"HUANCAVELICA TAYACAJA ACRAQUIA",{"$f":"IF(AND(ING!$D$21=J890,ING!$V$21=K890),I889+1,0)","v":0},"HUANCAVELICA","TAYACAJA","ACRAQUIA","090703"]
[null,null,null,null,null,null,null,"HUANCAVELICA TAYACAJA AHUAYCHA",{"$f":"IF(AND(ING!$D$21=J891,ING!$V$21=K891),I890+1,0)","v":0},"HUANCAVELICA","TAYACAJA","AHUAYCHA","090704"]
[null,null,null,null,null,null,null,"HUANCAVELICA TAYACAJA ANDAYMARCA",{"$f":"IF(AND(ING!$D$21=J892,ING!$V$21=K892),I891+1,0)","v":0},"HUANCAVELICA","TAYACAJA","ANDAYMARCA","090720"]
[null,null,null,null,null,null,null,"HUANCAVELICA TAYACAJA COLCABAMBA",{"$f":"IF(AND(ING!$D$21=J893,ING!$V$21=K893),I892+1,0)","v":0},"HUANCAVELICA","TAYACAJA","COLCABAMBA","090705"]
[null,null,null,null,null,null,null,"HUANCAVELICA TAYACAJA DANIEL HERNANDEZ",{"$f":"IF(AND(ING!$D$21=J894,ING!$V$21=K894),I893+1,0)","v":0},"HUANCAVELICA","TAYACAJA","DANIEL HERNANDEZ","090706"]
[null,null,null,null,null,null,null,"HUANCAVELICA TAYACAJA HUACHOCOLPA",{"$f":"IF(AND(ING!$D$21=J895,ING!$V$21=K895),I894+1,0)","v":0},"HUANCAVELICA","TAYACAJA","HUACHOCOLPA","090707"]
[null,null,null,null,null,null,null,"HUANCAVELICA TAYACAJA HUARIBAMBA",{"$f":"IF(AND(ING!$D$21=J896,ING!$V$21=K896),I895+1,0)","v":0},"HUANCAVELICA","TAYACAJA","HUARIBAMBA","090709"]
[null,null,null,null,null,null,null,"HUANCAVELICA TAYACAJA ÑAHUIMPUQUIO",{"$f":"IF(AND(ING!$D$21=J897,ING!$V$21=K897),I896+1,0)","v":0},"HUANCAVELICA","TAYACAJA","ÑAHUIMPUQUIO","090710"]
[null,null,null,null,null,null,null,"HUANCAVELICA TAYACAJA PAMPAS",{"$f":"IF(AND(ING!$D$21=J898,ING!$V$21=K898),I897+1,0)","v":0},"HUANCAVELICA","TAYACAJA","PAMPAS","090701"]
[null,null,null,null,null,null,null,{"$f":"J899&\" \"&K899&\" \"&L899","v":"HUANCAVELICA TAYACAJA PAZOS"},{"$f":"IF(AND(ING!$D$21=J899,ING!$V$21=K899),I898+1,0)","v":0},"HUANCAVELICA","TAYACAJA","PAZOS","090711"]
[null,null,null,null,null,null,null,"HUANCAVELICA TAYACAJA PICHOS",{"$f":"IF(AND(ING!$D$21=J900,ING!$V$21=K900),I899+1,0)","v":0},"HUANCAVELICA","TAYACAJA","PICHOS","090722"]
[null,null,null,null,null,null,null,"HUANCAVELICA TAYACAJA QUICHUAS",{"$f":"IF(AND(ING!$D$21=J901,ING!$V$21=K901),I900+1,0)","v":0},"HUANCAVELICA","TAYACAJA","QUICHUAS","090719"]
[null,null,null,null,null,null,null,"HUANCAVELICA TAYACAJA QUISHUAR",{"$f":"IF(AND(ING!$D$21=J902,ING!$V$21=K902),I901+1,0)","v":0},"HUANCAVELICA","TAYACAJA","QUISHUAR","090713"]
[null,null,null,null,null,null,null,"HUANCAVELICA TAYACAJA ROBLE",{"$f":"IF(AND(ING!$D$21=J903,ING!$V$21=K903),I902+1,0)","v":0},"HUANCAVELICA","TAYACAJA","ROBLE","090721"]
[null,null,null,null,null,null,null,"HUANCAVELICA TAYACAJA SALCABAMBA",{"$f":"IF(AND(ING!$D$21=J904,ING!$V$21=K904),I903+1,0)","v":0},"HUANCAVELICA","TAYACAJA","SALCABAMBA","090714"]
[null,null,null,null,null,null,null,"HUANCAVELICA TAYACAJA SALCAHUASI",{"$f":"IF(AND(ING!$D$21=J905,ING!$V$21=K905),I904+1,0)","v":0},"HUANCAVELICA","TAYACAJA","SALCAHUASI","090715"]
[null,null,null,null,null,null,null,"HUANCAVELICA TAYACAJA SAN MARCOS DE ROCCHAC",{"$f":"IF(AND(ING!$D$21=J906,ING!$V$21=K906),I905+1,0)","v":0},"HUANCAVELICA","TAYACAJA","SAN MARCOS DE ROCCHAC","090716"]
[null,null,null,null,null,null,null,"HUANCAVELICA TAYACAJA SANTIAGO DE TUCUMA",{"$f":"IF(AND(ING!$D$21=J907,ING!$V$21=K907),I906+1,0)","v":0},"HUANCAVELICA","TAYACAJA","SANTIAGO DE TUCUMA","090723"]
[null,null,null,null,null,null,null,"HUANCAVELICA TAYACAJA SURCUBAMBA",{"$f":"IF(AND(ING!$D$21=J908,ING!$V$21=K908),I907+1,0)","v":0},"HUANCAVELICA","TAYACAJA","SURCUBAMBA","090717"]
[null,null,null,null,null,null,null,"HUANCAVELICA TAYACAJA TINTAY PUNCU",{"$f":"IF(AND(ING!$D$21=J909,ING!$V$21=K909),I908+1,0)","v":0},"HUANCAVELICA","TAYACAJA","TINTAY PUNCU","090718"]
[null,null,null,null,null,null,null,"HUÁNUCO AMBO AMBO",{"$f":"IF(AND(ING!$D$21=J910,ING!$V$21=K910),I909+1,0)","v":0},"HUÁNUCO","AMBO","AMBO","100201"]
[null,null,null,null,null,null,null,"HUÁNUCO AMBO CAYNA",{"$f":"IF(AND(ING!$D$21=J911,ING!$V$21=K911),I910+1,0)","v":0},"HUÁNUCO","AMBO","CAYNA","100202"]
[null,null,null,null,null,null,null,"HUÁNUCO AMBO COLPAS",{"$f":"IF(AND(ING!$D$21=J912,ING!$V$21=K912),I911+1,0)","v":0},"HUÁNUCO","AMBO","COLPAS","100203"]
[null,null,null,null,null,null,null,"HUÁNUCO AMBO CONCHAMARCA",{"$f":"IF(AND(ING!$D$21=J913,ING!$V$21=K913),I912+1,0)","v":0},"HUÁNUCO","AMBO","CONCHAMARCA","100204"]
[null,null,null,null,null,null,null,"HUÁNUCO AMBO HUACAR",{"$f":"IF(AND(ING!$D$21=J914,ING!$V$21=K914),I913+1,0)","v":0},"HUÁNUCO","AMBO","HUACAR","100205"]
[null,null,null,null,null,null,null,"HUÁNUCO AMBO SAN FRANCISCO",{"$f":"IF(AND(ING!$D$21=J915,ING!$V$21=K915),I914+1,0)","v":0},"HUÁNUCO","AMBO","SAN FRANCISCO","100206"]
[null,null,null,null,null,null,null,"HUÁNUCO AMBO SAN RAFAEL",{"$f":"IF(AND(ING!$D$21=J916,ING!$V$21=K916),I915+1,0)","v":0},"HUÁNUCO","AMBO","SAN RAFAEL","100207"]
[null,null,null,null,null,null,null,"HUÁNUCO AMBO TOMAY KICHWA",{"$f":"IF(AND(ING!$D$21=J917,ING!$V$21=K917),I916+1,0)","v":0},"HUÁNUCO","AMBO","TOMAY KICHWA","100208"]
[null,null,null,null,null,null,null,"HUÁNUCO DOS DE MAYO CHUQUIS",{"$f":"IF(AND(ING!$D$21=J918,ING!$V$21=K918),I917+1,0)","v":0},"HUÁNUCO","DOS DE MAYO","CHUQUIS","100307"]
[null,null,null,null,null,null,null,"HUÁNUCO DOS DE MAYO LA UNION",{"$f":"IF(AND(ING!$D$21=J919,ING!$V$21=K919),I918+1,0)","v":0},"HUÁNUCO","DOS DE MAYO","LA UNION","100301"]
[null,null,null,null,null,null,null,"HUÁNUCO DOS DE MAYO MARIAS",{"$f":"IF(AND(ING!$D$21=J920,ING!$V$21=K920),I919+1,0)","v":0},"HUÁNUCO","DOS DE MAYO","MARIAS","100311"]
[null,null,null,null,null,null,null,"HUÁNUCO DOS DE MAYO PACHAS",{"$f":"IF(AND(ING!$D$21=J921,ING!$V$21=K921),I920+1,0)","v":0},"HUÁNUCO","DOS DE MAYO","PACHAS","100313"]
[null,null,null,null,null,null,null,"HUÁNUCO DOS DE MAYO QUIVILLA",{"$f":"IF(AND(ING!$D$21=J922,ING!$V$21=K922),I921+1,0)","v":0},"HUÁNUCO","DOS DE MAYO","QUIVILLA","100316"]
[null,null,null,null,null,null,null,"HUÁNUCO DOS DE MAYO RIPAN",{"$f":"IF(AND(ING!$D$21=J923,ING!$V$21=K923),I922+1,0)","v":0},"HUÁNUCO","DOS DE MAYO","RIPAN","100317"]
[null,null,null,null,null,null,null,"HUÁNUCO DOS DE MAYO SHUNQUI",{"$f":"IF(AND(ING!$D$21=J924,ING!$V$21=K924),I923+1,0)","v":0},"HUÁNUCO","DOS DE MAYO","SHUNQUI","100321"]
[null,null,null,null,null,null,null,"HUÁNUCO DOS DE MAYO SILLAPATA",{"$f":"IF(AND(ING!$D$21=J925,ING!$V$21=K925),I924+1,0)","v":0},"HUÁNUCO","DOS DE MAYO","SILLAPATA","100322"]
[null,null,null,null,null,null,null,"HUÁNUCO DOS DE MAYO YANAS",{"$f":"IF(AND(ING!$D$21=J926,ING!$V$21=K926),I925+1,0)","v":0},"HUÁNUCO","DOS DE MAYO","YANAS","100323"]
[null,null,null,null,null,null,null,"HUÁNUCO HUACAYBAMBA CANCHABAMBA",{"$f":"IF(AND(ING!$D$21=J927,ING!$V$21=K927),I926+1,0)","v":0},"HUÁNUCO","HUACAYBAMBA","CANCHABAMBA","100402"]
[null,null,null,null,null,null,null,"HUÁNUCO HUACAYBAMBA COCHABAMBA",{"$f":"IF(AND(ING!$D$21=J928,ING!$V$21=K928),I927+1,0)","v":0},"HUÁNUCO","HUACAYBAMBA","COCHABAMBA","100403"]
[null,null,null,null,null,null,null,"HUÁNUCO HUACAYBAMBA HUACAYBAMBA",{"$f":"IF(AND(ING!$D$21=J929,ING!$V$21=K929),I928+1,0)","v":0},"HUÁNUCO","HUACAYBAMBA","HUACAYBAMBA","100401"]
[null,null,null,null,null,null,null,"HUÁNUCO HUACAYBAMBA PINRA",{"$f":"IF(AND(ING!$D$21=J930,ING!$V$21=K930),I929+1,0)","v":0},"HUÁNUCO","HUACAYBAMBA","PINRA","100404"]
[null,null,null,null,null,null,null,"HUÁNUCO HUAMALIES ARANCAY",{"$f":"IF(AND(ING!$D$21=J931,ING!$V$21=K931),I930+1,0)","v":0},"HUÁNUCO","HUAMALIES","ARANCAY","100502"]
[null,null,null,null,null,null,null,"HUÁNUCO HUAMALIES CHAVIN DE PARIARCA",{"$f":"IF(AND(ING!$D$21=J932,ING!$V$21=K932),I931+1,0)","v":0},"HUÁNUCO","HUAMALIES","CHAVIN DE PARIARCA","100503"]
[null,null,null,null,null,null,null,"HUÁNUCO HUAMALIES JACAS GRANDE",{"$f":"IF(AND(ING!$D$21=J933,ING!$V$21=K933),I932+1,0)","v":0},"HUÁNUCO","HUAMALIES","JACAS GRANDE","100504"]
[null,null,null,null,null,null,null,"HUÁNUCO HUAMALIES JIRCAN",{"$f":"IF(AND(ING!$D$21=J934,ING!$V$21=K934),I933+1,0)","v":0},"HUÁNUCO","HUAMALIES","JIRCAN","100505"]
[null,null,null,null,null,null,null,"HUÁNUCO HUAMALIES LLATA",{"$f":"IF(AND(ING!$D$21=J935,ING!$V$21=K935),I934+1,0)","v":0},"HUÁNUCO","HUAMALIES","LLATA","100501"]
[null,null,null,null,null,null,null,"HUÁNUCO HUAMALIES MIRAFLORES",{"$f":"IF(AND(ING!$D$21=J936,ING!$V$21=K936),I935+1,0)","v":0},"HUÁNUCO","HUAMALIES","MIRAFLORES","100506"]
[null,null,null,null,null,null,null,"HUÁNUCO HUAMALIES MONZON",{"$f":"IF(AND(ING!$D$21=J937,ING!$V$21=K937),I936+1,0)","v":0},"HUÁNUCO","HUAMALIES","MONZON","100507"]
[null,null,null,null,null,null,null,"HUÁNUCO HUAMALIES PUNCHAO",{"$f":"IF(AND(ING!$D$21=J938,ING!$V$21=K938),I937+1,0)","v":0},"HUÁNUCO","HUAMALIES","PUNCHAO","100508"]
[null,null,null,null,null,null,null,"HUÁNUCO HUAMALIES PUÑOS",{"$f":"IF(AND(ING!$D$21=J939,ING!$V$21=K939),I938+1,0)","v":0},"HUÁNUCO","HUAMALIES","PUÑOS","100509"]
[null,null,null,null,null,null,null,"HUÁNUCO HUAMALIES SINGA",{"$f":"IF(AND(ING!$D$21=J940,ING!$V$21=K940),I939+1,0)","v":0},"HUÁNUCO","HUAMALIES","SINGA","100510"]
[null,null,null,null,null,null,null,"HUÁNUCO HUAMALIES TANTAMAYO",{"$f":"IF(AND(ING!$D$21=J941,ING!$V$21=K941),I940+1,0)","v":0},"HUÁNUCO","HUAMALIES","TANTAMAYO","100511"]
[null,null,null,null,null,null,null,"HUÁNUCO HUANUCO AMARILIS",{"$f":"IF(AND(ING!$D$21=J942,ING!$V$21=K942),I941+1,0)","v":0},"HUÁNUCO","HUANUCO","AMARILIS","100102"]
[null,null,null,null,null,null,null,"HUÁNUCO HUANUCO CHINCHAO",{"$f":"IF(AND(ING!$D$21=J943,ING!$V$21=K943),I942+1,0)","v":0},"HUÁNUCO","HUANUCO","CHINCHAO","100103"]
[null,null,null,null,null,null,null,"HUÁNUCO HUANUCO CHURUBAMBA",{"$f":"IF(AND(ING!$D$21=J944,ING!$V$21=K944),I943+1,0)","v":0},"HUÁNUCO","HUANUCO","CHURUBAMBA","100104"]
[null,null,null,null,null,null,null,"HUÁNUCO HUANUCO HUANUCO",{"$f":"IF(AND(ING!$D$21=J945,ING!$V$21=K945),I944+1,0)","v":0},"HUÁNUCO","HUANUCO","HUANUCO","100101"]
[null,null,null,null,null,null,null,"HUÁNUCO HUANUCO MARGOS",{"$f":"IF(AND(ING!$D$21=J946,ING!$V$21=K946),I945+1,0)","v":0},"HUÁNUCO","HUANUCO","MARGOS","100105"]
[null,null,null,null,null,null,null,"HUÁNUCO HUANUCO PILLCO MARCA",{"$f":"IF(AND(ING!$D$21=J947,ING!$V$21=K947),I946+1,0)","v":0},"HUÁNUCO","HUANUCO","PILLCO MARCA","100111"]
[null,null,null,null,null,null,null,"HUÁNUCO HUANUCO QUISQUI (KICHKI)",{"$f":"IF(AND(ING!$D$21=J948,ING!$V$21=K948),I947+1,0)","v":0},"HUÁNUCO","HUANUCO","QUISQUI (KICHKI)","100106"]
[null,null,null,null,null,null,null,"HUÁNUCO HUANUCO SAN FRANCISCO DE CAYRAN",{"$f":"IF(AND(ING!$D$21=J949,ING!$V$21=K949),I948+1,0)","v":0},"HUÁNUCO","HUANUCO","SAN FRANCISCO DE CAYRAN","100107"]
[null,null,null,null,null,null,null,"HUÁNUCO HUANUCO SAN PABLO DE PILLAO",{"$f":"IF(AND(ING!$D$21=J950,ING!$V$21=K950),I949+1,0)","v":0},"HUÁNUCO","HUANUCO","SAN PABLO DE PILLAO","100113"]
[null,null,null,null,null,null,null,"HUÁNUCO HUANUCO SAN PEDRO DE CHAULAN",{"$f":"IF(AND(ING!$D$21=J951,ING!$V$21=K951),I950+1,0)","v":0},"HUÁNUCO","HUANUCO","SAN PEDRO DE CHAULAN","100108"]
[null,null,null,null,null,null,null,"HUÁNUCO HUANUCO SANTA MARIA DEL VALLE",{"$f":"IF(AND(ING!$D$21=J952,ING!$V$21=K952),I951+1,0)","v":0},"HUÁNUCO","HUANUCO","SANTA MARIA DEL VALLE","100109"]
[null,null,null,null,null,null,null,"HUÁNUCO HUANUCO YACUS",{"$f":"IF(AND(ING!$D$21=J953,ING!$V$21=K953),I952+1,0)","v":0},"HUÁNUCO","HUANUCO","YACUS","100112"]
[null,null,null,null,null,null,null,"HUÁNUCO HUANUCO YARUMAYO",{"$f":"IF(AND(ING!$D$21=J954,ING!$V$21=K954),I953+1,0)","v":0},"HUÁNUCO","HUANUCO","YARUMAYO","100110"]
[null,null,null,null,null,null,null,"HUÁNUCO LAURICOCHA BAÑOS",{"$f":"IF(AND(ING!$D$21=J955,ING!$V$21=K955),I954+1,0)","v":0},"HUÁNUCO","LAURICOCHA","BAÑOS","101002"]
[null,null,null,null,null,null,null,"HUÁNUCO LAURICOCHA JESUS",{"$f":"IF(AND(ING!$D$21=J956,ING!$V$21=K956),I955+1,0)","v":0},"HUÁNUCO","LAURICOCHA","JESUS","101001"]
[null,null,null,null,null,null,null,"HUÁNUCO LAURICOCHA JIVIA",{"$f":"IF(AND(ING!$D$21=J957,ING!$V$21=K957),I956+1,0)","v":0},"HUÁNUCO","LAURICOCHA","JIVIA","101003"]
[null,null,null,null,null,null,null,"HUÁNUCO LAURICOCHA QUEROPALCA",{"$f":"IF(AND(ING!$D$21=J958,ING!$V$21=K958),I957+1,0)","v":0},"HUÁNUCO","LAURICOCHA","QUEROPALCA","101004"]
[null,null,null,null,null,null,null,"HUÁNUCO LAURICOCHA RONDOS",{"$f":"IF(AND(ING!$D$21=J959,ING!$V$21=K959),I958+1,0)","v":0},"HUÁNUCO","LAURICOCHA","RONDOS","101005"]
[null,null,null,null,null,null,null,"HUÁNUCO LAURICOCHA SAN FRANCISCO DE ASIS",{"$f":"IF(AND(ING!$D$21=J960,ING!$V$21=K960),I959+1,0)","v":0},"HUÁNUCO","LAURICOCHA","SAN FRANCISCO DE ASIS","101006"]
[null,null,null,null,null,null,null,"HUÁNUCO LAURICOCHA SAN MIGUEL DE CAURI",{"$f":"IF(AND(ING!$D$21=J961,ING!$V$21=K961),I960+1,0)","v":0},"HUÁNUCO","LAURICOCHA","SAN MIGUEL DE CAURI","101007"]
[null,null,null,null,null,null,null,"HUÁNUCO LEONCIO PRADO CASTILLO GRANDE",{"$f":"IF(AND(ING!$D$21=J962,ING!$V$21=K962),I961+1,0)","v":0},"HUÁNUCO","LEONCIO PRADO","CASTILLO GRANDE","100608"]
[null,null,null,null,null,null,null,{"$f":"J963&\" \"&K963&\" \"&L963","v":"HUÁNUCO LEONCIO PRADO DANIEL ALOMIA ROBLES"},{"$f":"IF(AND(ING!$D$21=J963,ING!$V$21=K963),I962+1,0)","v":0},"HUÁNUCO","LEONCIO PRADO","DANIEL ALOMIA ROBLES","100602"]
[null,null,null,null,null,null,null,"HUÁNUCO LEONCIO PRADO HERMILIO VALDIZAN",{"$f":"IF(AND(ING!$D$21=J964,ING!$V$21=K964),I963+1,0)","v":0},"HUÁNUCO","LEONCIO PRADO","HERMILIO VALDIZAN","100603"]
[null,null,null,null,null,null,null,"HUÁNUCO LEONCIO PRADO JOSE CRESPO Y CASTILLO",{"$f":"IF(AND(ING!$D$21=J965,ING!$V$21=K965),I964+1,0)","v":0},"HUÁNUCO","LEONCIO PRADO","JOSE CRESPO Y CASTILLO","100604"]
[null,null,null,null,null,null,null,"HUÁNUCO LEONCIO PRADO LUYANDO",{"$f":"IF(AND(ING!$D$21=J966,ING!$V$21=K966),I965+1,0)","v":0},"HUÁNUCO","LEONCIO PRADO","LUYANDO","100605"]
[null,null,null,null,null,null,null,"HUÁNUCO LEONCIO PRADO MARIANO DAMASO BERAUN",{"$f":"IF(AND(ING!$D$21=J967,ING!$V$21=K967),I966+1,0)","v":0},"HUÁNUCO","LEONCIO PRADO","MARIANO DAMASO BERAUN","100606"]
[null,null,null,null,null,null,null,"HUÁNUCO LEONCIO PRADO PUCAYACU",{"$f":"IF(AND(ING!$D$21=J968,ING!$V$21=K968),I967+1,0)","v":0},"HUÁNUCO","LEONCIO PRADO","PUCAYACU","100607"]
[null,null,null,null,null,null,null,"HUÁNUCO LEONCIO PRADO PUEBLO NUEVO",{"$f":"IF(AND(ING!$D$21=J969,ING!$V$21=K969),I968+1,0)","v":0},"HUÁNUCO","LEONCIO PRADO","PUEBLO NUEVO","100609"]
[null,null,null,null,null,null,null,"HUÁNUCO LEONCIO PRADO RUPA-RUPA",{"$f":"IF(AND(ING!$D$21=J970,ING!$V$21=K970),I969+1,0)","v":0},"HUÁNUCO","LEONCIO PRADO","RUPA-RUPA","100601"]
[null,null,null,null,null,null,null,"HUÁNUCO LEONCIO PRADO SANTO DOMINGO DE ANDA",{"$f":"IF(AND(ING!$D$21=J971,ING!$V$21=K971),I970+1,0)","v":0},"HUÁNUCO","LEONCIO PRADO","SANTO DOMINGO DE ANDA","100610"]
[null,null,null,null,null,null,null,"HUÁNUCO MARAÑON CHOLON",{"$f":"IF(AND(ING!$D$21=J972,ING!$V$21=K972),I971+1,0)","v":0},"HUÁNUCO","MARAÑON","CHOLON","100702"]
[null,null,null,null,null,null,null,"HUÁNUCO MARAÑON HUACRACHUCO",{"$f":"IF(AND(ING!$D$21=J973,ING!$V$21=K973),I972+1,0)","v":0},"HUÁNUCO","MARAÑON","HUACRACHUCO","100701"]
[null,null,null,null,null,null,null,"HUÁNUCO MARAÑON LA MORADA",{"$f":"IF(AND(ING!$D$21=J974,ING!$V$21=K974),I973+1,0)","v":0},"HUÁNUCO","MARAÑON","LA MORADA","100704"]
[null,null,null,null,null,null,null,"HUÁNUCO MARAÑON SAN BUENAVENTURA",{"$f":"IF(AND(ING!$D$21=J975,ING!$V$21=K975),I974+1,0)","v":0},"HUÁNUCO","MARAÑON","SAN BUENAVENTURA","100703"]
[null,null,null,null,null,null,null,"HUÁNUCO MARAÑON SANTA ROSA DE ALTO YANAJANCA",{"$f":"IF(AND(ING!$D$21=J976,ING!$V$21=K976),I975+1,0)","v":0},"HUÁNUCO","MARAÑON","SANTA ROSA DE ALTO YANAJANCA","100705"]
[null,null,null,null,null,null,null,"HUÁNUCO PACHITEA CHAGLLA",{"$f":"IF(AND(ING!$D$21=J977,ING!$V$21=K977),I976+1,0)","v":0},"HUÁNUCO","PACHITEA","CHAGLLA","100802"]
[null,null,null,null,null,null,null,"HUÁNUCO PACHITEA MOLINO",{"$f":"IF(AND(ING!$D$21=J978,ING!$V$21=K978),I977+1,0)","v":0},"HUÁNUCO","PACHITEA","MOLINO","100803"]
[null,null,null,null,null,null,null,"HUÁNUCO PACHITEA PANAO",{"$f":"IF(AND(ING!$D$21=J979,ING!$V$21=K979),I978+1,0)","v":0},"HUÁNUCO","PACHITEA","PANAO","100801"]
[null,null,null,null,null,null,null,"HUÁNUCO PACHITEA UMARI",{"$f":"IF(AND(ING!$D$21=J980,ING!$V$21=K980),I979+1,0)","v":0},"HUÁNUCO","PACHITEA","UMARI","100804"]
[null,null,null,null,null,null,null,"HUÁNUCO PUERTO INCA CODO DEL POZUZO",{"$f":"IF(AND(ING!$D$21=J981,ING!$V$21=K981),I980+1,0)","v":0},"HUÁNUCO","PUERTO INCA","CODO DEL POZUZO","100902"]
[null,null,null,null,null,null,null,"HUÁNUCO PUERTO INCA HONORIA",{"$f":"IF(AND(ING!$D$21=J982,ING!$V$21=K982),I981+1,0)","v":0},"HUÁNUCO","PUERTO INCA","HONORIA","100903"]
[null,null,null,null,null,null,null,"HUÁNUCO PUERTO INCA PUERTO INCA",{"$f":"IF(AND(ING!$D$21=J983,ING!$V$21=K983),I982+1,0)","v":0},"HUÁNUCO","PUERTO INCA","PUERTO INCA","100901"]
[null,null,null,null,null,null,null,"HUÁNUCO PUERTO INCA TOURNAVISTA",{"$f":"IF(AND(ING!$D$21=J984,ING!$V$21=K984),I983+1,0)","v":0},"HUÁNUCO","PUERTO INCA","TOURNAVISTA","100904"]
[null,null,null,null,null,null,null,"HUÁNUCO PUERTO INCA YUYAPICHIS",{"$f":"IF(AND(ING!$D$21=J985,ING!$V$21=K985),I984+1,0)","v":0},"HUÁNUCO","PUERTO INCA","YUYAPICHIS","100905"]
[null,null,null,null,null,null,null,"HUÁNUCO YAROWILCA APARICIO POMARES",{"$f":"IF(AND(ING!$D$21=J986,ING!$V$21=K986),I985+1,0)","v":0},"HUÁNUCO","YAROWILCA","APARICIO POMARES","101104"]
[null,null,null,null,null,null,null,"HUÁNUCO YAROWILCA CAHUAC",{"$f":"IF(AND(ING!$D$21=J987,ING!$V$21=K987),I986+1,0)","v":0},"HUÁNUCO","YAROWILCA","CAHUAC","101102"]
[null,null,null,null,null,null,null,"HUÁNUCO YAROWILCA CHACABAMBA",{"$f":"IF(AND(ING!$D$21=J988,ING!$V$21=K988),I987+1,0)","v":0},"HUÁNUCO","YAROWILCA","CHACABAMBA","101103"]
[null,null,null,null,null,null,null,"HUÁNUCO YAROWILCA CHAVINILLO",{"$f":"IF(AND(ING!$D$21=J989,ING!$V$21=K989),I988+1,0)","v":0},"HUÁNUCO","YAROWILCA","CHAVINILLO","101101"]
[null,null,null,null,null,null,null,"HUÁNUCO YAROWILCA CHORAS",{"$f":"IF(AND(ING!$D$21=J990,ING!$V$21=K990),I989+1,0)","v":0},"HUÁNUCO","YAROWILCA","CHORAS","101108"]
[null,null,null,null,null,null,null,"HUÁNUCO YAROWILCA JACAS CHICO",{"$f":"IF(AND(ING!$D$21=J991,ING!$V$21=K991),I990+1,0)","v":0},"HUÁNUCO","YAROWILCA","JACAS CHICO","101105"]
[null,null,null,null,null,null,null,"HUÁNUCO YAROWILCA OBAS",{"$f":"IF(AND(ING!$D$21=J992,ING!$V$21=K992),I991+1,0)","v":0},"HUÁNUCO","YAROWILCA","OBAS","101106"]
[null,null,null,null,null,null,null,"HUÁNUCO YAROWILCA PAMPAMARCA",{"$f":"IF(AND(ING!$D$21=J993,ING!$V$21=K993),I992+1,0)","v":0},"HUÁNUCO","YAROWILCA","PAMPAMARCA","101107"]
[null,null,null,null,null,null,null,"ICA CHINCHA ALTO LARAN",{"$f":"IF(AND(ING!$D$21=J994,ING!$V$21=K994),I993+1,0)","v":0},"ICA","CHINCHA","ALTO LARAN","110202"]
[null,null,null,null,null,null,null,"ICA CHINCHA CHAVIN",{"$f":"IF(AND(ING!$D$21=J995,ING!$V$21=K995),I994+1,0)","v":0},"ICA","CHINCHA","CHAVIN","110203"]
[null,null,null,null,null,null,null,"ICA CHINCHA CHINCHA ALTA",{"$f":"IF(AND(ING!$D$21=J996,ING!$V$21=K996),I995+1,0)","v":0},"ICA","CHINCHA","CHINCHA ALTA","110201"]
[null,null,null,null,null,null,null,"ICA CHINCHA CHINCHA BAJA",{"$f":"IF(AND(ING!$D$21=J997,ING!$V$21=K997),I996+1,0)","v":0},"ICA","CHINCHA","CHINCHA BAJA","110204"]
[null,null,null,null,null,null,null,"ICA CHINCHA EL CARMEN",{"$f":"IF(AND(ING!$D$21=J998,ING!$V$21=K998),I997+1,0)","v":0},"ICA","CHINCHA","EL CARMEN","110205"]
[null,null,null,null,null,null,null,"ICA CHINCHA GROCIO PRADO",{"$f":"IF(AND(ING!$D$21=J999,ING!$V$21=K999),I998+1,0)","v":0},"ICA","CHINCHA","GROCIO PRADO","110206"]
[null,null,null,null,null,null,null,"ICA CHINCHA PUEBLO NUEVO",{"$f":"IF(AND(ING!$D$21=J1000,ING!$V$21=K1000),I999+1,0)","v":0},"ICA","CHINCHA","PUEBLO NUEVO","110207"]
[null,null,null,null,null,null,null,"ICA CHINCHA SAN JUAN DE YANAC",{"$f":"IF(AND(ING!$D$21=J1001,ING!$V$21=K1001),I1000+1,0)","v":0},"ICA","CHINCHA","SAN JUAN DE YANAC","110208"]
[null,null,null,null,null,null,null,"ICA CHINCHA SAN PEDRO DE HUACARPANA",{"$f":"IF(AND(ING!$D$21=J1002,ING!$V$21=K1002),I1001+1,0)","v":0},"ICA","CHINCHA","SAN PEDRO DE HUACARPANA","110209"]
[null,null,null,null,null,null,null,"ICA CHINCHA SUNAMPE",{"$f":"IF(AND(ING!$D$21=J1003,ING!$V$21=K1003),I1002+1,0)","v":0},"ICA","CHINCHA","SUNAMPE","110210"]
[null,null,null,null,null,null,null,"ICA CHINCHA TAMBO DE MORA",{"$f":"IF(AND(ING!$D$21=J1004,ING!$V$21=K1004),I1003+1,0)","v":0},"ICA","CHINCHA","TAMBO DE MORA","110211"]
[null,null,null,null,null,null,null,"ICA ICA ICA",{"$f":"IF(AND(ING!$D$21=J1005,ING!$V$21=K1005),I1004+1,0)","v":0},"ICA","ICA","ICA","110101"]
[null,null,null,null,null,null,null,"ICA ICA LA TINGUIÑA",{"$f":"IF(AND(ING!$D$21=J1006,ING!$V$21=K1006),I1005+1,0)","v":0},"ICA","ICA","LA TINGUIÑA","110102"]
[null,null,null,null,null,null,null,"ICA ICA LOS AQUIJES",{"$f":"IF(AND(ING!$D$21=J1007,ING!$V$21=K1007),I1006+1,0)","v":0},"ICA","ICA","LOS AQUIJES","110103"]
[null,null,null,null,null,null,null,"ICA ICA OCUCAJE",{"$f":"IF(AND(ING!$D$21=J1008,ING!$V$21=K1008),I1007+1,0)","v":0},"ICA","ICA","OCUCAJE","110104"]
[null,null,null,null,null,null,null,"ICA ICA PACHACUTEC",{"$f":"IF(AND(ING!$D$21=J1009,ING!$V$21=K1009),I1008+1,0)","v":0},"ICA","ICA","PACHACUTEC","110105"]
[null,null,null,null,null,null,null,"ICA ICA PARCONA",{"$f":"IF(AND(ING!$D$21=J1010,ING!$V$21=K1010),I1009+1,0)","v":0},"ICA","ICA","PARCONA","110106"]
[null,null,null,null,null,null,null,"ICA ICA PUEBLO NUEVO",{"$f":"IF(AND(ING!$D$21=J1011,ING!$V$21=K1011),I1010+1,0)","v":0},"ICA","ICA","PUEBLO NUEVO","110107"]
[null,null,null,null,null,null,null,"ICA ICA SALAS",{"$f":"IF(AND(ING!$D$21=J1012,ING!$V$21=K1012),I1011+1,0)","v":0},"ICA","ICA","SALAS","110108"]
[null,null,null,null,null,null,null,"ICA ICA SAN JOSE DE LOS MOLINOS",{"$f":"IF(AND(ING!$D$21=J1013,ING!$V$21=K1013),I1012+1,0)","v":0},"ICA","ICA","SAN JOSE DE LOS MOLINOS","110109"]
[null,null,null,null,null,null,null,"ICA ICA SAN JUAN BAUTISTA",{"$f":"IF(AND(ING!$D$21=J1014,ING!$V$21=K1014),I1013+1,0)","v":0},"ICA","ICA","SAN JUAN BAUTISTA","110110"]
[null,null,null,null,null,null,null,"ICA ICA SANTIAGO",{"$f":"IF(AND(ING!$D$21=J1015,ING!$V$21=K1015),I1014+1,0)","v":0},"ICA","ICA","SANTIAGO","110111"]
[null,null,null,null,null,null,null,"ICA ICA SUBTANJALLA",{"$f":"IF(AND(ING!$D$21=J1016,ING!$V$21=K1016),I1015+1,0)","v":0},"ICA","ICA","SUBTANJALLA","110112"]
[null,null,null,null,null,null,null,"ICA ICA TATE",{"$f":"IF(AND(ING!$D$21=J1017,ING!$V$21=K1017),I1016+1,0)","v":0},"ICA","ICA","TATE","110113"]
[null,null,null,null,null,null,null,"ICA ICA YAUCA DEL ROSARIO",{"$f":"IF(AND(ING!$D$21=J1018,ING!$V$21=K1018),I1017+1,0)","v":0},"ICA","ICA","YAUCA DEL ROSARIO","110114"]
[null,null,null,null,null,null,null,"ICA NAZCA CHANGUILLO",{"$f":"IF(AND(ING!$D$21=J1019,ING!$V$21=K1019),I1018+1,0)","v":0},"ICA","NAZCA","CHANGUILLO","110302"]
[null,null,null,null,null,null,null,"ICA NAZCA EL INGENIO",{"$f":"IF(AND(ING!$D$21=J1020,ING!$V$21=K1020),I1019+1,0)","v":0},"ICA","NAZCA","EL INGENIO","110303"]
[null,null,null,null,null,null,null,"ICA NAZCA MARCONA",{"$f":"IF(AND(ING!$D$21=J1021,ING!$V$21=K1021),I1020+1,0)","v":0},"ICA","NAZCA","MARCONA","110304"]
[null,null,null,null,null,null,null,"ICA NAZCA NASCA",{"$f":"IF(AND(ING!$D$21=J1022,ING!$V$21=K1022),I1021+1,0)","v":0},"ICA","NAZCA","NASCA","110301"]
[null,null,null,null,null,null,null,"ICA NAZCA VISTA ALEGRE",{"$f":"IF(AND(ING!$D$21=J1023,ING!$V$21=K1023),I1022+1,0)","v":0},"ICA","NAZCA","VISTA ALEGRE","110305"]
[null,null,null,null,null,null,null,"ICA PALPA LLIPATA",{"$f":"IF(AND(ING!$D$21=J1024,ING!$V$21=K1024),I1023+1,0)","v":0},"ICA","PALPA","LLIPATA","110402"]
[null,null,null,null,null,null,null,"ICA PALPA PALPA",{"$f":"IF(AND(ING!$D$21=J1025,ING!$V$21=K1025),I1024+1,0)","v":0},"ICA","PALPA","PALPA","110401"]
[null,null,null,null,null,null,null,"ICA PALPA RIO GRANDE",{"$f":"IF(AND(ING!$D$21=J1026,ING!$V$21=K1026),I1025+1,0)","v":0},"ICA","PALPA","RIO GRANDE","110403"]
[null,null,null,null,null,null,null,{"$f":"J1027&\" \"&K1027&\" \"&L1027","v":"ICA PALPA SANTA CRUZ"},{"$f":"IF(AND(ING!$D$21=J1027,ING!$V$21=K1027),I1026+1,0)","v":0},"ICA","PALPA","SANTA CRUZ","110404"]
[null,null,null,null,null,null,null,"ICA PALPA TIBILLO",{"$f":"IF(AND(ING!$D$21=J1028,ING!$V$21=K1028),I1027+1,0)","v":0},"ICA","PALPA","TIBILLO","110405"]
[null,null,null,null,null,null,null,"ICA PISCO HUANCANO",{"$f":"IF(AND(ING!$D$21=J1029,ING!$V$21=K1029),I1028+1,0)","v":0},"ICA","PISCO","HUANCANO","110502"]
[null,null,null,null,null,null,null,"ICA PISCO HUMAY",{"$f":"IF(AND(ING!$D$21=J1030,ING!$V$21=K1030),I1029+1,0)","v":0},"ICA","PISCO","HUMAY","110503"]
[null,null,null,null,null,null,null,"ICA PISCO INDEPENDENCIA",{"$f":"IF(AND(ING!$D$21=J1031,ING!$V$21=K1031),I1030+1,0)","v":0},"ICA","PISCO","INDEPENDENCIA","110504"]
[null,null,null,null,null,null,null,"ICA PISCO PARACAS",{"$f":"IF(AND(ING!$D$21=J1032,ING!$V$21=K1032),I1031+1,0)","v":0},"ICA","PISCO","PARACAS","110505"]
[null,null,null,null,null,null,null,"ICA PISCO PISCO",{"$f":"IF(AND(ING!$D$21=J1033,ING!$V$21=K1033),I1032+1,0)","v":0},"ICA","PISCO","PISCO","110501"]
[null,null,null,null,null,null,null,"ICA PISCO SAN ANDRES",{"$f":"IF(AND(ING!$D$21=J1034,ING!$V$21=K1034),I1033+1,0)","v":0},"ICA","PISCO","SAN ANDRES","110506"]
[null,null,null,null,null,null,null,"ICA PISCO SAN CLEMENTE",{"$f":"IF(AND(ING!$D$21=J1035,ING!$V$21=K1035),I1034+1,0)","v":0},"ICA","PISCO","SAN CLEMENTE","110507"]
[null,null,null,null,null,null,null,"ICA PISCO TUPAC AMARU INCA",{"$f":"IF(AND(ING!$D$21=J1036,ING!$V$21=K1036),I1035+1,0)","v":0},"ICA","PISCO","TUPAC AMARU INCA","110508"]
[null,null,null,null,null,null,null,"JUNÍN CHANCHAMAYO CHANCHAMAYO",{"$f":"IF(AND(ING!$D$21=J1037,ING!$V$21=K1037),I1036+1,0)","v":0},"JUNÍN","CHANCHAMAYO","CHANCHAMAYO","120301"]
[null,null,null,null,null,null,null,"JUNÍN CHANCHAMAYO PERENE",{"$f":"IF(AND(ING!$D$21=J1038,ING!$V$21=K1038),I1037+1,0)","v":0},"JUNÍN","CHANCHAMAYO","PERENE","120302"]
[null,null,null,null,null,null,null,"JUNÍN CHANCHAMAYO PICHANAQUI",{"$f":"IF(AND(ING!$D$21=J1039,ING!$V$21=K1039),I1038+1,0)","v":0},"JUNÍN","CHANCHAMAYO","PICHANAQUI","120303"]
[null,null,null,null,null,null,null,"JUNÍN CHANCHAMAYO SAN LUIS DE SHUARO",{"$f":"IF(AND(ING!$D$21=J1040,ING!$V$21=K1040),I1039+1,0)","v":0},"JUNÍN","CHANCHAMAYO","SAN LUIS DE SHUARO","120304"]
[null,null,null,null,null,null,null,"JUNÍN CHANCHAMAYO SAN RAMON",{"$f":"IF(AND(ING!$D$21=J1041,ING!$V$21=K1041),I1040+1,0)","v":0},"JUNÍN","CHANCHAMAYO","SAN RAMON","120305"]
[null,null,null,null,null,null,null,"JUNÍN CHANCHAMAYO VITOC",{"$f":"IF(AND(ING!$D$21=J1042,ING!$V$21=K1042),I1041+1,0)","v":0},"JUNÍN","CHANCHAMAYO","VITOC","120306"]
[null,null,null,null,null,null,null,"JUNÍN CHUPACA AHUAC",{"$f":"IF(AND(ING!$D$21=J1043,ING!$V$21=K1043),I1042+1,0)","v":0},"JUNÍN","CHUPACA","AHUAC","120902"]
[null,null,null,null,null,null,null,"JUNÍN CHUPACA CHONGOS BAJO",{"$f":"IF(AND(ING!$D$21=J1044,ING!$V$21=K1044),I1043+1,0)","v":0},"JUNÍN","CHUPACA","CHONGOS BAJO","120903"]
[null,null,null,null,null,null,null,"JUNÍN CHUPACA CHUPACA",{"$f":"IF(AND(ING!$D$21=J1045,ING!$V$21=K1045),I1044+1,0)","v":0},"JUNÍN","CHUPACA","CHUPACA","120901"]
[null,null,null,null,null,null,null,"JUNÍN CHUPACA HUACHAC",{"$f":"IF(AND(ING!$D$21=J1046,ING!$V$21=K1046),I1045+1,0)","v":0},"JUNÍN","CHUPACA","HUACHAC","120904"]
[null,null,null,null,null,null,null,"JUNÍN CHUPACA HUAMANCACA CHICO",{"$f":"IF(AND(ING!$D$21=J1047,ING!$V$21=K1047),I1046+1,0)","v":0},"JUNÍN","CHUPACA","HUAMANCACA CHICO","120905"]
[null,null,null,null,null,null,null,"JUNÍN CHUPACA SAN JUAN DE ISCOS",{"$f":"IF(AND(ING!$D$21=J1048,ING!$V$21=K1048),I1047+1,0)","v":0},"JUNÍN","CHUPACA","SAN JUAN DE ISCOS","120906"]
[null,null,null,null,null,null,null,"JUNÍN CHUPACA SAN JUAN DE JARPA",{"$f":"IF(AND(ING!$D$21=J1049,ING!$V$21=K1049),I1048+1,0)","v":0},"JUNÍN","CHUPACA","SAN JUAN DE JARPA","120907"]
[null,null,null,null,null,null,null,"JUNÍN CHUPACA TRES DE DICIEMBRE",{"$f":"IF(AND(ING!$D$21=J1050,ING!$V$21=K1050),I1049+1,0)","v":0},"JUNÍN","CHUPACA","TRES DE DICIEMBRE","120908"]
[null,null,null,null,null,null,null,"JUNÍN CHUPACA YANACANCHA",{"$f":"IF(AND(ING!$D$21=J1051,ING!$V$21=K1051),I1050+1,0)","v":0},"JUNÍN","CHUPACA","YANACANCHA","120909"]
[null,null,null,null,null,null,null,"JUNÍN CONCEPCION ACO",{"$f":"IF(AND(ING!$D$21=J1052,ING!$V$21=K1052),I1051+1,0)","v":0},"JUNÍN","CONCEPCION","ACO","120202"]
[null,null,null,null,null,null,null,"JUNÍN CONCEPCION ANDAMARCA",{"$f":"IF(AND(ING!$D$21=J1053,ING!$V$21=K1053),I1052+1,0)","v":0},"JUNÍN","CONCEPCION","ANDAMARCA","120203"]
[null,null,null,null,null,null,null,"JUNÍN CONCEPCION CHAMBARA",{"$f":"IF(AND(ING!$D$21=J1054,ING!$V$21=K1054),I1053+1,0)","v":0},"JUNÍN","CONCEPCION","CHAMBARA","120204"]
[null,null,null,null,null,null,null,"JUNÍN CONCEPCION COCHAS",{"$f":"IF(AND(ING!$D$21=J1055,ING!$V$21=K1055),I1054+1,0)","v":0},"JUNÍN","CONCEPCION","COCHAS","120205"]
[null,null,null,null,null,null,null,"JUNÍN CONCEPCION COMAS",{"$f":"IF(AND(ING!$D$21=J1056,ING!$V$21=K1056),I1055+1,0)","v":0},"JUNÍN","CONCEPCION","COMAS","120206"]
[null,null,null,null,null,null,null,"JUNÍN CONCEPCION CONCEPCION",{"$f":"IF(AND(ING!$D$21=J1057,ING!$V$21=K1057),I1056+1,0)","v":0},"JUNÍN","CONCEPCION","CONCEPCION","120201"]
[null,null,null,null,null,null,null,"JUNÍN CONCEPCION HEROINAS TOLEDO",{"$f":"IF(AND(ING!$D$21=J1058,ING!$V$21=K1058),I1057+1,0)","v":0},"JUNÍN","CONCEPCION","HEROINAS TOLEDO","120207"]
[null,null,null,null,null,null,null,"JUNÍN CONCEPCION MANZANARES",{"$f":"IF(AND(ING!$D$21=J1059,ING!$V$21=K1059),I1058+1,0)","v":0},"JUNÍN","CONCEPCION","MANZANARES","120208"]
[null,null,null,null,null,null,null,"JUNÍN CONCEPCION MARISCAL CASTILLA",{"$f":"IF(AND(ING!$D$21=J1060,ING!$V$21=K1060),I1059+1,0)","v":0},"JUNÍN","CONCEPCION","MARISCAL CASTILLA","120209"]
[null,null,null,null,null,null,null,"JUNÍN CONCEPCION MATAHUASI",{"$f":"IF(AND(ING!$D$21=J1061,ING!$V$21=K1061),I1060+1,0)","v":0},"JUNÍN","CONCEPCION","MATAHUASI","120210"]
[null,null,null,null,null,null,null,"JUNÍN CONCEPCION MITO",{"$f":"IF(AND(ING!$D$21=J1062,ING!$V$21=K1062),I1061+1,0)","v":0},"JUNÍN","CONCEPCION","MITO","120211"]
[null,null,null,null,null,null,null,"JUNÍN CONCEPCION NUEVE DE JULIO",{"$f":"IF(AND(ING!$D$21=J1063,ING!$V$21=K1063),I1062+1,0)","v":0},"JUNÍN","CONCEPCION","NUEVE DE JULIO","120212"]
[null,null,null,null,null,null,null,"JUNÍN CONCEPCION ORCOTUNA",{"$f":"IF(AND(ING!$D$21=J1064,ING!$V$21=K1064),I1063+1,0)","v":0},"JUNÍN","CONCEPCION","ORCOTUNA","120213"]
[null,null,null,null,null,null,null,"JUNÍN CONCEPCION SAN JOSE DE QUERO",{"$f":"IF(AND(ING!$D$21=J1065,ING!$V$21=K1065),I1064+1,0)","v":0},"JUNÍN","CONCEPCION","SAN JOSE DE QUERO","120214"]
[null,null,null,null,null,null,null,"JUNÍN CONCEPCION SANTA ROSA DE OCOPA",{"$f":"IF(AND(ING!$D$21=J1066,ING!$V$21=K1066),I1065+1,0)","v":0},"JUNÍN","CONCEPCION","SANTA ROSA DE OCOPA","120215"]
[null,null,null,null,null,null,null,"JUNÍN HUANCAYO CARHUACALLANGA",{"$f":"IF(AND(ING!$D$21=J1067,ING!$V$21=K1067),I1066+1,0)","v":0},"JUNÍN","HUANCAYO","CARHUACALLANGA","120104"]
[null,null,null,null,null,null,null,"JUNÍN HUANCAYO CHACAPAMPA",{"$f":"IF(AND(ING!$D$21=J1068,ING!$V$21=K1068),I1067+1,0)","v":0},"JUNÍN","HUANCAYO","CHACAPAMPA","120105"]
[null,null,null,null,null,null,null,"JUNÍN HUANCAYO CHICCHE",{"$f":"IF(AND(ING!$D$21=J1069,ING!$V$21=K1069),I1068+1,0)","v":0},"JUNÍN","HUANCAYO","CHICCHE","120106"]
[null,null,null,null,null,null,null,"JUNÍN HUANCAYO CHILCA",{"$f":"IF(AND(ING!$D$21=J1070,ING!$V$21=K1070),I1069+1,0)","v":0},"JUNÍN","HUANCAYO","CHILCA","120107"]
[null,null,null,null,null,null,null,"JUNÍN HUANCAYO CHONGOS ALTO",{"$f":"IF(AND(ING!$D$21=J1071,ING!$V$21=K1071),I1070+1,0)","v":0},"JUNÍN","HUANCAYO","CHONGOS ALTO","120108"]
[null,null,null,null,null,null,null,"JUNÍN HUANCAYO CHUPURO",{"$f":"IF(AND(ING!$D$21=J1072,ING!$V$21=K1072),I1071+1,0)","v":0},"JUNÍN","HUANCAYO","CHUPURO","120111"]
[null,null,null,null,null,null,null,"JUNÍN HUANCAYO COLCA",{"$f":"IF(AND(ING!$D$21=J1073,ING!$V$21=K1073),I1072+1,0)","v":0},"JUNÍN","HUANCAYO","COLCA","120112"]
[null,null,null,null,null,null,null,"JUNÍN HUANCAYO CULLHUAS",{"$f":"IF(AND(ING!$D$21=J1074,ING!$V$21=K1074),I1073+1,0)","v":0},"JUNÍN","HUANCAYO","CULLHUAS","120113"]
[null,null,null,null,null,null,null,"JUNÍN HUANCAYO EL TAMBO",{"$f":"IF(AND(ING!$D$21=J1075,ING!$V$21=K1075),I1074+1,0)","v":0},"JUNÍN","HUANCAYO","EL TAMBO","120114"]
[null,null,null,null,null,null,null,"JUNÍN HUANCAYO HUACRAPUQUIO",{"$f":"IF(AND(ING!$D$21=J1076,ING!$V$21=K1076),I1075+1,0)","v":0},"JUNÍN","HUANCAYO","HUACRAPUQUIO","120116"]
[null,null,null,null,null,null,null,"JUNÍN HUANCAYO HUALHUAS",{"$f":"IF(AND(ING!$D$21=J1077,ING!$V$21=K1077),I1076+1,0)","v":0},"JUNÍN","HUANCAYO","HUALHUAS","120117"]
[null,null,null,null,null,null,null,"JUNÍN HUANCAYO HUANCAN",{"$f":"IF(AND(ING!$D$21=J1078,ING!$V$21=K1078),I1077+1,0)","v":0},"JUNÍN","HUANCAYO","HUANCAN","120119"]
[null,null,null,null,null,null,null,"JUNÍN HUANCAYO HUANCAYO",{"$f":"IF(AND(ING!$D$21=J1079,ING!$V$21=K1079),I1078+1,0)","v":0},"JUNÍN","HUANCAYO","HUANCAYO","120101"]
[null,null,null,null,null,null,null,"JUNÍN HUANCAYO HUASICANCHA",{"$f":"IF(AND(ING!$D$21=J1080,ING!$V$21=K1080),I1079+1,0)","v":0},"JUNÍN","HUANCAYO","HUASICANCHA","120120"]
[null,null,null,null,null,null,null,"JUNÍN HUANCAYO HUAYUCACHI",{"$f":"IF(AND(ING!$D$21=J1081,ING!$V$21=K1081),I1080+1,0)","v":0},"JUNÍN","HUANCAYO","HUAYUCACHI","120121"]
[null,null,null,null,null,null,null,"JUNÍN HUANCAYO INGENIO",{"$f":"IF(AND(ING!$D$21=J1082,ING!$V$21=K1082),I1081+1,0)","v":0},"JUNÍN","HUANCAYO","INGENIO","120122"]
[null,null,null,null,null,null,null,"JUNÍN HUANCAYO PARIAHUANCA",{"$f":"IF(AND(ING!$D$21=J1083,ING!$V$21=K1083),I1082+1,0)","v":0},"JUNÍN","HUANCAYO","PARIAHUANCA","120124"]
[null,null,null,null,null,null,null,"JUNÍN HUANCAYO PILCOMAYO",{"$f":"IF(AND(ING!$D$21=J1084,ING!$V$21=K1084),I1083+1,0)","v":0},"JUNÍN","HUANCAYO","PILCOMAYO","120125"]
[null,null,null,null,null,null,null,"JUNÍN HUANCAYO PUCARA",{"$f":"IF(AND(ING!$D$21=J1085,ING!$V$21=K1085),I1084+1,0)","v":0},"JUNÍN","HUANCAYO","PUCARA","120126"]
[null,null,null,null,null,null,null,"JUNÍN HUANCAYO QUICHUAY",{"$f":"IF(AND(ING!$D$21=J1086,ING!$V$21=K1086),I1085+1,0)","v":0},"JUNÍN","HUANCAYO","QUICHUAY","120127"]
[null,null,null,null,null,null,null,"JUNÍN HUANCAYO QUILCAS",{"$f":"IF(AND(ING!$D$21=J1087,ING!$V$21=K1087),I1086+1,0)","v":0},"JUNÍN","HUANCAYO","QUILCAS","120128"]
[null,null,null,null,null,null,null,"JUNÍN HUANCAYO SAN AGUSTIN",{"$f":"IF(AND(ING!$D$21=J1088,ING!$V$21=K1088),I1087+1,0)","v":0},"JUNÍN","HUANCAYO","SAN AGUSTIN","120129"]
[null,null,null,null,null,null,null,"JUNÍN HUANCAYO SAN JERONIMO DE TUNAN",{"$f":"IF(AND(ING!$D$21=J1089,ING!$V$21=K1089),I1088+1,0)","v":0},"JUNÍN","HUANCAYO","SAN JERONIMO DE TUNAN","120130"]
[null,null,null,null,null,null,null,"JUNÍN HUANCAYO SANTO DOMINGO DE ACOBAMBA",{"$f":"IF(AND(ING!$D$21=J1090,ING!$V$21=K1090),I1089+1,0)","v":0},"JUNÍN","HUANCAYO","SANTO DOMINGO DE ACOBAMBA","120135"]
[null,null,null,null,null,null,null,{"$f":"J1091&\" \"&K1091&\" \"&L1091","v":"JUNÍN HUANCAYO SAÑO"},{"$f":"IF(AND(ING!$D$21=J1091,ING!$V$21=K1091),I1090+1,0)","v":0},"JUNÍN","HUANCAYO","SAÑO","120132"]
[null,null,null,null,null,null,null,"JUNÍN HUANCAYO SAPALLANGA",{"$f":"IF(AND(ING!$D$21=J1092,ING!$V$21=K1092),I1091+1,0)","v":0},"JUNÍN","HUANCAYO","SAPALLANGA","120133"]
[null,null,null,null,null,null,null,"JUNÍN HUANCAYO SICAYA",{"$f":"IF(AND(ING!$D$21=J1093,ING!$V$21=K1093),I1092+1,0)","v":0},"JUNÍN","HUANCAYO","SICAYA","120134"]
[null,null,null,null,null,null,null,"JUNÍN HUANCAYO VIQUES",{"$f":"IF(AND(ING!$D$21=J1094,ING!$V$21=K1094),I1093+1,0)","v":0},"JUNÍN","HUANCAYO","VIQUES","120136"]
[null,null,null,null,null,null,null,"JUNÍN JAUJA ACOLLA",{"$f":"IF(AND(ING!$D$21=J1095,ING!$V$21=K1095),I1094+1,0)","v":0},"JUNÍN","JAUJA","ACOLLA","120402"]
[null,null,null,null,null,null,null,"JUNÍN JAUJA APATA",{"$f":"IF(AND(ING!$D$21=J1096,ING!$V$21=K1096),I1095+1,0)","v":0},"JUNÍN","JAUJA","APATA","120403"]
[null,null,null,null,null,null,null,"JUNÍN JAUJA ATAURA",{"$f":"IF(AND(ING!$D$21=J1097,ING!$V$21=K1097),I1096+1,0)","v":0},"JUNÍN","JAUJA","ATAURA","120404"]
[null,null,null,null,null,null,null,"JUNÍN JAUJA CANCHAYLLO",{"$f":"IF(AND(ING!$D$21=J1098,ING!$V$21=K1098),I1097+1,0)","v":0},"JUNÍN","JAUJA","CANCHAYLLO","120405"]
[null,null,null,null,null,null,null,"JUNÍN JAUJA CURICACA",{"$f":"IF(AND(ING!$D$21=J1099,ING!$V$21=K1099),I1098+1,0)","v":0},"JUNÍN","JAUJA","CURICACA","120406"]
[null,null,null,null,null,null,null,"JUNÍN JAUJA EL MANTARO",{"$f":"IF(AND(ING!$D$21=J1100,ING!$V$21=K1100),I1099+1,0)","v":0},"JUNÍN","JAUJA","EL MANTARO","120407"]
[null,null,null,null,null,null,null,"JUNÍN JAUJA HUAMALI",{"$f":"IF(AND(ING!$D$21=J1101,ING!$V$21=K1101),I1100+1,0)","v":0},"JUNÍN","JAUJA","HUAMALI","120408"]
[null,null,null,null,null,null,null,"JUNÍN JAUJA HUARIPAMPA",{"$f":"IF(AND(ING!$D$21=J1102,ING!$V$21=K1102),I1101+1,0)","v":0},"JUNÍN","JAUJA","HUARIPAMPA","120409"]
[null,null,null,null,null,null,null,"JUNÍN JAUJA HUERTAS",{"$f":"IF(AND(ING!$D$21=J1103,ING!$V$21=K1103),I1102+1,0)","v":0},"JUNÍN","JAUJA","HUERTAS","120410"]
[null,null,null,null,null,null,null,"JUNÍN JAUJA JANJAILLO",{"$f":"IF(AND(ING!$D$21=J1104,ING!$V$21=K1104),I1103+1,0)","v":0},"JUNÍN","JAUJA","JANJAILLO","120411"]
[null,null,null,null,null,null,null,"JUNÍN JAUJA JAUJA",{"$f":"IF(AND(ING!$D$21=J1105,ING!$V$21=K1105),I1104+1,0)","v":0},"JUNÍN","JAUJA","JAUJA","120401"]
[null,null,null,null,null,null,null,"JUNÍN JAUJA JULCAN",{"$f":"IF(AND(ING!$D$21=J1106,ING!$V$21=K1106),I1105+1,0)","v":0},"JUNÍN","JAUJA","JULCAN","120412"]
[null,null,null,null,null,null,null,"JUNÍN JAUJA LEONOR ORDOÑEZ",{"$f":"IF(AND(ING!$D$21=J1107,ING!$V$21=K1107),I1106+1,0)","v":0},"JUNÍN","JAUJA","LEONOR ORDOÑEZ","120413"]
[null,null,null,null,null,null,null,"JUNÍN JAUJA LLOCLLAPAMPA",{"$f":"IF(AND(ING!$D$21=J1108,ING!$V$21=K1108),I1107+1,0)","v":0},"JUNÍN","JAUJA","LLOCLLAPAMPA","120414"]
[null,null,null,null,null,null,null,"JUNÍN JAUJA MARCO",{"$f":"IF(AND(ING!$D$21=J1109,ING!$V$21=K1109),I1108+1,0)","v":0},"JUNÍN","JAUJA","MARCO","120415"]
[null,null,null,null,null,null,null,"JUNÍN JAUJA MASMA",{"$f":"IF(AND(ING!$D$21=J1110,ING!$V$21=K1110),I1109+1,0)","v":0},"JUNÍN","JAUJA","MASMA","120416"]
[null,null,null,null,null,null,null,"JUNÍN JAUJA MASMA CHICCHE",{"$f":"IF(AND(ING!$D$21=J1111,ING!$V$21=K1111),I1110+1,0)","v":0},"JUNÍN","JAUJA","MASMA CHICCHE","120417"]
[null,null,null,null,null,null,null,"JUNÍN JAUJA MOLINOS",{"$f":"IF(AND(ING!$D$21=J1112,ING!$V$21=K1112),I1111+1,0)","v":0},"JUNÍN","JAUJA","MOLINOS","120418"]
[null,null,null,null,null,null,null,"JUNÍN JAUJA MONOBAMBA",{"$f":"IF(AND(ING!$D$21=J1113,ING!$V$21=K1113),I1112+1,0)","v":0},"JUNÍN","JAUJA","MONOBAMBA","120419"]
[null,null,null,null,null,null,null,"JUNÍN JAUJA MUQUI",{"$f":"IF(AND(ING!$D$21=J1114,ING!$V$21=K1114),I1113+1,0)","v":0},"JUNÍN","JAUJA","MUQUI","120420"]
[null,null,null,null,null,null,null,"JUNÍN JAUJA MUQUIYAUYO",{"$f":"IF(AND(ING!$D$21=J1115,ING!$V$21=K1115),I1114+1,0)","v":0},"JUNÍN","JAUJA","MUQUIYAUYO","120421"]
[null,null,null,null,null,null,null,"JUNÍN JAUJA PACA",{"$f":"IF(AND(ING!$D$21=J1116,ING!$V$21=K1116),I1115+1,0)","v":0},"JUNÍN","JAUJA","PACA","120422"]
[null,null,null,null,null,null,null,"JUNÍN JAUJA PACCHA",{"$f":"IF(AND(ING!$D$21=J1117,ING!$V$21=K1117),I1116+1,0)","v":0},"JUNÍN","JAUJA","PACCHA","120423"]
[null,null,null,null,null,null,null,"JUNÍN JAUJA PANCAN",{"$f":"IF(AND(ING!$D$21=J1118,ING!$V$21=K1118),I1117+1,0)","v":0},"JUNÍN","JAUJA","PANCAN","120424"]
[null,null,null,null,null,null,null,"JUNÍN JAUJA PARCO",{"$f":"IF(AND(ING!$D$21=J1119,ING!$V$21=K1119),I1118+1,0)","v":0},"JUNÍN","JAUJA","PARCO","120425"]
[null,null,null,null,null,null,null,"JUNÍN JAUJA POMACANCHA",{"$f":"IF(AND(ING!$D$21=J1120,ING!$V$21=K1120),I1119+1,0)","v":0},"JUNÍN","JAUJA","POMACANCHA","120426"]
[null,null,null,null,null,null,null,"JUNÍN JAUJA RICRAN",{"$f":"IF(AND(ING!$D$21=J1121,ING!$V$21=K1121),I1120+1,0)","v":0},"JUNÍN","JAUJA","RICRAN","120427"]
[null,null,null,null,null,null,null,"JUNÍN JAUJA SAN LORENZO",{"$f":"IF(AND(ING!$D$21=J1122,ING!$V$21=K1122),I1121+1,0)","v":0},"JUNÍN","JAUJA","SAN LORENZO","120428"]
[null,null,null,null,null,null,null,"JUNÍN JAUJA SAN PEDRO DE CHUNAN",{"$f":"IF(AND(ING!$D$21=J1123,ING!$V$21=K1123),I1122+1,0)","v":0},"JUNÍN","JAUJA","SAN PEDRO DE CHUNAN","120429"]
[null,null,null,null,null,null,null,"JUNÍN JAUJA SAUSA",{"$f":"IF(AND(ING!$D$21=J1124,ING!$V$21=K1124),I1123+1,0)","v":0},"JUNÍN","JAUJA","SAUSA","120430"]
[null,null,null,null,null,null,null,"JUNÍN JAUJA SINCOS",{"$f":"IF(AND(ING!$D$21=J1125,ING!$V$21=K1125),I1124+1,0)","v":0},"JUNÍN","JAUJA","SINCOS","120431"]
[null,null,null,null,null,null,null,"JUNÍN JAUJA TUNAN MARCA",{"$f":"IF(AND(ING!$D$21=J1126,ING!$V$21=K1126),I1125+1,0)","v":0},"JUNÍN","JAUJA","TUNAN MARCA","120432"]
[null,null,null,null,null,null,null,"JUNÍN JAUJA YAULI",{"$f":"IF(AND(ING!$D$21=J1127,ING!$V$21=K1127),I1126+1,0)","v":0},"JUNÍN","JAUJA","YAULI","120433"]
[null,null,null,null,null,null,null,"JUNÍN JAUJA YAUYOS",{"$f":"IF(AND(ING!$D$21=J1128,ING!$V$21=K1128),I1127+1,0)","v":0},"JUNÍN","JAUJA","YAUYOS","120434"]
[null,null,null,null,null,null,null,"JUNÍN JUNIN CARHUAMAYO",{"$f":"IF(AND(ING!$D$21=J1129,ING!$V$21=K1129),I1128+1,0)","v":0},"JUNÍN","JUNIN","CARHUAMAYO","120502"]
[null,null,null,null,null,null,null,"JUNÍN JUNIN JUNIN",{"$f":"IF(AND(ING!$D$21=J1130,ING!$V$21=K1130),I1129+1,0)","v":0},"JUNÍN","JUNIN","JUNIN","120501"]
[null,null,null,null,null,null,null,"JUNÍN JUNIN ONDORES",{"$f":"IF(AND(ING!$D$21=J1131,ING!$V$21=K1131),I1130+1,0)","v":0},"JUNÍN","JUNIN","ONDORES","120503"]
[null,null,null,null,null,null,null,"JUNÍN JUNIN ULCUMAYO",{"$f":"IF(AND(ING!$D$21=J1132,ING!$V$21=K1132),I1131+1,0)","v":0},"JUNÍN","JUNIN","ULCUMAYO","120504"]
[null,null,null,null,null,null,null,"JUNÍN SATIPO COVIRIALI",{"$f":"IF(AND(ING!$D$21=J1133,ING!$V$21=K1133),I1132+1,0)","v":0},"JUNÍN","SATIPO","COVIRIALI","120602"]
[null,null,null,null,null,null,null,"JUNÍN SATIPO LLAYLLA",{"$f":"IF(AND(ING!$D$21=J1134,ING!$V$21=K1134),I1133+1,0)","v":0},"JUNÍN","SATIPO","LLAYLLA","120603"]
[null,null,null,null,null,null,null,"JUNÍN SATIPO MAZAMARI",{"$f":"IF(AND(ING!$D$21=J1135,ING!$V$21=K1135),I1134+1,0)","v":0},"JUNÍN","SATIPO","MAZAMARI","120604"]
[null,null,null,null,null,null,null,"JUNÍN SATIPO PAMPA HERMOSA",{"$f":"IF(AND(ING!$D$21=J1136,ING!$V$21=K1136),I1135+1,0)","v":0},"JUNÍN","SATIPO","PAMPA HERMOSA","120605"]
[null,null,null,null,null,null,null,"JUNÍN SATIPO PANGOA",{"$f":"IF(AND(ING!$D$21=J1137,ING!$V$21=K1137),I1136+1,0)","v":0},"JUNÍN","SATIPO","PANGOA","120606"]
[null,null,null,null,null,null,null,"JUNÍN SATIPO RIO NEGRO",{"$f":"IF(AND(ING!$D$21=J1138,ING!$V$21=K1138),I1137+1,0)","v":0},"JUNÍN","SATIPO","RIO NEGRO","120607"]
[null,null,null,null,null,null,null,"JUNÍN SATIPO RIO TAMBO",{"$f":"IF(AND(ING!$D$21=J1139,ING!$V$21=K1139),I1138+1,0)","v":0},"JUNÍN","SATIPO","RIO TAMBO","120608"]
[null,null,null,null,null,null,null,"JUNÍN SATIPO SATIPO",{"$f":"IF(AND(ING!$D$21=J1140,ING!$V$21=K1140),I1139+1,0)","v":0},"JUNÍN","SATIPO","SATIPO","120601"]
[null,null,null,null,null,null,null,"JUNÍN SATIPO VIZCATAN DEL ENE",{"$f":"IF(AND(ING!$D$21=J1141,ING!$V$21=K1141),I1140+1,0)","v":0},"JUNÍN","SATIPO","VIZCATAN DEL ENE","120609"]
[null,null,null,null,null,null,null,"JUNÍN TARMA ACOBAMBA",{"$f":"IF(AND(ING!$D$21=J1142,ING!$V$21=K1142),I1141+1,0)","v":0},"JUNÍN","TARMA","ACOBAMBA","120702"]
[null,null,null,null,null,null,null,"JUNÍN TARMA HUARICOLCA",{"$f":"IF(AND(ING!$D$21=J1143,ING!$V$21=K1143),I1142+1,0)","v":0},"JUNÍN","TARMA","HUARICOLCA","120703"]
[null,null,null,null,null,null,null,"JUNÍN TARMA HUASAHUASI",{"$f":"IF(AND(ING!$D$21=J1144,ING!$V$21=K1144),I1143+1,0)","v":0},"JUNÍN","TARMA","HUASAHUASI","120704"]
[null,null,null,null,null,null,null,"JUNÍN TARMA LA UNION",{"$f":"IF(AND(ING!$D$21=J1145,ING!$V$21=K1145),I1144+1,0)","v":0},"JUNÍN","TARMA","LA UNION","120705"]
[null,null,null,null,null,null,null,"JUNÍN TARMA PALCA",{"$f":"IF(AND(ING!$D$21=J1146,ING!$V$21=K1146),I1145+1,0)","v":0},"JUNÍN","TARMA","PALCA","120706"]
[null,null,null,null,null,null,null,"JUNÍN TARMA PALCAMAYO",{"$f":"IF(AND(ING!$D$21=J1147,ING!$V$21=K1147),I1146+1,0)","v":0},"JUNÍN","TARMA","PALCAMAYO","120707"]
[null,null,null,null,null,null,null,"JUNÍN TARMA SAN PEDRO DE CAJAS",{"$f":"IF(AND(ING!$D$21=J1148,ING!$V$21=K1148),I1147+1,0)","v":0},"JUNÍN","TARMA","SAN PEDRO DE CAJAS","120708"]
[null,null,null,null,null,null,null,"JUNÍN TARMA TAPO",{"$f":"IF(AND(ING!$D$21=J1149,ING!$V$21=K1149),I1148+1,0)","v":0},"JUNÍN","TARMA","TAPO","120709"]
[null,null,null,null,null,null,null,"JUNÍN TARMA TARMA",{"$f":"IF(AND(ING!$D$21=J1150,ING!$V$21=K1150),I1149+1,0)","v":0},"JUNÍN","TARMA","TARMA","120701"]
[null,null,null,null,null,null,null,"JUNÍN YAULI CHACAPALPA",{"$f":"IF(AND(ING!$D$21=J1151,ING!$V$21=K1151),I1150+1,0)","v":0},"JUNÍN","YAULI","CHACAPALPA","120802"]
[null,null,null,null,null,null,null,"JUNÍN YAULI HUAY-HUAY",{"$f":"IF(AND(ING!$D$21=J1152,ING!$V$21=K1152),I1151+1,0)","v":0},"JUNÍN","YAULI","HUAY-HUAY","120803"]
[null,null,null,null,null,null,null,"JUNÍN YAULI LA OROYA",{"$f":"IF(AND(ING!$D$21=J1153,ING!$V$21=K1153),I1152+1,0)","v":0},"JUNÍN","YAULI","LA OROYA","120801"]
[null,null,null,null,null,null,null,"JUNÍN YAULI MARCAPOMACOCHA",{"$f":"IF(AND(ING!$D$21=J1154,ING!$V$21=K1154),I1153+1,0)","v":0},"JUNÍN","YAULI","MARCAPOMACOCHA","120804"]
[null,null,null,null,null,null,null,{"$f":"J1155&\" \"&K1155&\" \"&L1155","v":"JUNÍN YAULI MOROCOCHA"},{"$f":"IF(AND(ING!$D$21=J1155,ING!$V$21=K1155),I1154+1,0)","v":0},"JUNÍN","YAULI","MOROCOCHA","120805"]
[null,null,null,null,null,null,null,"JUNÍN YAULI PACCHA",{"$f":"IF(AND(ING!$D$21=J1156,ING!$V$21=K1156),I1155+1,0)","v":0},"JUNÍN","YAULI","PACCHA","120806"]
[null,null,null,null,null,null,null,"JUNÍN YAULI SANTA BARBARA DE CARHUACAYAN",{"$f":"IF(AND(ING!$D$21=J1157,ING!$V$21=K1157),I1156+1,0)","v":0},"JUNÍN","YAULI","SANTA BARBARA DE CARHUACAYAN","120807"]
[null,null,null,null,null,null,null,"JUNÍN YAULI SANTA ROSA DE SACCO",{"$f":"IF(AND(ING!$D$21=J1158,ING!$V$21=K1158),I1157+1,0)","v":0},"JUNÍN","YAULI","SANTA ROSA DE SACCO","120808"]
[null,null,null,null,null,null,null,"JUNÍN YAULI SUITUCANCHA",{"$f":"IF(AND(ING!$D$21=J1159,ING!$V$21=K1159),I1158+1,0)","v":0},"JUNÍN","YAULI","SUITUCANCHA","120809"]
[null,null,null,null,null,null,null,"JUNÍN YAULI YAULI",{"$f":"IF(AND(ING!$D$21=J1160,ING!$V$21=K1160),I1159+1,0)","v":0},"JUNÍN","YAULI","YAULI","120810"]
[null,null,null,null,null,null,null,"LA LIBERTAD ASCOPE ASCOPE",{"$f":"IF(AND(ING!$D$21=J1161,ING!$V$21=K1161),I1160+1,0)","v":0},"LA LIBERTAD","ASCOPE","ASCOPE","130201"]
[null,null,null,null,null,null,null,"LA LIBERTAD ASCOPE CASA GRANDE",{"$f":"IF(AND(ING!$D$21=J1162,ING!$V$21=K1162),I1161+1,0)","v":0},"LA LIBERTAD","ASCOPE","CASA GRANDE","130208"]
[null,null,null,null,null,null,null,"LA LIBERTAD ASCOPE CHICAMA",{"$f":"IF(AND(ING!$D$21=J1163,ING!$V$21=K1163),I1162+1,0)","v":0},"LA LIBERTAD","ASCOPE","CHICAMA","130202"]
[null,null,null,null,null,null,null,"LA LIBERTAD ASCOPE CHOCOPE",{"$f":"IF(AND(ING!$D$21=J1164,ING!$V$21=K1164),I1163+1,0)","v":0},"LA LIBERTAD","ASCOPE","CHOCOPE","130203"]
[null,null,null,null,null,null,null,"LA LIBERTAD ASCOPE MAGDALENA DE CAO",{"$f":"IF(AND(ING!$D$21=J1165,ING!$V$21=K1165),I1164+1,0)","v":0},"LA LIBERTAD","ASCOPE","MAGDALENA DE CAO","130204"]
[null,null,null,null,null,null,null,"LA LIBERTAD ASCOPE PAIJAN",{"$f":"IF(AND(ING!$D$21=J1166,ING!$V$21=K1166),I1165+1,0)","v":0},"LA LIBERTAD","ASCOPE","PAIJAN","130205"]
[null,null,null,null,null,null,null,"LA LIBERTAD ASCOPE RAZURI",{"$f":"IF(AND(ING!$D$21=J1167,ING!$V$21=K1167),I1166+1,0)","v":0},"LA LIBERTAD","ASCOPE","RAZURI","130206"]
[null,null,null,null,null,null,null,"LA LIBERTAD ASCOPE SANTIAGO DE CAO",{"$f":"IF(AND(ING!$D$21=J1168,ING!$V$21=K1168),I1167+1,0)","v":0},"LA LIBERTAD","ASCOPE","SANTIAGO DE CAO","130207"]
[null,null,null,null,null,null,null,"LA LIBERTAD BOLIVAR BAMBAMARCA",{"$f":"IF(AND(ING!$D$21=J1169,ING!$V$21=K1169),I1168+1,0)","v":0},"LA LIBERTAD","BOLIVAR","BAMBAMARCA","130302"]
[null,null,null,null,null,null,null,"LA LIBERTAD BOLIVAR BOLIVAR",{"$f":"IF(AND(ING!$D$21=J1170,ING!$V$21=K1170),I1169+1,0)","v":0},"LA LIBERTAD","BOLIVAR","BOLIVAR","130301"]
[null,null,null,null,null,null,null,"LA LIBERTAD BOLIVAR CONDORMARCA",{"$f":"IF(AND(ING!$D$21=J1171,ING!$V$21=K1171),I1170+1,0)","v":0},"LA LIBERTAD","BOLIVAR","CONDORMARCA","130303"]
[null,null,null,null,null,null,null,"LA LIBERTAD BOLIVAR LONGOTEA",{"$f":"IF(AND(ING!$D$21=J1172,ING!$V$21=K1172),I1171+1,0)","v":0},"LA LIBERTAD","BOLIVAR","LONGOTEA","130304"]
[null,null,null,null,null,null,null,"LA LIBERTAD BOLIVAR UCHUMARCA",{"$f":"IF(AND(ING!$D$21=J1173,ING!$V$21=K1173),I1172+1,0)","v":0},"LA LIBERTAD","BOLIVAR","UCHUMARCA","130305"]
[null,null,null,null,null,null,null,"LA LIBERTAD BOLIVAR UCUNCHA",{"$f":"IF(AND(ING!$D$21=J1174,ING!$V$21=K1174),I1173+1,0)","v":0},"LA LIBERTAD","BOLIVAR","UCUNCHA","130306"]
[null,null,null,null,null,null,null,"LA LIBERTAD CHEPEN CHEPEN",{"$f":"IF(AND(ING!$D$21=J1175,ING!$V$21=K1175),I1174+1,0)","v":0},"LA LIBERTAD","CHEPEN","CHEPEN","130401"]
[null,null,null,null,null,null,null,"LA LIBERTAD CHEPEN PACANGA",{"$f":"IF(AND(ING!$D$21=J1176,ING!$V$21=K1176),I1175+1,0)","v":0},"LA LIBERTAD","CHEPEN","PACANGA","130402"]
[null,null,null,null,null,null,null,"LA LIBERTAD CHEPEN PUEBLO NUEVO",{"$f":"IF(AND(ING!$D$21=J1177,ING!$V$21=K1177),I1176+1,0)","v":0},"LA LIBERTAD","CHEPEN","PUEBLO NUEVO","130403"]
[null,null,null,null,null,null,null,"LA LIBERTAD GRAN CHIMU CASCAS",{"$f":"IF(AND(ING!$D$21=J1178,ING!$V$21=K1178),I1177+1,0)","v":0},"LA LIBERTAD","GRAN CHIMU","CASCAS","131101"]
[null,null,null,null,null,null,null,"LA LIBERTAD GRAN CHIMU LUCMA",{"$f":"IF(AND(ING!$D$21=J1179,ING!$V$21=K1179),I1178+1,0)","v":0},"LA LIBERTAD","GRAN CHIMU","LUCMA","131102"]
[null,null,null,null,null,null,null,"LA LIBERTAD GRAN CHIMU MARMOT",{"$f":"IF(AND(ING!$D$21=J1180,ING!$V$21=K1180),I1179+1,0)","v":0},"LA LIBERTAD","GRAN CHIMU","MARMOT","131103"]
[null,null,null,null,null,null,null,"LA LIBERTAD GRAN CHIMU SAYAPULLO",{"$f":"IF(AND(ING!$D$21=J1181,ING!$V$21=K1181),I1180+1,0)","v":0},"LA LIBERTAD","GRAN CHIMU","SAYAPULLO","131104"]
[null,null,null,null,null,null,null,"LA LIBERTAD JULCAN CALAMARCA",{"$f":"IF(AND(ING!$D$21=J1182,ING!$V$21=K1182),I1181+1,0)","v":0},"LA LIBERTAD","JULCAN","CALAMARCA","130502"]
[null,null,null,null,null,null,null,"LA LIBERTAD JULCAN CARABAMBA",{"$f":"IF(AND(ING!$D$21=J1183,ING!$V$21=K1183),I1182+1,0)","v":0},"LA LIBERTAD","JULCAN","CARABAMBA","130503"]
[null,null,null,null,null,null,null,"LA LIBERTAD JULCAN HUASO",{"$f":"IF(AND(ING!$D$21=J1184,ING!$V$21=K1184),I1183+1,0)","v":0},"LA LIBERTAD","JULCAN","HUASO","130504"]
[null,null,null,null,null,null,null,"LA LIBERTAD JULCAN JULCAN",{"$f":"IF(AND(ING!$D$21=J1185,ING!$V$21=K1185),I1184+1,0)","v":0},"LA LIBERTAD","JULCAN","JULCAN","130501"]
[null,null,null,null,null,null,null,"LA LIBERTAD OTUZCO AGALLPAMPA",{"$f":"IF(AND(ING!$D$21=J1186,ING!$V$21=K1186),I1185+1,0)","v":0},"LA LIBERTAD","OTUZCO","AGALLPAMPA","130602"]
[null,null,null,null,null,null,null,"LA LIBERTAD OTUZCO CHARAT",{"$f":"IF(AND(ING!$D$21=J1187,ING!$V$21=K1187),I1186+1,0)","v":0},"LA LIBERTAD","OTUZCO","CHARAT","130604"]
[null,null,null,null,null,null,null,"LA LIBERTAD OTUZCO HUARANCHAL",{"$f":"IF(AND(ING!$D$21=J1188,ING!$V$21=K1188),I1187+1,0)","v":0},"LA LIBERTAD","OTUZCO","HUARANCHAL","130605"]
[null,null,null,null,null,null,null,"LA LIBERTAD OTUZCO LA CUESTA",{"$f":"IF(AND(ING!$D$21=J1189,ING!$V$21=K1189),I1188+1,0)","v":0},"LA LIBERTAD","OTUZCO","LA CUESTA","130606"]
[null,null,null,null,null,null,null,"LA LIBERTAD OTUZCO MACHE",{"$f":"IF(AND(ING!$D$21=J1190,ING!$V$21=K1190),I1189+1,0)","v":0},"LA LIBERTAD","OTUZCO","MACHE","130608"]
[null,null,null,null,null,null,null,"LA LIBERTAD OTUZCO OTUZCO",{"$f":"IF(AND(ING!$D$21=J1191,ING!$V$21=K1191),I1190+1,0)","v":0},"LA LIBERTAD","OTUZCO","OTUZCO","130601"]
[null,null,null,null,null,null,null,"LA LIBERTAD OTUZCO PARANDAY",{"$f":"IF(AND(ING!$D$21=J1192,ING!$V$21=K1192),I1191+1,0)","v":0},"LA LIBERTAD","OTUZCO","PARANDAY","130610"]
[null,null,null,null,null,null,null,"LA LIBERTAD OTUZCO SALPO",{"$f":"IF(AND(ING!$D$21=J1193,ING!$V$21=K1193),I1192+1,0)","v":0},"LA LIBERTAD","OTUZCO","SALPO","130611"]
[null,null,null,null,null,null,null,"LA LIBERTAD OTUZCO SINSICAP",{"$f":"IF(AND(ING!$D$21=J1194,ING!$V$21=K1194),I1193+1,0)","v":0},"LA LIBERTAD","OTUZCO","SINSICAP","130613"]
[null,null,null,null,null,null,null,"LA LIBERTAD OTUZCO USQUIL",{"$f":"IF(AND(ING!$D$21=J1195,ING!$V$21=K1195),I1194+1,0)","v":0},"LA LIBERTAD","OTUZCO","USQUIL","130614"]
[null,null,null,null,null,null,null,"LA LIBERTAD PACASMAYO GUADALUPE",{"$f":"IF(AND(ING!$D$21=J1196,ING!$V$21=K1196),I1195+1,0)","v":0},"LA LIBERTAD","PACASMAYO","GUADALUPE","130702"]
[null,null,null,null,null,null,null,"LA LIBERTAD PACASMAYO JEQUETEPEQUE",{"$f":"IF(AND(ING!$D$21=J1197,ING!$V$21=K1197),I1196+1,0)","v":0},"LA LIBERTAD","PACASMAYO","JEQUETEPEQUE","130703"]
[null,null,null,null,null,null,null,"LA LIBERTAD PACASMAYO PACASMAYO",{"$f":"IF(AND(ING!$D$21=J1198,ING!$V$21=K1198),I1197+1,0)","v":0},"LA LIBERTAD","PACASMAYO","PACASMAYO","130704"]
[null,null,null,null,null,null,null,"LA LIBERTAD PACASMAYO SAN JOSE",{"$f":"IF(AND(ING!$D$21=J1199,ING!$V$21=K1199),I1198+1,0)","v":0},"LA LIBERTAD","PACASMAYO","SAN JOSE","130705"]
[null,null,null,null,null,null,null,"LA LIBERTAD PACASMAYO SAN PEDRO DE LLOC",{"$f":"IF(AND(ING!$D$21=J1200,ING!$V$21=K1200),I1199+1,0)","v":0},"LA LIBERTAD","PACASMAYO","SAN PEDRO DE LLOC","130701"]
[null,null,null,null,null,null,null,"LA LIBERTAD PATAZ BULDIBUYO",{"$f":"IF(AND(ING!$D$21=J1201,ING!$V$21=K1201),I1200+1,0)","v":0},"LA LIBERTAD","PATAZ","BULDIBUYO","130802"]
[null,null,null,null,null,null,null,"LA LIBERTAD PATAZ CHILLIA",{"$f":"IF(AND(ING!$D$21=J1202,ING!$V$21=K1202),I1201+1,0)","v":0},"LA LIBERTAD","PATAZ","CHILLIA","130803"]
[null,null,null,null,null,null,null,"LA LIBERTAD PATAZ HUANCASPATA",{"$f":"IF(AND(ING!$D$21=J1203,ING!$V$21=K1203),I1202+1,0)","v":0},"LA LIBERTAD","PATAZ","HUANCASPATA","130804"]
[null,null,null,null,null,null,null,"LA LIBERTAD PATAZ HUAYLILLAS",{"$f":"IF(AND(ING!$D$21=J1204,ING!$V$21=K1204),I1203+1,0)","v":0},"LA LIBERTAD","PATAZ","HUAYLILLAS","130805"]
[null,null,null,null,null,null,null,"LA LIBERTAD PATAZ HUAYO",{"$f":"IF(AND(ING!$D$21=J1205,ING!$V$21=K1205),I1204+1,0)","v":0},"LA LIBERTAD","PATAZ","HUAYO","130806"]
[null,null,null,null,null,null,null,"LA LIBERTAD PATAZ ONGON",{"$f":"IF(AND(ING!$D$21=J1206,ING!$V$21=K1206),I1205+1,0)","v":0},"LA LIBERTAD","PATAZ","ONGON","130807"]
[null,null,null,null,null,null,null,"LA LIBERTAD PATAZ PARCOY",{"$f":"IF(AND(ING!$D$21=J1207,ING!$V$21=K1207),I1206+1,0)","v":0},"LA LIBERTAD","PATAZ","PARCOY","130808"]
[null,null,null,null,null,null,null,"LA LIBERTAD PATAZ PATAZ",{"$f":"IF(AND(ING!$D$21=J1208,ING!$V$21=K1208),I1207+1,0)","v":0},"LA LIBERTAD","PATAZ","PATAZ","130809"]
[null,null,null,null,null,null,null,"LA LIBERTAD PATAZ PIAS",{"$f":"IF(AND(ING!$D$21=J1209,ING!$V$21=K1209),I1208+1,0)","v":0},"LA LIBERTAD","PATAZ","PIAS","130810"]
[null,null,null,null,null,null,null,"LA LIBERTAD PATAZ SANTIAGO DE CHALLAS",{"$f":"IF(AND(ING!$D$21=J1210,ING!$V$21=K1210),I1209+1,0)","v":0},"LA LIBERTAD","PATAZ","SANTIAGO DE CHALLAS","130811"]
[null,null,null,null,null,null,null,"LA LIBERTAD PATAZ TAURIJA",{"$f":"IF(AND(ING!$D$21=J1211,ING!$V$21=K1211),I1210+1,0)","v":0},"LA LIBERTAD","PATAZ","TAURIJA","130812"]
[null,null,null,null,null,null,null,"LA LIBERTAD PATAZ TAYABAMBA",{"$f":"IF(AND(ING!$D$21=J1212,ING!$V$21=K1212),I1211+1,0)","v":0},"LA LIBERTAD","PATAZ","TAYABAMBA","130801"]
[null,null,null,null,null,null,null,"LA LIBERTAD PATAZ URPAY",{"$f":"IF(AND(ING!$D$21=J1213,ING!$V$21=K1213),I1212+1,0)","v":0},"LA LIBERTAD","PATAZ","URPAY","130813"]
[null,null,null,null,null,null,null,"LA LIBERTAD SANCHEZ CARRION CHUGAY",{"$f":"IF(AND(ING!$D$21=J1214,ING!$V$21=K1214),I1213+1,0)","v":0},"LA LIBERTAD","SANCHEZ CARRION","CHUGAY","130902"]
[null,null,null,null,null,null,null,"LA LIBERTAD SANCHEZ CARRION COCHORCO",{"$f":"IF(AND(ING!$D$21=J1215,ING!$V$21=K1215),I1214+1,0)","v":0},"LA LIBERTAD","SANCHEZ CARRION","COCHORCO","130903"]
[null,null,null,null,null,null,null,"LA LIBERTAD SANCHEZ CARRION CURGOS",{"$f":"IF(AND(ING!$D$21=J1216,ING!$V$21=K1216),I1215+1,0)","v":0},"LA LIBERTAD","SANCHEZ CARRION","CURGOS","130904"]
[null,null,null,null,null,null,null,"LA LIBERTAD SANCHEZ CARRION HUAMACHUCO",{"$f":"IF(AND(ING!$D$21=J1217,ING!$V$21=K1217),I1216+1,0)","v":0},"LA LIBERTAD","SANCHEZ CARRION","HUAMACHUCO","130901"]
[null,null,null,null,null,null,null,"LA LIBERTAD SANCHEZ CARRION MARCABAL",{"$f":"IF(AND(ING!$D$21=J1218,ING!$V$21=K1218),I1217+1,0)","v":0},"LA LIBERTAD","SANCHEZ CARRION","MARCABAL","130905"]
[null,null,null,null,null,null,null,{"$f":"J1219&\" \"&K1219&\" \"&L1219","v":"LA LIBERTAD SANCHEZ CARRION SANAGORAN"},{"$f":"IF(AND(ING!$D$21=J1219,ING!$V$21=K1219),I1218+1,0)","v":0},"LA LIBERTAD","SANCHEZ CARRION","SANAGORAN","130906"]
[null,null,null,null,null,null,null,"LA LIBERTAD SANCHEZ CARRION SARIN",{"$f":"IF(AND(ING!$D$21=J1220,ING!$V$21=K1220),I1219+1,0)","v":0},"LA LIBERTAD","SANCHEZ CARRION","SARIN","130907"]
[null,null,null,null,null,null,null,"LA LIBERTAD SANCHEZ CARRION SARTIMBAMBA",{"$f":"IF(AND(ING!$D$21=J1221,ING!$V$21=K1221),I1220+1,0)","v":0},"LA LIBERTAD","SANCHEZ CARRION","SARTIMBAMBA","130908"]
[null,null,null,null,null,null,null,"LA LIBERTAD SANTIAGO DE CHUCO ANGASMARCA",{"$f":"IF(AND(ING!$D$21=J1222,ING!$V$21=K1222),I1221+1,0)","v":0},"LA LIBERTAD","SANTIAGO DE CHUCO","ANGASMARCA","131002"]
[null,null,null,null,null,null,null,"LA LIBERTAD SANTIAGO DE CHUCO CACHICADAN",{"$f":"IF(AND(ING!$D$21=J1223,ING!$V$21=K1223),I1222+1,0)","v":0},"LA LIBERTAD","SANTIAGO DE CHUCO","CACHICADAN","131003"]
[null,null,null,null,null,null,null,"LA LIBERTAD SANTIAGO DE CHUCO MOLLEBAMBA",{"$f":"IF(AND(ING!$D$21=J1224,ING!$V$21=K1224),I1223+1,0)","v":0},"LA LIBERTAD","SANTIAGO DE CHUCO","MOLLEBAMBA","131004"]
[null,null,null,null,null,null,null,"LA LIBERTAD SANTIAGO DE CHUCO MOLLEPATA",{"$f":"IF(AND(ING!$D$21=J1225,ING!$V$21=K1225),I1224+1,0)","v":0},"LA LIBERTAD","SANTIAGO DE CHUCO","MOLLEPATA","131005"]
[null,null,null,null,null,null,null,"LA LIBERTAD SANTIAGO DE CHUCO QUIRUVILCA",{"$f":"IF(AND(ING!$D$21=J1226,ING!$V$21=K1226),I1225+1,0)","v":0},"LA LIBERTAD","SANTIAGO DE CHUCO","QUIRUVILCA","131006"]
[null,null,null,null,null,null,null,"LA LIBERTAD SANTIAGO DE CHUCO SANTA CRUZ DE CHUCA",{"$f":"IF(AND(ING!$D$21=J1227,ING!$V$21=K1227),I1226+1,0)","v":0},"LA LIBERTAD","SANTIAGO DE CHUCO","SANTA CRUZ DE CHUCA","131007"]
[null,null,null,null,null,null,null,"LA LIBERTAD SANTIAGO DE CHUCO SANTIAGO DE CHUCO",{"$f":"IF(AND(ING!$D$21=J1228,ING!$V$21=K1228),I1227+1,0)","v":0},"LA LIBERTAD","SANTIAGO DE CHUCO","SANTIAGO DE CHUCO","131001"]
[null,null,null,null,null,null,null,"LA LIBERTAD SANTIAGO DE CHUCO SITABAMBA",{"$f":"IF(AND(ING!$D$21=J1229,ING!$V$21=K1229),I1228+1,0)","v":0},"LA LIBERTAD","SANTIAGO DE CHUCO","SITABAMBA","131008"]
[null,null,null,null,null,null,null,"LA LIBERTAD TRUJILLO EL PORVENIR",{"$f":"IF(AND(ING!$D$21=J1230,ING!$V$21=K1230),I1229+1,0)","v":0},"LA LIBERTAD","TRUJILLO","EL PORVENIR","130102"]
[null,null,null,null,null,null,null,"LA LIBERTAD TRUJILLO FLORENCIA DE MORA",{"$f":"IF(AND(ING!$D$21=J1231,ING!$V$21=K1231),I1230+1,0)","v":0},"LA LIBERTAD","TRUJILLO","FLORENCIA DE MORA","130103"]
[null,null,null,null,null,null,null,"LA LIBERTAD TRUJILLO HUANCHACO",{"$f":"IF(AND(ING!$D$21=J1232,ING!$V$21=K1232),I1231+1,0)","v":0},"LA LIBERTAD","TRUJILLO","HUANCHACO","130104"]
[null,null,null,null,null,null,null,"LA LIBERTAD TRUJILLO LA ESPERANZA",{"$f":"IF(AND(ING!$D$21=J1233,ING!$V$21=K1233),I1232+1,0)","v":0},"LA LIBERTAD","TRUJILLO","LA ESPERANZA","130105"]
[null,null,null,null,null,null,null,"LA LIBERTAD TRUJILLO LAREDO",{"$f":"IF(AND(ING!$D$21=J1234,ING!$V$21=K1234),I1233+1,0)","v":0},"LA LIBERTAD","TRUJILLO","LAREDO","130106"]
[null,null,null,null,null,null,null,"LA LIBERTAD TRUJILLO MOCHE",{"$f":"IF(AND(ING!$D$21=J1235,ING!$V$21=K1235),I1234+1,0)","v":0},"LA LIBERTAD","TRUJILLO","MOCHE","130107"]
[null,null,null,null,null,null,null,"LA LIBERTAD TRUJILLO POROTO",{"$f":"IF(AND(ING!$D$21=J1236,ING!$V$21=K1236),I1235+1,0)","v":0},"LA LIBERTAD","TRUJILLO","POROTO","130108"]
[null,null,null,null,null,null,null,"LA LIBERTAD TRUJILLO SALAVERRY",{"$f":"IF(AND(ING!$D$21=J1237,ING!$V$21=K1237),I1236+1,0)","v":0},"LA LIBERTAD","TRUJILLO","SALAVERRY","130109"]
[null,null,null,null,null,null,null,"LA LIBERTAD TRUJILLO SIMBAL",{"$f":"IF(AND(ING!$D$21=J1238,ING!$V$21=K1238),I1237+1,0)","v":0},"LA LIBERTAD","TRUJILLO","SIMBAL","130110"]
[null,null,null,null,null,null,null,"LA LIBERTAD TRUJILLO TRUJILLO",{"$f":"IF(AND(ING!$D$21=J1239,ING!$V$21=K1239),I1238+1,0)","v":0},"LA LIBERTAD","TRUJILLO","TRUJILLO","130101"]
[null,null,null,null,null,null,null,"LA LIBERTAD TRUJILLO VICTOR LARCO HERRERA",{"$f":"IF(AND(ING!$D$21=J1240,ING!$V$21=K1240),I1239+1,0)","v":0},"LA LIBERTAD","TRUJILLO","VICTOR LARCO HERRERA","130111"]
[null,null,null,null,null,null,null,"LA LIBERTAD VIRU CHAO",{"$f":"IF(AND(ING!$D$21=J1241,ING!$V$21=K1241),I1240+1,0)","v":0},"LA LIBERTAD","VIRU","CHAO","131202"]
[null,null,null,null,null,null,null,"LA LIBERTAD VIRU GUADALUPITO",{"$f":"IF(AND(ING!$D$21=J1242,ING!$V$21=K1242),I1241+1,0)","v":0},"LA LIBERTAD","VIRU","GUADALUPITO","131203"]
[null,null,null,null,null,null,null,"LA LIBERTAD VIRU VIRU",{"$f":"IF(AND(ING!$D$21=J1243,ING!$V$21=K1243),I1242+1,0)","v":0},"LA LIBERTAD","VIRU","VIRU","131201"]
[null,null,null,null,null,null,null,"LAMBAYEQUE CHICLAYO CAYALTI",{"$f":"IF(AND(ING!$D$21=J1244,ING!$V$21=K1244),I1243+1,0)","v":0},"LAMBAYEQUE","CHICLAYO","CAYALTI","140116"]
[null,null,null,null,null,null,null,"LAMBAYEQUE CHICLAYO CHICLAYO",{"$f":"IF(AND(ING!$D$21=J1245,ING!$V$21=K1245),I1244+1,0)","v":0},"LAMBAYEQUE","CHICLAYO","CHICLAYO","140101"]
[null,null,null,null,null,null,null,"LAMBAYEQUE CHICLAYO CHONGOYAPE",{"$f":"IF(AND(ING!$D$21=J1246,ING!$V$21=K1246),I1245+1,0)","v":0},"LAMBAYEQUE","CHICLAYO","CHONGOYAPE","140102"]
[null,null,null,null,null,null,null,"LAMBAYEQUE CHICLAYO ETEN",{"$f":"IF(AND(ING!$D$21=J1247,ING!$V$21=K1247),I1246+1,0)","v":0},"LAMBAYEQUE","CHICLAYO","ETEN","140103"]
[null,null,null,null,null,null,null,"LAMBAYEQUE CHICLAYO ETEN PUERTO",{"$f":"IF(AND(ING!$D$21=J1248,ING!$V$21=K1248),I1247+1,0)","v":0},"LAMBAYEQUE","CHICLAYO","ETEN PUERTO","140104"]
[null,null,null,null,null,null,null,"LAMBAYEQUE CHICLAYO JOSE LEONARDO ORTIZ",{"$f":"IF(AND(ING!$D$21=J1249,ING!$V$21=K1249),I1248+1,0)","v":0},"LAMBAYEQUE","CHICLAYO","JOSE LEONARDO ORTIZ","140105"]
[null,null,null,null,null,null,null,"LAMBAYEQUE CHICLAYO LA VICTORIA",{"$f":"IF(AND(ING!$D$21=J1250,ING!$V$21=K1250),I1249+1,0)","v":0},"LAMBAYEQUE","CHICLAYO","LA VICTORIA","140106"]
[null,null,null,null,null,null,null,"LAMBAYEQUE CHICLAYO LAGUNAS",{"$f":"IF(AND(ING!$D$21=J1251,ING!$V$21=K1251),I1250+1,0)","v":0},"LAMBAYEQUE","CHICLAYO","LAGUNAS","140107"]
[null,null,null,null,null,null,null,"LAMBAYEQUE CHICLAYO MONSEFU",{"$f":"IF(AND(ING!$D$21=J1252,ING!$V$21=K1252),I1251+1,0)","v":0},"LAMBAYEQUE","CHICLAYO","MONSEFU","140108"]
[null,null,null,null,null,null,null,"LAMBAYEQUE CHICLAYO NUEVA ARICA",{"$f":"IF(AND(ING!$D$21=J1253,ING!$V$21=K1253),I1252+1,0)","v":0},"LAMBAYEQUE","CHICLAYO","NUEVA ARICA","140109"]
[null,null,null,null,null,null,null,"LAMBAYEQUE CHICLAYO OYOTUN",{"$f":"IF(AND(ING!$D$21=J1254,ING!$V$21=K1254),I1253+1,0)","v":0},"LAMBAYEQUE","CHICLAYO","OYOTUN","140110"]
[null,null,null,null,null,null,null,"LAMBAYEQUE CHICLAYO PATAPO",{"$f":"IF(AND(ING!$D$21=J1255,ING!$V$21=K1255),I1254+1,0)","v":0},"LAMBAYEQUE","CHICLAYO","PATAPO","140117"]
[null,null,null,null,null,null,null,"LAMBAYEQUE CHICLAYO PICSI",{"$f":"IF(AND(ING!$D$21=J1256,ING!$V$21=K1256),I1255+1,0)","v":0},"LAMBAYEQUE","CHICLAYO","PICSI","140111"]
[null,null,null,null,null,null,null,"LAMBAYEQUE CHICLAYO PIMENTEL",{"$f":"IF(AND(ING!$D$21=J1257,ING!$V$21=K1257),I1256+1,0)","v":0},"LAMBAYEQUE","CHICLAYO","PIMENTEL","140112"]
[null,null,null,null,null,null,null,"LAMBAYEQUE CHICLAYO POMALCA",{"$f":"IF(AND(ING!$D$21=J1258,ING!$V$21=K1258),I1257+1,0)","v":0},"LAMBAYEQUE","CHICLAYO","POMALCA","140118"]
[null,null,null,null,null,null,null,"LAMBAYEQUE CHICLAYO PUCALA",{"$f":"IF(AND(ING!$D$21=J1259,ING!$V$21=K1259),I1258+1,0)","v":0},"LAMBAYEQUE","CHICLAYO","PUCALA","140119"]
[null,null,null,null,null,null,null,"LAMBAYEQUE CHICLAYO REQUE",{"$f":"IF(AND(ING!$D$21=J1260,ING!$V$21=K1260),I1259+1,0)","v":0},"LAMBAYEQUE","CHICLAYO","REQUE","140113"]
[null,null,null,null,null,null,null,"LAMBAYEQUE CHICLAYO SANTA ROSA",{"$f":"IF(AND(ING!$D$21=J1261,ING!$V$21=K1261),I1260+1,0)","v":0},"LAMBAYEQUE","CHICLAYO","SANTA ROSA","140114"]
[null,null,null,null,null,null,null,"LAMBAYEQUE CHICLAYO SAÑA",{"$f":"IF(AND(ING!$D$21=J1262,ING!$V$21=K1262),I1261+1,0)","v":0},"LAMBAYEQUE","CHICLAYO","SAÑA","140115"]
[null,null,null,null,null,null,null,"LAMBAYEQUE CHICLAYO TUMAN",{"$f":"IF(AND(ING!$D$21=J1263,ING!$V$21=K1263),I1262+1,0)","v":0},"LAMBAYEQUE","CHICLAYO","TUMAN","140120"]
[null,null,null,null,null,null,null,"LAMBAYEQUE FERREÑAFE CAÑARIS",{"$f":"IF(AND(ING!$D$21=J1264,ING!$V$21=K1264),I1263+1,0)","v":0},"LAMBAYEQUE","FERREÑAFE","CAÑARIS","140202"]
[null,null,null,null,null,null,null,"LAMBAYEQUE FERREÑAFE FERREÑAFE",{"$f":"IF(AND(ING!$D$21=J1265,ING!$V$21=K1265),I1264+1,0)","v":0},"LAMBAYEQUE","FERREÑAFE","FERREÑAFE","140201"]
[null,null,null,null,null,null,null,"LAMBAYEQUE FERREÑAFE INCAHUASI",{"$f":"IF(AND(ING!$D$21=J1266,ING!$V$21=K1266),I1265+1,0)","v":0},"LAMBAYEQUE","FERREÑAFE","INCAHUASI","140203"]
[null,null,null,null,null,null,null,"LAMBAYEQUE FERREÑAFE MANUEL ANTONIO MESONES MURO",{"$f":"IF(AND(ING!$D$21=J1267,ING!$V$21=K1267),I1266+1,0)","v":0},"LAMBAYEQUE","FERREÑAFE","MANUEL ANTONIO MESONES MURO","140204"]
[null,null,null,null,null,null,null,"LAMBAYEQUE FERREÑAFE PITIPO",{"$f":"IF(AND(ING!$D$21=J1268,ING!$V$21=K1268),I1267+1,0)","v":0},"LAMBAYEQUE","FERREÑAFE","PITIPO","140205"]
[null,null,null,null,null,null,null,"LAMBAYEQUE FERREÑAFE PUEBLO NUEVO",{"$f":"IF(AND(ING!$D$21=J1269,ING!$V$21=K1269),I1268+1,0)","v":0},"LAMBAYEQUE","FERREÑAFE","PUEBLO NUEVO","140206"]
[null,null,null,null,null,null,null,"LAMBAYEQUE LAMBAYEQUE CHOCHOPE",{"$f":"IF(AND(ING!$D$21=J1270,ING!$V$21=K1270),I1269+1,0)","v":0},"LAMBAYEQUE","LAMBAYEQUE","CHOCHOPE","140302"]
[null,null,null,null,null,null,null,"LAMBAYEQUE LAMBAYEQUE ILLIMO",{"$f":"IF(AND(ING!$D$21=J1271,ING!$V$21=K1271),I1270+1,0)","v":0},"LAMBAYEQUE","LAMBAYEQUE","ILLIMO","140303"]
[null,null,null,null,null,null,null,"LAMBAYEQUE LAMBAYEQUE JAYANCA",{"$f":"IF(AND(ING!$D$21=J1272,ING!$V$21=K1272),I1271+1,0)","v":0},"LAMBAYEQUE","LAMBAYEQUE","JAYANCA","140304"]
[null,null,null,null,null,null,null,"LAMBAYEQUE LAMBAYEQUE LAMBAYEQUE",{"$f":"IF(AND(ING!$D$21=J1273,ING!$V$21=K1273),I1272+1,0)","v":0},"LAMBAYEQUE","LAMBAYEQUE","LAMBAYEQUE","140301"]
[null,null,null,null,null,null,null,"LAMBAYEQUE LAMBAYEQUE MOCHUMI",{"$f":"IF(AND(ING!$D$21=J1274,ING!$V$21=K1274),I1273+1,0)","v":0},"LAMBAYEQUE","LAMBAYEQUE","MOCHUMI","140305"]
[null,null,null,null,null,null,null,"LAMBAYEQUE LAMBAYEQUE MORROPE",{"$f":"IF(AND(ING!$D$21=J1275,ING!$V$21=K1275),I1274+1,0)","v":0},"LAMBAYEQUE","LAMBAYEQUE","MORROPE","140306"]
[null,null,null,null,null,null,null,"LAMBAYEQUE LAMBAYEQUE MOTUPE",{"$f":"IF(AND(ING!$D$21=J1276,ING!$V$21=K1276),I1275+1,0)","v":0},"LAMBAYEQUE","LAMBAYEQUE","MOTUPE","140307"]
[null,null,null,null,null,null,null,"LAMBAYEQUE LAMBAYEQUE OLMOS",{"$f":"IF(AND(ING!$D$21=J1277,ING!$V$21=K1277),I1276+1,0)","v":0},"LAMBAYEQUE","LAMBAYEQUE","OLMOS","140308"]
[null,null,null,null,null,null,null,"LAMBAYEQUE LAMBAYEQUE PACORA",{"$f":"IF(AND(ING!$D$21=J1278,ING!$V$21=K1278),I1277+1,0)","v":0},"LAMBAYEQUE","LAMBAYEQUE","PACORA","140309"]
[null,null,null,null,null,null,null,"LAMBAYEQUE LAMBAYEQUE SALAS",{"$f":"IF(AND(ING!$D$21=J1279,ING!$V$21=K1279),I1278+1,0)","v":0},"LAMBAYEQUE","LAMBAYEQUE","SALAS","140310"]
[null,null,null,null,null,null,null,"LAMBAYEQUE LAMBAYEQUE SAN JOSE",{"$f":"IF(AND(ING!$D$21=J1280,ING!$V$21=K1280),I1279+1,0)","v":0},"LAMBAYEQUE","LAMBAYEQUE","SAN JOSE","140311"]
[null,null,null,null,null,null,null,"LAMBAYEQUE LAMBAYEQUE TUCUME",{"$f":"IF(AND(ING!$D$21=J1281,ING!$V$21=K1281),I1280+1,0)","v":0},"LAMBAYEQUE","LAMBAYEQUE","TUCUME","140312"]
[null,null,null,null,null,null,null,"LIMA BARRANCA BARRANCA",{"$f":"IF(AND(ING!$D$21=J1282,ING!$V$21=K1282),I1281+1,0)","v":0},"LIMA","BARRANCA","BARRANCA","150201"]
[null,null,null,null,null,null,null,{"$f":"J1283&\" \"&K1283&\" \"&L1283","v":"LIMA BARRANCA PARAMONGA"},{"$f":"IF(AND(ING!$D$21=J1283,ING!$V$21=K1283),I1282+1,0)","v":0},"LIMA","BARRANCA","PARAMONGA","150202"]
[null,null,null,null,null,null,null,"LIMA BARRANCA PATIVILCA",{"$f":"IF(AND(ING!$D$21=J1284,ING!$V$21=K1284),I1283+1,0)","v":0},"LIMA","BARRANCA","PATIVILCA","150203"]
[null,null,null,null,null,null,null,"LIMA BARRANCA SUPE",{"$f":"IF(AND(ING!$D$21=J1285,ING!$V$21=K1285),I1284+1,0)","v":0},"LIMA","BARRANCA","SUPE","150204"]
[null,null,null,null,null,null,null,"LIMA BARRANCA SUPE PUERTO",{"$f":"IF(AND(ING!$D$21=J1286,ING!$V$21=K1286),I1285+1,0)","v":0},"LIMA","BARRANCA","SUPE PUERTO","150205"]
[null,null,null,null,null,null,null,"LIMA CAJATAMBO CAJATAMBO",{"$f":"IF(AND(ING!$D$21=J1287,ING!$V$21=K1287),I1286+1,0)","v":0},"LIMA","CAJATAMBO","CAJATAMBO","150301"]
[null,null,null,null,null,null,null,"LIMA CAJATAMBO COPA",{"$f":"IF(AND(ING!$D$21=J1288,ING!$V$21=K1288),I1287+1,0)","v":0},"LIMA","CAJATAMBO","COPA","150302"]
[null,null,null,null,null,null,null,"LIMA CAJATAMBO GORGOR",{"$f":"IF(AND(ING!$D$21=J1289,ING!$V$21=K1289),I1288+1,0)","v":0},"LIMA","CAJATAMBO","GORGOR","150303"]
[null,null,null,null,null,null,null,"LIMA CAJATAMBO HUANCAPON",{"$f":"IF(AND(ING!$D$21=J1290,ING!$V$21=K1290),I1289+1,0)","v":0},"LIMA","CAJATAMBO","HUANCAPON","150304"]
[null,null,null,null,null,null,null,"LIMA CAJATAMBO MANAS",{"$f":"IF(AND(ING!$D$21=J1291,ING!$V$21=K1291),I1290+1,0)","v":0},"LIMA","CAJATAMBO","MANAS","150305"]
[null,null,null,null,null,null,null,"LIMA CANTA ARAHUAY",{"$f":"IF(AND(ING!$D$21=J1292,ING!$V$21=K1292),I1291+1,0)","v":0},"LIMA","CANTA","ARAHUAY","150402"]
[null,null,null,null,null,null,null,"LIMA CANTA CANTA",{"$f":"IF(AND(ING!$D$21=J1293,ING!$V$21=K1293),I1292+1,0)","v":0},"LIMA","CANTA","CANTA","150401"]
[null,null,null,null,null,null,null,"LIMA CANTA HUAMANTANGA",{"$f":"IF(AND(ING!$D$21=J1294,ING!$V$21=K1294),I1293+1,0)","v":0},"LIMA","CANTA","HUAMANTANGA","150403"]
[null,null,null,null,null,null,null,"LIMA CANTA HUAROS",{"$f":"IF(AND(ING!$D$21=J1295,ING!$V$21=K1295),I1294+1,0)","v":0},"LIMA","CANTA","HUAROS","150404"]
[null,null,null,null,null,null,null,"LIMA CANTA LACHAQUI",{"$f":"IF(AND(ING!$D$21=J1296,ING!$V$21=K1296),I1295+1,0)","v":0},"LIMA","CANTA","LACHAQUI","150405"]
[null,null,null,null,null,null,null,"LIMA CANTA SAN BUENAVENTURA",{"$f":"IF(AND(ING!$D$21=J1297,ING!$V$21=K1297),I1296+1,0)","v":0},"LIMA","CANTA","SAN BUENAVENTURA","150406"]
[null,null,null,null,null,null,null,"LIMA CANTA SANTA ROSA DE QUIVES",{"$f":"IF(AND(ING!$D$21=J1298,ING!$V$21=K1298),I1297+1,0)","v":0},"LIMA","CANTA","SANTA ROSA DE QUIVES","150407"]
[null,null,null,null,null,null,null,"LIMA CAÑETE ASIA",{"$f":"IF(AND(ING!$D$21=J1299,ING!$V$21=K1299),I1298+1,0)","v":0},"LIMA","CAÑETE","ASIA","150502"]
[null,null,null,null,null,null,null,"LIMA CAÑETE CALANGO",{"$f":"IF(AND(ING!$D$21=J1300,ING!$V$21=K1300),I1299+1,0)","v":0},"LIMA","CAÑETE","CALANGO","150503"]
[null,null,null,null,null,null,null,"LIMA CAÑETE CERRO AZUL",{"$f":"IF(AND(ING!$D$21=J1301,ING!$V$21=K1301),I1300+1,0)","v":0},"LIMA","CAÑETE","CERRO AZUL","150504"]
[null,null,null,null,null,null,null,"LIMA CAÑETE CHILCA",{"$f":"IF(AND(ING!$D$21=J1302,ING!$V$21=K1302),I1301+1,0)","v":0},"LIMA","CAÑETE","CHILCA","150505"]
[null,null,null,null,null,null,null,"LIMA CAÑETE COAYLLO",{"$f":"IF(AND(ING!$D$21=J1303,ING!$V$21=K1303),I1302+1,0)","v":0},"LIMA","CAÑETE","COAYLLO","150506"]
[null,null,null,null,null,null,null,"LIMA CAÑETE IMPERIAL",{"$f":"IF(AND(ING!$D$21=J1304,ING!$V$21=K1304),I1303+1,0)","v":0},"LIMA","CAÑETE","IMPERIAL","150507"]
[null,null,null,null,null,null,null,"LIMA CAÑETE LUNAHUANA",{"$f":"IF(AND(ING!$D$21=J1305,ING!$V$21=K1305),I1304+1,0)","v":0},"LIMA","CAÑETE","LUNAHUANA","150508"]
[null,null,null,null,null,null,null,"LIMA CAÑETE MALA",{"$f":"IF(AND(ING!$D$21=J1306,ING!$V$21=K1306),I1305+1,0)","v":0},"LIMA","CAÑETE","MALA","150509"]
[null,null,null,null,null,null,null,"LIMA CAÑETE NUEVO IMPERIAL",{"$f":"IF(AND(ING!$D$21=J1307,ING!$V$21=K1307),I1306+1,0)","v":0},"LIMA","CAÑETE","NUEVO IMPERIAL","150510"]
[null,null,null,null,null,null,null,"LIMA CAÑETE PACARAN",{"$f":"IF(AND(ING!$D$21=J1308,ING!$V$21=K1308),I1307+1,0)","v":0},"LIMA","CAÑETE","PACARAN","150511"]
[null,null,null,null,null,null,null,"LIMA CAÑETE QUILMANA",{"$f":"IF(AND(ING!$D$21=J1309,ING!$V$21=K1309),I1308+1,0)","v":0},"LIMA","CAÑETE","QUILMANA","150512"]
[null,null,null,null,null,null,null,"LIMA CAÑETE SAN ANTONIO",{"$f":"IF(AND(ING!$D$21=J1310,ING!$V$21=K1310),I1309+1,0)","v":0},"LIMA","CAÑETE","SAN ANTONIO","150513"]
[null,null,null,null,null,null,null,"LIMA CAÑETE SAN LUIS",{"$f":"IF(AND(ING!$D$21=J1311,ING!$V$21=K1311),I1310+1,0)","v":0},"LIMA","CAÑETE","SAN LUIS","150514"]
[null,null,null,null,null,null,null,"LIMA CAÑETE SAN VICENTE DE CAÑETE",{"$f":"IF(AND(ING!$D$21=J1312,ING!$V$21=K1312),I1311+1,0)","v":0},"LIMA","CAÑETE","SAN VICENTE DE CAÑETE","150501"]
[null,null,null,null,null,null,null,"LIMA CAÑETE SANTA CRUZ DE FLORES",{"$f":"IF(AND(ING!$D$21=J1313,ING!$V$21=K1313),I1312+1,0)","v":0},"LIMA","CAÑETE","SANTA CRUZ DE FLORES","150515"]
[null,null,null,null,null,null,null,"LIMA CAÑETE ZUÑIGA",{"$f":"IF(AND(ING!$D$21=J1314,ING!$V$21=K1314),I1313+1,0)","v":0},"LIMA","CAÑETE","ZUÑIGA","150516"]
[null,null,null,null,null,null,null,"LIMA HUARAL ATAVILLOS ALTO",{"$f":"IF(AND(ING!$D$21=J1315,ING!$V$21=K1315),I1314+1,0)","v":0},"LIMA","HUARAL","ATAVILLOS ALTO","150602"]
[null,null,null,null,null,null,null,"LIMA HUARAL ATAVILLOS BAJO",{"$f":"IF(AND(ING!$D$21=J1316,ING!$V$21=K1316),I1315+1,0)","v":0},"LIMA","HUARAL","ATAVILLOS BAJO","150603"]
[null,null,null,null,null,null,null,"LIMA HUARAL AUCALLAMA",{"$f":"IF(AND(ING!$D$21=J1317,ING!$V$21=K1317),I1316+1,0)","v":0},"LIMA","HUARAL","AUCALLAMA","150604"]
[null,null,null,null,null,null,null,"LIMA HUARAL CHANCAY",{"$f":"IF(AND(ING!$D$21=J1318,ING!$V$21=K1318),I1317+1,0)","v":0},"LIMA","HUARAL","CHANCAY","150605"]
[null,null,null,null,null,null,null,"LIMA HUARAL HUARAL",{"$f":"IF(AND(ING!$D$21=J1319,ING!$V$21=K1319),I1318+1,0)","v":0},"LIMA","HUARAL","HUARAL","150601"]
[null,null,null,null,null,null,null,"LIMA HUARAL IHUARI",{"$f":"IF(AND(ING!$D$21=J1320,ING!$V$21=K1320),I1319+1,0)","v":0},"LIMA","HUARAL","IHUARI","150606"]
[null,null,null,null,null,null,null,"LIMA HUARAL LAMPIAN",{"$f":"IF(AND(ING!$D$21=J1321,ING!$V$21=K1321),I1320+1,0)","v":0},"LIMA","HUARAL","LAMPIAN","150607"]
[null,null,null,null,null,null,null,"LIMA HUARAL PACARAOS",{"$f":"IF(AND(ING!$D$21=J1322,ING!$V$21=K1322),I1321+1,0)","v":0},"LIMA","HUARAL","PACARAOS","150608"]
[null,null,null,null,null,null,null,"LIMA HUARAL SAN MIGUEL DE ACOS",{"$f":"IF(AND(ING!$D$21=J1323,ING!$V$21=K1323),I1322+1,0)","v":0},"LIMA","HUARAL","SAN MIGUEL DE ACOS","150609"]
[null,null,null,null,null,null,null,"LIMA HUARAL SANTA CRUZ DE ANDAMARCA",{"$f":"IF(AND(ING!$D$21=J1324,ING!$V$21=K1324),I1323+1,0)","v":0},"LIMA","HUARAL","SANTA CRUZ DE ANDAMARCA","150610"]
[null,null,null,null,null,null,null,"LIMA HUARAL SUMBILCA",{"$f":"IF(AND(ING!$D$21=J1325,ING!$V$21=K1325),I1324+1,0)","v":0},"LIMA","HUARAL","SUMBILCA","150611"]
[null,null,null,null,null,null,null,"LIMA HUARAL VEINTISIETE DE NOVIEMBRE",{"$f":"IF(AND(ING!$D$21=J1326,ING!$V$21=K1326),I1325+1,0)","v":0},"LIMA","HUARAL","VEINTISIETE DE NOVIEMBRE","150612"]
[null,null,null,null,null,null,null,"LIMA HUAROCHIRI ANTIOQUIA",{"$f":"IF(AND(ING!$D$21=J1327,ING!$V$21=K1327),I1326+1,0)","v":0},"LIMA","HUAROCHIRI","ANTIOQUIA","150702"]
[null,null,null,null,null,null,null,"LIMA HUAROCHIRI CALLAHUANCA",{"$f":"IF(AND(ING!$D$21=J1328,ING!$V$21=K1328),I1327+1,0)","v":0},"LIMA","HUAROCHIRI","CALLAHUANCA","150703"]
[null,null,null,null,null,null,null,"LIMA HUAROCHIRI CARAMPOMA",{"$f":"IF(AND(ING!$D$21=J1329,ING!$V$21=K1329),I1328+1,0)","v":0},"LIMA","HUAROCHIRI","CARAMPOMA","150704"]
[null,null,null,null,null,null,null,"LIMA HUAROCHIRI CHICLA",{"$f":"IF(AND(ING!$D$21=J1330,ING!$V$21=K1330),I1329+1,0)","v":0},"LIMA","HUAROCHIRI","CHICLA","150705"]
[null,null,null,null,null,null,null,"LIMA HUAROCHIRI CUENCA",{"$f":"IF(AND(ING!$D$21=J1331,ING!$V$21=K1331),I1330+1,0)","v":0},"LIMA","HUAROCHIRI","CUENCA","150706"]
[null,null,null,null,null,null,null,"LIMA HUAROCHIRI HUACHUPAMPA",{"$f":"IF(AND(ING!$D$21=J1332,ING!$V$21=K1332),I1331+1,0)","v":0},"LIMA","HUAROCHIRI","HUACHUPAMPA","150707"]
[null,null,null,null,null,null,null,"LIMA HUAROCHIRI HUANZA",{"$f":"IF(AND(ING!$D$21=J1333,ING!$V$21=K1333),I1332+1,0)","v":0},"LIMA","HUAROCHIRI","HUANZA","150708"]
[null,null,null,null,null,null,null,"LIMA HUAROCHIRI HUAROCHIRI",{"$f":"IF(AND(ING!$D$21=J1334,ING!$V$21=K1334),I1333+1,0)","v":0},"LIMA","HUAROCHIRI","HUAROCHIRI","150709"]
[null,null,null,null,null,null,null,"LIMA HUAROCHIRI LAHUAYTAMBO",{"$f":"IF(AND(ING!$D$21=J1335,ING!$V$21=K1335),I1334+1,0)","v":0},"LIMA","HUAROCHIRI","LAHUAYTAMBO","150710"]
[null,null,null,null,null,null,null,"LIMA HUAROCHIRI LANGA",{"$f":"IF(AND(ING!$D$21=J1336,ING!$V$21=K1336),I1335+1,0)","v":0},"LIMA","HUAROCHIRI","LANGA","150711"]
[null,null,null,null,null,null,null,"LIMA HUAROCHIRI MARIATANA",{"$f":"IF(AND(ING!$D$21=J1337,ING!$V$21=K1337),I1336+1,0)","v":0},"LIMA","HUAROCHIRI","MARIATANA","150713"]
[null,null,null,null,null,null,null,"LIMA HUAROCHIRI MATUCANA",{"$f":"IF(AND(ING!$D$21=J1338,ING!$V$21=K1338),I1337+1,0)","v":0},"LIMA","HUAROCHIRI","MATUCANA","150701"]
[null,null,null,null,null,null,null,"LIMA HUAROCHIRI RICARDO PALMA",{"$f":"IF(AND(ING!$D$21=J1339,ING!$V$21=K1339),I1338+1,0)","v":0},"LIMA","HUAROCHIRI","RICARDO PALMA","150714"]
[null,null,null,null,null,null,null,"LIMA HUAROCHIRI SAN ANDRES DE TUPICOCHA",{"$f":"IF(AND(ING!$D$21=J1340,ING!$V$21=K1340),I1339+1,0)","v":0},"LIMA","HUAROCHIRI","SAN ANDRES DE TUPICOCHA","150715"]
[null,null,null,null,null,null,null,"LIMA HUAROCHIRI SAN ANTONIO",{"$f":"IF(AND(ING!$D$21=J1341,ING!$V$21=K1341),I1340+1,0)","v":0},"LIMA","HUAROCHIRI","SAN ANTONIO","150716"]
[null,null,null,null,null,null,null,"LIMA HUAROCHIRI SAN BARTOLOME",{"$f":"IF(AND(ING!$D$21=J1342,ING!$V$21=K1342),I1341+1,0)","v":0},"LIMA","HUAROCHIRI","SAN BARTOLOME","150717"]
[null,null,null,null,null,null,null,"LIMA HUAROCHIRI SAN DAMIAN",{"$f":"IF(AND(ING!$D$21=J1343,ING!$V$21=K1343),I1342+1,0)","v":0},"LIMA","HUAROCHIRI","SAN DAMIAN","150718"]
[null,null,null,null,null,null,null,"LIMA HUAROCHIRI SAN JUAN DE IRIS",{"$f":"IF(AND(ING!$D$21=J1344,ING!$V$21=K1344),I1343+1,0)","v":0},"LIMA","HUAROCHIRI","SAN JUAN DE IRIS","150719"]
[null,null,null,null,null,null,null,"LIMA HUAROCHIRI SAN JUAN DE TANTARANCHE",{"$f":"IF(AND(ING!$D$21=J1345,ING!$V$21=K1345),I1344+1,0)","v":0},"LIMA","HUAROCHIRI","SAN JUAN DE TANTARANCHE","150720"]
[null,null,null,null,null,null,null,"LIMA HUAROCHIRI SAN LORENZO DE QUINTI",{"$f":"IF(AND(ING!$D$21=J1346,ING!$V$21=K1346),I1345+1,0)","v":0},"LIMA","HUAROCHIRI","SAN LORENZO DE QUINTI","150721"]
[null,null,null,null,null,null,null,{"$f":"J1347&\" \"&K1347&\" \"&L1347","v":"LIMA HUAROCHIRI SAN MATEO"},{"$f":"IF(AND(ING!$D$21=J1347,ING!$V$21=K1347),I1346+1,0)","v":0},"LIMA","HUAROCHIRI","SAN MATEO","150722"]
[null,null,null,null,null,null,null,"LIMA HUAROCHIRI SAN MATEO DE OTAO",{"$f":"IF(AND(ING!$D$21=J1348,ING!$V$21=K1348),I1347+1,0)","v":0},"LIMA","HUAROCHIRI","SAN MATEO DE OTAO","150723"]
[null,null,null,null,null,null,null,"LIMA HUAROCHIRI SAN PEDRO DE CASTA",{"$f":"IF(AND(ING!$D$21=J1349,ING!$V$21=K1349),I1348+1,0)","v":0},"LIMA","HUAROCHIRI","SAN PEDRO DE CASTA","150724"]
[null,null,null,null,null,null,null,"LIMA HUAROCHIRI SAN PEDRO DE HUANCAYRE",{"$f":"IF(AND(ING!$D$21=J1350,ING!$V$21=K1350),I1349+1,0)","v":0},"LIMA","HUAROCHIRI","SAN PEDRO DE HUANCAYRE","150725"]
[null,null,null,null,null,null,null,"LIMA HUAROCHIRI SAN PEDRO DE LARAOS",{"$f":"IF(AND(ING!$D$21=J1351,ING!$V$21=K1351),I1350+1,0)","v":0},"LIMA","HUAROCHIRI","SAN PEDRO DE LARAOS","150712"]
[null,null,null,null,null,null,null,"LIMA HUAROCHIRI SANGALLAYA",{"$f":"IF(AND(ING!$D$21=J1352,ING!$V$21=K1352),I1351+1,0)","v":0},"LIMA","HUAROCHIRI","SANGALLAYA","150726"]
[null,null,null,null,null,null,null,"LIMA HUAROCHIRI SANTA CRUZ DE COCACHACRA",{"$f":"IF(AND(ING!$D$21=J1353,ING!$V$21=K1353),I1352+1,0)","v":0},"LIMA","HUAROCHIRI","SANTA CRUZ DE COCACHACRA","150727"]
[null,null,null,null,null,null,null,"LIMA HUAROCHIRI SANTA EULALIA",{"$f":"IF(AND(ING!$D$21=J1354,ING!$V$21=K1354),I1353+1,0)","v":0},"LIMA","HUAROCHIRI","SANTA EULALIA","150728"]
[null,null,null,null,null,null,null,"LIMA HUAROCHIRI SANTIAGO DE ANCHUCAYA",{"$f":"IF(AND(ING!$D$21=J1355,ING!$V$21=K1355),I1354+1,0)","v":0},"LIMA","HUAROCHIRI","SANTIAGO DE ANCHUCAYA","150729"]
[null,null,null,null,null,null,null,"LIMA HUAROCHIRI SANTIAGO DE TUNA",{"$f":"IF(AND(ING!$D$21=J1356,ING!$V$21=K1356),I1355+1,0)","v":0},"LIMA","HUAROCHIRI","SANTIAGO DE TUNA","150730"]
[null,null,null,null,null,null,null,"LIMA HUAROCHIRI SANTO DOMINGO DE LOS OLLEROS",{"$f":"IF(AND(ING!$D$21=J1357,ING!$V$21=K1357),I1356+1,0)","v":0},"LIMA","HUAROCHIRI","SANTO DOMINGO DE LOS OLLEROS","150731"]
[null,null,null,null,null,null,null,"LIMA HUAROCHIRI SURCO",{"$f":"IF(AND(ING!$D$21=J1358,ING!$V$21=K1358),I1357+1,0)","v":0},"LIMA","HUAROCHIRI","SURCO","150732"]
[null,null,null,null,null,null,null,"LIMA HUAURA AMBAR",{"$f":"IF(AND(ING!$D$21=J1359,ING!$V$21=K1359),I1358+1,0)","v":0},"LIMA","HUAURA","AMBAR","150802"]
[null,null,null,null,null,null,null,"LIMA HUAURA CALETA DE CARQUIN",{"$f":"IF(AND(ING!$D$21=J1360,ING!$V$21=K1360),I1359+1,0)","v":0},"LIMA","HUAURA","CALETA DE CARQUIN","150803"]
[null,null,null,null,null,null,null,"LIMA HUAURA CHECRAS",{"$f":"IF(AND(ING!$D$21=J1361,ING!$V$21=K1361),I1360+1,0)","v":0},"LIMA","HUAURA","CHECRAS","150804"]
[null,null,null,null,null,null,null,"LIMA HUAURA HUACHO",{"$f":"IF(AND(ING!$D$21=J1362,ING!$V$21=K1362),I1361+1,0)","v":0},"LIMA","HUAURA","HUACHO","150801"]
[null,null,null,null,null,null,null,"LIMA HUAURA HUALMAY",{"$f":"IF(AND(ING!$D$21=J1363,ING!$V$21=K1363),I1362+1,0)","v":0},"LIMA","HUAURA","HUALMAY","150805"]
[null,null,null,null,null,null,null,"LIMA HUAURA HUAURA",{"$f":"IF(AND(ING!$D$21=J1364,ING!$V$21=K1364),I1363+1,0)","v":0},"LIMA","HUAURA","HUAURA","150806"]
[null,null,null,null,null,null,null,"LIMA HUAURA LEONCIO PRADO",{"$f":"IF(AND(ING!$D$21=J1365,ING!$V$21=K1365),I1364+1,0)","v":0},"LIMA","HUAURA","LEONCIO PRADO","150807"]
[null,null,null,null,null,null,null,"LIMA HUAURA PACCHO",{"$f":"IF(AND(ING!$D$21=J1366,ING!$V$21=K1366),I1365+1,0)","v":0},"LIMA","HUAURA","PACCHO","150808"]
[null,null,null,null,null,null,null,"LIMA HUAURA SANTA LEONOR",{"$f":"IF(AND(ING!$D$21=J1367,ING!$V$21=K1367),I1366+1,0)","v":0},"LIMA","HUAURA","SANTA LEONOR","150809"]
[null,null,null,null,null,null,null,"LIMA HUAURA SANTA MARIA",{"$f":"IF(AND(ING!$D$21=J1368,ING!$V$21=K1368),I1367+1,0)","v":0},"LIMA","HUAURA","SANTA MARIA","150810"]
[null,null,null,null,null,null,null,"LIMA HUAURA SAYAN",{"$f":"IF(AND(ING!$D$21=J1369,ING!$V$21=K1369),I1368+1,0)","v":0},"LIMA","HUAURA","SAYAN","150811"]
[null,null,null,null,null,null,null,"LIMA HUAURA VEGUETA",{"$f":"IF(AND(ING!$D$21=J1370,ING!$V$21=K1370),I1369+1,0)","v":0},"LIMA","HUAURA","VEGUETA","150812"]
[null,null,null,null,null,null,null,"LIMA LIMA ANCON",{"$f":"IF(AND(ING!$D$21=J1371,ING!$V$21=K1371),I1370+1,0)","v":0},"LIMA","LIMA","ANCON","150102"]
[null,null,null,null,null,null,null,"LIMA LIMA ATE",{"$f":"IF(AND(ING!$D$21=J1372,ING!$V$21=K1372),I1371+1,0)","v":0},"LIMA","LIMA","ATE","150103"]
[null,null,null,null,null,null,null,"LIMA LIMA BARRANCO",{"$f":"IF(AND(ING!$D$21=J1373,ING!$V$21=K1373),I1372+1,0)","v":0},"LIMA","LIMA","BARRANCO","150104"]
[null,null,null,null,null,null,null,"LIMA LIMA BREÑA",{"$f":"IF(AND(ING!$D$21=J1374,ING!$V$21=K1374),I1373+1,0)","v":0},"LIMA","LIMA","BREÑA","150105"]
[null,null,null,null,null,null,null,"LIMA LIMA CARABAYLLO",{"$f":"IF(AND(ING!$D$21=J1375,ING!$V$21=K1375),I1374+1,0)","v":0},"LIMA","LIMA","CARABAYLLO","150106"]
[null,null,null,null,null,null,null,"LIMA LIMA CHACLACAYO",{"$f":"IF(AND(ING!$D$21=J1376,ING!$V$21=K1376),I1375+1,0)","v":0},"LIMA","LIMA","CHACLACAYO","150107"]
[null,null,null,null,null,null,null,"LIMA LIMA CHORRILLOS",{"$f":"IF(AND(ING!$D$21=J1377,ING!$V$21=K1377),I1376+1,0)","v":0},"LIMA","LIMA","CHORRILLOS","150108"]
[null,null,null,null,null,null,null,"LIMA LIMA CIENEGUILLA",{"$f":"IF(AND(ING!$D$21=J1378,ING!$V$21=K1378),I1377+1,0)","v":0},"LIMA","LIMA","CIENEGUILLA","150109"]
[null,null,null,null,null,null,null,"LIMA LIMA COMAS",{"$f":"IF(AND(ING!$D$21=J1379,ING!$V$21=K1379),I1378+1,0)","v":0},"LIMA","LIMA","COMAS","150110"]
[null,null,null,null,null,null,null,"LIMA LIMA EL AGUSTINO",{"$f":"IF(AND(ING!$D$21=J1380,ING!$V$21=K1380),I1379+1,0)","v":0},"LIMA","LIMA","EL AGUSTINO","150111"]
[null,null,null,null,null,null,null,"LIMA LIMA INDEPENDENCIA",{"$f":"IF(AND(ING!$D$21=J1381,ING!$V$21=K1381),I1380+1,0)","v":0},"LIMA","LIMA","INDEPENDENCIA","150112"]
[null,null,null,null,null,null,null,"LIMA LIMA JESUS MARIA",{"$f":"IF(AND(ING!$D$21=J1382,ING!$V$21=K1382),I1381+1,0)","v":0},"LIMA","LIMA","JESUS MARIA","150113"]
[null,null,null,null,null,null,null,"LIMA LIMA LA MOLINA",{"$f":"IF(AND(ING!$D$21=J1383,ING!$V$21=K1383),I1382+1,0)","v":0},"LIMA","LIMA","LA MOLINA","150114"]
[null,null,null,null,null,null,null,"LIMA LIMA LA VICTORIA",{"$f":"IF(AND(ING!$D$21=J1384,ING!$V$21=K1384),I1383+1,0)","v":0},"LIMA","LIMA","LA VICTORIA","150115"]
[null,null,null,null,null,null,null,"LIMA LIMA LIMA",{"$f":"IF(AND(ING!$D$21=J1385,ING!$V$21=K1385),I1384+1,0)","v":0},"LIMA","LIMA","LIMA","150101"]
[null,null,null,null,null,null,null,"LIMA LIMA LINCE",{"$f":"IF(AND(ING!$D$21=J1386,ING!$V$21=K1386),I1385+1,0)","v":0},"LIMA","LIMA","LINCE","150116"]
[null,null,null,null,null,null,null,"LIMA LIMA LOS OLIVOS",{"$f":"IF(AND(ING!$D$21=J1387,ING!$V$21=K1387),I1386+1,0)","v":0},"LIMA","LIMA","LOS OLIVOS","150117"]
[null,null,null,null,null,null,null,"LIMA LIMA LURIGANCHO",{"$f":"IF(AND(ING!$D$21=J1388,ING!$V$21=K1388),I1387+1,0)","v":0},"LIMA","LIMA","LURIGANCHO","150118"]
[null,null,null,null,null,null,null,"LIMA LIMA LURIN",{"$f":"IF(AND(ING!$D$21=J1389,ING!$V$21=K1389),I1388+1,0)","v":0},"LIMA","LIMA","LURIN","150119"]
[null,null,null,null,null,null,null,"LIMA LIMA MAGDALENA DEL MAR",{"$f":"IF(AND(ING!$D$21=J1390,ING!$V$21=K1390),I1389+1,0)","v":0},"LIMA","LIMA","MAGDALENA DEL MAR","150120"]
[null,null,null,null,null,null,null,"LIMA LIMA MIRAFLORES",{"$f":"IF(AND(ING!$D$21=J1391,ING!$V$21=K1391),I1390+1,0)","v":0},"LIMA","LIMA","MIRAFLORES","150122"]
[null,null,null,null,null,null,null,"LIMA LIMA PACHACAMAC",{"$f":"IF(AND(ING!$D$21=J1392,ING!$V$21=K1392),I1391+1,0)","v":0},"LIMA","LIMA","PACHACAMAC","150123"]
[null,null,null,null,null,null,null,"LIMA LIMA PUCUSANA",{"$f":"IF(AND(ING!$D$21=J1393,ING!$V$21=K1393),I1392+1,0)","v":0},"LIMA","LIMA","PUCUSANA","150124"]
[null,null,null,null,null,null,null,"LIMA LIMA PUEBLO LIBRE",{"$f":"IF(AND(ING!$D$21=J1394,ING!$V$21=K1394),I1393+1,0)","v":0},"LIMA","LIMA","PUEBLO LIBRE","150121"]
[null,null,null,null,null,null,null,"LIMA LIMA PUENTE PIEDRA",{"$f":"IF(AND(ING!$D$21=J1395,ING!$V$21=K1395),I1394+1,0)","v":0},"LIMA","LIMA","PUENTE PIEDRA","150125"]
[null,null,null,null,null,null,null,"LIMA LIMA PUNTA HERMOSA",{"$f":"IF(AND(ING!$D$21=J1396,ING!$V$21=K1396),I1395+1,0)","v":0},"LIMA","LIMA","PUNTA HERMOSA","150126"]
[null,null,null,null,null,null,null,"LIMA LIMA PUNTA NEGRA",{"$f":"IF(AND(ING!$D$21=J1397,ING!$V$21=K1397),I1396+1,0)","v":0},"LIMA","LIMA","PUNTA NEGRA","150127"]
[null,null,null,null,null,null,null,"LIMA LIMA RIMAC",{"$f":"IF(AND(ING!$D$21=J1398,ING!$V$21=K1398),I1397+1,0)","v":0},"LIMA","LIMA","RIMAC","150128"]
[null,null,null,null,null,null,null,"LIMA LIMA SAN BARTOLO",{"$f":"IF(AND(ING!$D$21=J1399,ING!$V$21=K1399),I1398+1,0)","v":0},"LIMA","LIMA","SAN BARTOLO","150129"]
[null,null,null,null,null,null,null,"LIMA LIMA SAN BORJA",{"$f":"IF(AND(ING!$D$21=J1400,ING!$V$21=K1400),I1399+1,0)","v":0},"LIMA","LIMA","SAN BORJA","150130"]
[null,null,null,null,null,null,null,"LIMA LIMA SAN ISIDRO",{"$f":"IF(AND(ING!$D$21=J1401,ING!$V$21=K1401),I1400+1,0)","v":0},"LIMA","LIMA","SAN ISIDRO","150131"]
[null,null,null,null,null,null,null,"LIMA LIMA SAN JUAN DE LURIGANCHO",{"$f":"IF(AND(ING!$D$21=J1402,ING!$V$21=K1402),I1401+1,0)","v":0},"LIMA","LIMA","SAN JUAN DE LURIGANCHO","150132"]
[null,null,null,null,null,null,null,"LIMA LIMA SAN JUAN DE MIRAFLORES",{"$f":"IF(AND(ING!$D$21=J1403,ING!$V$21=K1403),I1402+1,0)","v":0},"LIMA","LIMA","SAN JUAN DE MIRAFLORES","150133"]
[null,null,null,null,null,null,null,"LIMA LIMA SAN LUIS",{"$f":"IF(AND(ING!$D$21=J1404,ING!$V$21=K1404),I1403+1,0)","v":0},"LIMA","LIMA","SAN LUIS","150134"]
[null,null,null,null,null,null,null,"LIMA LIMA SAN MARTIN DE PORRES",{"$f":"IF(AND(ING!$D$21=J1405,ING!$V$21=K1405),I1404+1,0)","v":0},"LIMA","LIMA","SAN MARTIN DE PORRES","150135"]
[null,null,null,null,null,null,null,"LIMA LIMA SAN MIGUEL",{"$f":"IF(AND(ING!$D$21=J1406,ING!$V$21=K1406),I1405+1,0)","v":0},"LIMA","LIMA","SAN MIGUEL","150136"]
[null,null,null,null,null,null,null,"LIMA LIMA SANTA ANITA",{"$f":"IF(AND(ING!$D$21=J1407,ING!$V$21=K1407),I1406+1,0)","v":0},"LIMA","LIMA","SANTA ANITA","150137"]
[null,null,null,null,null,null,null,"LIMA LIMA SANTA MARIA DEL MAR",{"$f":"IF(AND(ING!$D$21=J1408,ING!$V$21=K1408),I1407+1,0)","v":0},"LIMA","LIMA","SANTA MARIA DEL MAR","150138"]
[null,null,null,null,null,null,null,"LIMA LIMA SANTA ROSA",{"$f":"IF(AND(ING!$D$21=J1409,ING!$V$21=K1409),I1408+1,0)","v":0},"LIMA","LIMA","SANTA ROSA","150139"]
[null,null,null,null,null,null,null,"LIMA LIMA SANTIAGO DE SURCO",{"$f":"IF(AND(ING!$D$21=J1410,ING!$V$21=K1410),I1409+1,0)","v":0},"LIMA","LIMA","SANTIAGO DE SURCO","150140"]
[null,null,null,null,null,null,null,{"$f":"J1411&\" \"&K1411&\" \"&L1411","v":"LIMA LIMA SURQUILLO"},{"$f":"IF(AND(ING!$D$21=J1411,ING!$V$21=K1411),I1410+1,0)","v":0},"LIMA","LIMA","SURQUILLO","150141"]
[null,null,null,null,null,null,null,"LIMA LIMA VILLA EL SALVADOR",{"$f":"IF(AND(ING!$D$21=J1412,ING!$V$21=K1412),I1411+1,0)","v":0},"LIMA","LIMA","VILLA EL SALVADOR","150142"]
[null,null,null,null,null,null,null,"LIMA LIMA VILLA MARIA DEL TRIUNFO",{"$f":"IF(AND(ING!$D$21=J1413,ING!$V$21=K1413),I1412+1,0)","v":0},"LIMA","LIMA","VILLA MARIA DEL TRIUNFO","150143"]
[null,null,null,null,null,null,null,"LIMA OYON ANDAJES",{"$f":"IF(AND(ING!$D$21=J1414,ING!$V$21=K1414),I1413+1,0)","v":0},"LIMA","OYON","ANDAJES","150902"]
[null,null,null,null,null,null,null,"LIMA OYON CAUJUL",{"$f":"IF(AND(ING!$D$21=J1415,ING!$V$21=K1415),I1414+1,0)","v":0},"LIMA","OYON","CAUJUL","150903"]
[null,null,null,null,null,null,null,"LIMA OYON COCHAMARCA",{"$f":"IF(AND(ING!$D$21=J1416,ING!$V$21=K1416),I1415+1,0)","v":0},"LIMA","OYON","COCHAMARCA","150904"]
[null,null,null,null,null,null,null,"LIMA OYON NAVAN",{"$f":"IF(AND(ING!$D$21=J1417,ING!$V$21=K1417),I1416+1,0)","v":0},"LIMA","OYON","NAVAN","150905"]
[null,null,null,null,null,null,null,"LIMA OYON OYON",{"$f":"IF(AND(ING!$D$21=J1418,ING!$V$21=K1418),I1417+1,0)","v":0},"LIMA","OYON","OYON","150901"]
[null,null,null,null,null,null,null,"LIMA OYON PACHANGARA",{"$f":"IF(AND(ING!$D$21=J1419,ING!$V$21=K1419),I1418+1,0)","v":0},"LIMA","OYON","PACHANGARA","150906"]
[null,null,null,null,null,null,null,"LIMA YAUYOS ALIS",{"$f":"IF(AND(ING!$D$21=J1420,ING!$V$21=K1420),I1419+1,0)","v":0},"LIMA","YAUYOS","ALIS","151002"]
[null,null,null,null,null,null,null,"LIMA YAUYOS ALLAUCA",{"$f":"IF(AND(ING!$D$21=J1421,ING!$V$21=K1421),I1420+1,0)","v":0},"LIMA","YAUYOS","ALLAUCA","151003"]
[null,null,null,null,null,null,null,"LIMA YAUYOS AYAVIRI",{"$f":"IF(AND(ING!$D$21=J1422,ING!$V$21=K1422),I1421+1,0)","v":0},"LIMA","YAUYOS","AYAVIRI","151004"]
[null,null,null,null,null,null,null,"LIMA YAUYOS AZANGARO",{"$f":"IF(AND(ING!$D$21=J1423,ING!$V$21=K1423),I1422+1,0)","v":0},"LIMA","YAUYOS","AZANGARO","151005"]
[null,null,null,null,null,null,null,"LIMA YAUYOS CACRA",{"$f":"IF(AND(ING!$D$21=J1424,ING!$V$21=K1424),I1423+1,0)","v":0},"LIMA","YAUYOS","CACRA","151006"]
[null,null,null,null,null,null,null,"LIMA YAUYOS CARANIA",{"$f":"IF(AND(ING!$D$21=J1425,ING!$V$21=K1425),I1424+1,0)","v":0},"LIMA","YAUYOS","CARANIA","151007"]
[null,null,null,null,null,null,null,"LIMA YAUYOS CATAHUASI",{"$f":"IF(AND(ING!$D$21=J1426,ING!$V$21=K1426),I1425+1,0)","v":0},"LIMA","YAUYOS","CATAHUASI","151008"]
[null,null,null,null,null,null,null,"LIMA YAUYOS CHOCOS",{"$f":"IF(AND(ING!$D$21=J1427,ING!$V$21=K1427),I1426+1,0)","v":0},"LIMA","YAUYOS","CHOCOS","151009"]
[null,null,null,null,null,null,null,"LIMA YAUYOS COCHAS",{"$f":"IF(AND(ING!$D$21=J1428,ING!$V$21=K1428),I1427+1,0)","v":0},"LIMA","YAUYOS","COCHAS","151010"]
[null,null,null,null,null,null,null,"LIMA YAUYOS COLONIA",{"$f":"IF(AND(ING!$D$21=J1429,ING!$V$21=K1429),I1428+1,0)","v":0},"LIMA","YAUYOS","COLONIA","151011"]
[null,null,null,null,null,null,null,"LIMA YAUYOS HONGOS",{"$f":"IF(AND(ING!$D$21=J1430,ING!$V$21=K1430),I1429+1,0)","v":0},"LIMA","YAUYOS","HONGOS","151012"]
[null,null,null,null,null,null,null,"LIMA YAUYOS HUAMPARA",{"$f":"IF(AND(ING!$D$21=J1431,ING!$V$21=K1431),I1430+1,0)","v":0},"LIMA","YAUYOS","HUAMPARA","151013"]
[null,null,null,null,null,null,null,"LIMA YAUYOS HUANCAYA",{"$f":"IF(AND(ING!$D$21=J1432,ING!$V$21=K1432),I1431+1,0)","v":0},"LIMA","YAUYOS","HUANCAYA","151014"]
[null,null,null,null,null,null,null,"LIMA YAUYOS HUANGASCAR",{"$f":"IF(AND(ING!$D$21=J1433,ING!$V$21=K1433),I1432+1,0)","v":0},"LIMA","YAUYOS","HUANGASCAR","151015"]
[null,null,null,null,null,null,null,"LIMA YAUYOS HUANTAN",{"$f":"IF(AND(ING!$D$21=J1434,ING!$V$21=K1434),I1433+1,0)","v":0},"LIMA","YAUYOS","HUANTAN","151016"]
[null,null,null,null,null,null,null,"LIMA YAUYOS HUAÑEC",{"$f":"IF(AND(ING!$D$21=J1435,ING!$V$21=K1435),I1434+1,0)","v":0},"LIMA","YAUYOS","HUAÑEC","151017"]
[null,null,null,null,null,null,null,"LIMA YAUYOS LARAOS",{"$f":"IF(AND(ING!$D$21=J1436,ING!$V$21=K1436),I1435+1,0)","v":0},"LIMA","YAUYOS","LARAOS","151018"]
[null,null,null,null,null,null,null,"LIMA YAUYOS LINCHA",{"$f":"IF(AND(ING!$D$21=J1437,ING!$V$21=K1437),I1436+1,0)","v":0},"LIMA","YAUYOS","LINCHA","151019"]
[null,null,null,null,null,null,null,"LIMA YAUYOS MADEAN",{"$f":"IF(AND(ING!$D$21=J1438,ING!$V$21=K1438),I1437+1,0)","v":0},"LIMA","YAUYOS","MADEAN","151020"]
[null,null,null,null,null,null,null,"LIMA YAUYOS MIRAFLORES",{"$f":"IF(AND(ING!$D$21=J1439,ING!$V$21=K1439),I1438+1,0)","v":0},"LIMA","YAUYOS","MIRAFLORES","151021"]
[null,null,null,null,null,null,null,"LIMA YAUYOS OMAS",{"$f":"IF(AND(ING!$D$21=J1440,ING!$V$21=K1440),I1439+1,0)","v":0},"LIMA","YAUYOS","OMAS","151022"]
[null,null,null,null,null,null,null,"LIMA YAUYOS PUTINZA",{"$f":"IF(AND(ING!$D$21=J1441,ING!$V$21=K1441),I1440+1,0)","v":0},"LIMA","YAUYOS","PUTINZA","151023"]
[null,null,null,null,null,null,null,"LIMA YAUYOS QUINCHES",{"$f":"IF(AND(ING!$D$21=J1442,ING!$V$21=K1442),I1441+1,0)","v":0},"LIMA","YAUYOS","QUINCHES","151024"]
[null,null,null,null,null,null,null,"LIMA YAUYOS QUINOCAY",{"$f":"IF(AND(ING!$D$21=J1443,ING!$V$21=K1443),I1442+1,0)","v":0},"LIMA","YAUYOS","QUINOCAY","151025"]
[null,null,null,null,null,null,null,"LIMA YAUYOS SAN JOAQUIN",{"$f":"IF(AND(ING!$D$21=J1444,ING!$V$21=K1444),I1443+1,0)","v":0},"LIMA","YAUYOS","SAN JOAQUIN","151026"]
[null,null,null,null,null,null,null,"LIMA YAUYOS SAN PEDRO DE PILAS",{"$f":"IF(AND(ING!$D$21=J1445,ING!$V$21=K1445),I1444+1,0)","v":0},"LIMA","YAUYOS","SAN PEDRO DE PILAS","151027"]
[null,null,null,null,null,null,null,"LIMA YAUYOS TANTA",{"$f":"IF(AND(ING!$D$21=J1446,ING!$V$21=K1446),I1445+1,0)","v":0},"LIMA","YAUYOS","TANTA","151028"]
[null,null,null,null,null,null,null,"LIMA YAUYOS TAURIPAMPA",{"$f":"IF(AND(ING!$D$21=J1447,ING!$V$21=K1447),I1446+1,0)","v":0},"LIMA","YAUYOS","TAURIPAMPA","151029"]
[null,null,null,null,null,null,null,"LIMA YAUYOS TOMAS",{"$f":"IF(AND(ING!$D$21=J1448,ING!$V$21=K1448),I1447+1,0)","v":0},"LIMA","YAUYOS","TOMAS","151030"]
[null,null,null,null,null,null,null,"LIMA YAUYOS TUPE",{"$f":"IF(AND(ING!$D$21=J1449,ING!$V$21=K1449),I1448+1,0)","v":0},"LIMA","YAUYOS","TUPE","151031"]
[null,null,null,null,null,null,null,"LIMA YAUYOS VIÑAC",{"$f":"IF(AND(ING!$D$21=J1450,ING!$V$21=K1450),I1449+1,0)","v":0},"LIMA","YAUYOS","VIÑAC","151032"]
[null,null,null,null,null,null,null,"LIMA YAUYOS VITIS",{"$f":"IF(AND(ING!$D$21=J1451,ING!$V$21=K1451),I1450+1,0)","v":0},"LIMA","YAUYOS","VITIS","151033"]
[null,null,null,null,null,null,null,"LIMA YAUYOS YAUYOS",{"$f":"IF(AND(ING!$D$21=J1452,ING!$V$21=K1452),I1451+1,0)","v":0},"LIMA","YAUYOS","YAUYOS","151001"]
[null,null,null,null,null,null,null,"LORETO ALTO AMAZONAS BALSAPUERTO",{"$f":"IF(AND(ING!$D$21=J1453,ING!$V$21=K1453),I1452+1,0)","v":0},"LORETO","ALTO AMAZONAS","BALSAPUERTO","160202"]
[null,null,null,null,null,null,null,"LORETO ALTO AMAZONAS JEBEROS",{"$f":"IF(AND(ING!$D$21=J1454,ING!$V$21=K1454),I1453+1,0)","v":0},"LORETO","ALTO AMAZONAS","JEBEROS","160205"]
[null,null,null,null,null,null,null,"LORETO ALTO AMAZONAS LAGUNAS",{"$f":"IF(AND(ING!$D$21=J1455,ING!$V$21=K1455),I1454+1,0)","v":0},"LORETO","ALTO AMAZONAS","LAGUNAS","160206"]
[null,null,null,null,null,null,null,"LORETO ALTO AMAZONAS SANTA CRUZ",{"$f":"IF(AND(ING!$D$21=J1456,ING!$V$21=K1456),I1455+1,0)","v":0},"LORETO","ALTO AMAZONAS","SANTA CRUZ","160210"]
[null,null,null,null,null,null,null,"LORETO ALTO AMAZONAS TENIENTE CESAR LOPEZ ROJAS",{"$f":"IF(AND(ING!$D$21=J1457,ING!$V$21=K1457),I1456+1,0)","v":0},"LORETO","ALTO AMAZONAS","TENIENTE CESAR LOPEZ ROJAS","160211"]
[null,null,null,null,null,null,null,"LORETO ALTO AMAZONAS YURIMAGUAS",{"$f":"IF(AND(ING!$D$21=J1458,ING!$V$21=K1458),I1457+1,0)","v":0},"LORETO","ALTO AMAZONAS","YURIMAGUAS","160201"]
[null,null,null,null,null,null,null,"LORETO DATEM DEL MARAÑON ANDOAS",{"$f":"IF(AND(ING!$D$21=J1459,ING!$V$21=K1459),I1458+1,0)","v":0},"LORETO","DATEM DEL MARAÑON","ANDOAS","160706"]
[null,null,null,null,null,null,null,"LORETO DATEM DEL MARAÑON BARRANCA",{"$f":"IF(AND(ING!$D$21=J1460,ING!$V$21=K1460),I1459+1,0)","v":0},"LORETO","DATEM DEL MARAÑON","BARRANCA","160701"]
[null,null,null,null,null,null,null,"LORETO DATEM DEL MARAÑON CAHUAPANAS",{"$f":"IF(AND(ING!$D$21=J1461,ING!$V$21=K1461),I1460+1,0)","v":0},"LORETO","DATEM DEL MARAÑON","CAHUAPANAS","160702"]
[null,null,null,null,null,null,null,"LORETO DATEM DEL MARAÑON MANSERICHE",{"$f":"IF(AND(ING!$D$21=J1462,ING!$V$21=K1462),I1461+1,0)","v":0},"LORETO","DATEM DEL MARAÑON","MANSERICHE","160703"]
[null,null,null,null,null,null,null,"LORETO DATEM DEL MARAÑON MORONA",{"$f":"IF(AND(ING!$D$21=J1463,ING!$V$21=K1463),I1462+1,0)","v":0},"LORETO","DATEM DEL MARAÑON","MORONA","160704"]
[null,null,null,null,null,null,null,"LORETO DATEM DEL MARAÑON PASTAZA",{"$f":"IF(AND(ING!$D$21=J1464,ING!$V$21=K1464),I1463+1,0)","v":0},"LORETO","DATEM DEL MARAÑON","PASTAZA","160705"]
[null,null,null,null,null,null,null,"LORETO LORETO NAUTA",{"$f":"IF(AND(ING!$D$21=J1465,ING!$V$21=K1465),I1464+1,0)","v":0},"LORETO","LORETO","NAUTA","160301"]
[null,null,null,null,null,null,null,"LORETO LORETO PARINARI",{"$f":"IF(AND(ING!$D$21=J1466,ING!$V$21=K1466),I1465+1,0)","v":0},"LORETO","LORETO","PARINARI","160302"]
[null,null,null,null,null,null,null,"LORETO LORETO TIGRE",{"$f":"IF(AND(ING!$D$21=J1467,ING!$V$21=K1467),I1466+1,0)","v":0},"LORETO","LORETO","TIGRE","160303"]
[null,null,null,null,null,null,null,"LORETO LORETO TROMPETEROS",{"$f":"IF(AND(ING!$D$21=J1468,ING!$V$21=K1468),I1467+1,0)","v":0},"LORETO","LORETO","TROMPETEROS","160304"]
[null,null,null,null,null,null,null,"LORETO LORETO URARINAS",{"$f":"IF(AND(ING!$D$21=J1469,ING!$V$21=K1469),I1468+1,0)","v":0},"LORETO","LORETO","URARINAS","160305"]
[null,null,null,null,null,null,null,"LORETO MARISCAL RAMON CASTILLA PEBAS",{"$f":"IF(AND(ING!$D$21=J1470,ING!$V$21=K1470),I1469+1,0)","v":0},"LORETO","MARISCAL RAMON CASTILLA","PEBAS","160402"]
[null,null,null,null,null,null,null,"LORETO MARISCAL RAMON CASTILLA RAMON CASTILLA",{"$f":"IF(AND(ING!$D$21=J1471,ING!$V$21=K1471),I1470+1,0)","v":0},"LORETO","MARISCAL RAMON CASTILLA","RAMON CASTILLA","160401"]
[null,null,null,null,null,null,null,"LORETO MARISCAL RAMON CASTILLA SAN PABLO",{"$f":"IF(AND(ING!$D$21=J1472,ING!$V$21=K1472),I1471+1,0)","v":0},"LORETO","MARISCAL RAMON CASTILLA","SAN PABLO","160404"]
[null,null,null,null,null,null,null,"LORETO MARISCAL RAMON CASTILLA YAVARI",{"$f":"IF(AND(ING!$D$21=J1473,ING!$V$21=K1473),I1472+1,0)","v":0},"LORETO","MARISCAL RAMON CASTILLA","YAVARI","160403"]
[null,null,null,null,null,null,null,"LORETO MAYNAS ALTO NANAY",{"$f":"IF(AND(ING!$D$21=J1474,ING!$V$21=K1474),I1473+1,0)","v":0},"LORETO","MAYNAS","ALTO NANAY","160102"]
[null,null,null,null,null,null,null,{"$f":"J1475&\" \"&K1475&\" \"&L1475","v":"LORETO MAYNAS BELEN"},{"$f":"IF(AND(ING!$D$21=J1475,ING!$V$21=K1475),I1474+1,0)","v":0},"LORETO","MAYNAS","BELEN","160112"]
[null,null,null,null,null,null,null,"LORETO MAYNAS FERNANDO LORES",{"$f":"IF(AND(ING!$D$21=J1476,ING!$V$21=K1476),I1475+1,0)","v":0},"LORETO","MAYNAS","FERNANDO LORES","160103"]
[null,null,null,null,null,null,null,"LORETO MAYNAS INDIANA",{"$f":"IF(AND(ING!$D$21=J1477,ING!$V$21=K1477),I1476+1,0)","v":0},"LORETO","MAYNAS","INDIANA","160104"]
[null,null,null,null,null,null,null,"LORETO MAYNAS IQUITOS",{"$f":"IF(AND(ING!$D$21=J1478,ING!$V$21=K1478),I1477+1,0)","v":0},"LORETO","MAYNAS","IQUITOS","160101"]
[null,null,null,null,null,null,null,"LORETO MAYNAS LAS AMAZONAS",{"$f":"IF(AND(ING!$D$21=J1479,ING!$V$21=K1479),I1478+1,0)","v":0},"LORETO","MAYNAS","LAS AMAZONAS","160105"]
[null,null,null,null,null,null,null,"LORETO MAYNAS MAZAN",{"$f":"IF(AND(ING!$D$21=J1480,ING!$V$21=K1480),I1479+1,0)","v":0},"LORETO","MAYNAS","MAZAN","160106"]
[null,null,null,null,null,null,null,"LORETO MAYNAS NAPO",{"$f":"IF(AND(ING!$D$21=J1481,ING!$V$21=K1481),I1480+1,0)","v":0},"LORETO","MAYNAS","NAPO","160107"]
[null,null,null,null,null,null,null,"LORETO MAYNAS PUNCHANA",{"$f":"IF(AND(ING!$D$21=J1482,ING!$V$21=K1482),I1481+1,0)","v":0},"LORETO","MAYNAS","PUNCHANA","160108"]
[null,null,null,null,null,null,null,"LORETO MAYNAS SAN JUAN BAUTISTA",{"$f":"IF(AND(ING!$D$21=J1483,ING!$V$21=K1483),I1482+1,0)","v":0},"LORETO","MAYNAS","SAN JUAN BAUTISTA","160113"]
[null,null,null,null,null,null,null,"LORETO MAYNAS TORRES CAUSANA",{"$f":"IF(AND(ING!$D$21=J1484,ING!$V$21=K1484),I1483+1,0)","v":0},"LORETO","MAYNAS","TORRES CAUSANA","160110"]
[null,null,null,null,null,null,null,"LORETO PUTUMAYO PUTUMAYO",{"$f":"IF(AND(ING!$D$21=J1485,ING!$V$21=K1485),I1484+1,0)","v":0},"LORETO","PUTUMAYO","PUTUMAYO","160801"]
[null,null,null,null,null,null,null,"LORETO PUTUMAYO ROSA PANDURO",{"$f":"IF(AND(ING!$D$21=J1486,ING!$V$21=K1486),I1485+1,0)","v":0},"LORETO","PUTUMAYO","ROSA PANDURO","160802"]
[null,null,null,null,null,null,null,"LORETO PUTUMAYO TENIENTE MANUEL CLAVERO",{"$f":"IF(AND(ING!$D$21=J1487,ING!$V$21=K1487),I1486+1,0)","v":0},"LORETO","PUTUMAYO","TENIENTE MANUEL CLAVERO","160803"]
[null,null,null,null,null,null,null,"LORETO PUTUMAYO YAGUAS",{"$f":"IF(AND(ING!$D$21=J1488,ING!$V$21=K1488),I1487+1,0)","v":0},"LORETO","PUTUMAYO","YAGUAS","160804"]
[null,null,null,null,null,null,null,"LORETO REQUENA ALTO TAPICHE",{"$f":"IF(AND(ING!$D$21=J1489,ING!$V$21=K1489),I1488+1,0)","v":0},"LORETO","REQUENA","ALTO TAPICHE","160502"]
[null,null,null,null,null,null,null,"LORETO REQUENA CAPELO",{"$f":"IF(AND(ING!$D$21=J1490,ING!$V$21=K1490),I1489+1,0)","v":0},"LORETO","REQUENA","CAPELO","160503"]
[null,null,null,null,null,null,null,"LORETO REQUENA EMILIO SAN MARTIN",{"$f":"IF(AND(ING!$D$21=J1491,ING!$V$21=K1491),I1490+1,0)","v":0},"LORETO","REQUENA","EMILIO SAN MARTIN","160504"]
[null,null,null,null,null,null,null,"LORETO REQUENA JENARO HERRERA",{"$f":"IF(AND(ING!$D$21=J1492,ING!$V$21=K1492),I1491+1,0)","v":0},"LORETO","REQUENA","JENARO HERRERA","160510"]
[null,null,null,null,null,null,null,"LORETO REQUENA MAQUIA",{"$f":"IF(AND(ING!$D$21=J1493,ING!$V$21=K1493),I1492+1,0)","v":0},"LORETO","REQUENA","MAQUIA","160505"]
[null,null,null,null,null,null,null,"LORETO REQUENA PUINAHUA",{"$f":"IF(AND(ING!$D$21=J1494,ING!$V$21=K1494),I1493+1,0)","v":0},"LORETO","REQUENA","PUINAHUA","160506"]
[null,null,null,null,null,null,null,"LORETO REQUENA REQUENA",{"$f":"IF(AND(ING!$D$21=J1495,ING!$V$21=K1495),I1494+1,0)","v":0},"LORETO","REQUENA","REQUENA","160501"]
[null,null,null,null,null,null,null,"LORETO REQUENA SAQUENA",{"$f":"IF(AND(ING!$D$21=J1496,ING!$V$21=K1496),I1495+1,0)","v":0},"LORETO","REQUENA","SAQUENA","160507"]
[null,null,null,null,null,null,null,"LORETO REQUENA SOPLIN",{"$f":"IF(AND(ING!$D$21=J1497,ING!$V$21=K1497),I1496+1,0)","v":0},"LORETO","REQUENA","SOPLIN","160508"]
[null,null,null,null,null,null,null,"LORETO REQUENA TAPICHE",{"$f":"IF(AND(ING!$D$21=J1498,ING!$V$21=K1498),I1497+1,0)","v":0},"LORETO","REQUENA","TAPICHE","160509"]
[null,null,null,null,null,null,null,"LORETO REQUENA YAQUERANA",{"$f":"IF(AND(ING!$D$21=J1499,ING!$V$21=K1499),I1498+1,0)","v":0},"LORETO","REQUENA","YAQUERANA","160511"]
[null,null,null,null,null,null,null,"LORETO UCAYALI CONTAMANA",{"$f":"IF(AND(ING!$D$21=J1500,ING!$V$21=K1500),I1499+1,0)","v":0},"LORETO","UCAYALI","CONTAMANA","160601"]
[null,null,null,null,null,null,null,"LORETO UCAYALI INAHUAYA",{"$f":"IF(AND(ING!$D$21=J1501,ING!$V$21=K1501),I1500+1,0)","v":0},"LORETO","UCAYALI","INAHUAYA","160602"]
[null,null,null,null,null,null,null,"LORETO UCAYALI PADRE MARQUEZ",{"$f":"IF(AND(ING!$D$21=J1502,ING!$V$21=K1502),I1501+1,0)","v":0},"LORETO","UCAYALI","PADRE MARQUEZ","160603"]
[null,null,null,null,null,null,null,"LORETO UCAYALI PAMPA HERMOSA",{"$f":"IF(AND(ING!$D$21=J1503,ING!$V$21=K1503),I1502+1,0)","v":0},"LORETO","UCAYALI","PAMPA HERMOSA","160604"]
[null,null,null,null,null,null,null,"LORETO UCAYALI SARAYACU",{"$f":"IF(AND(ING!$D$21=J1504,ING!$V$21=K1504),I1503+1,0)","v":0},"LORETO","UCAYALI","SARAYACU","160605"]
[null,null,null,null,null,null,null,"LORETO UCAYALI VARGAS GUERRA",{"$f":"IF(AND(ING!$D$21=J1505,ING!$V$21=K1505),I1504+1,0)","v":0},"LORETO","UCAYALI","VARGAS GUERRA","160606"]
[null,null,null,null,null,null,null,"MADRE DE DIOS MANU FITZCARRALD",{"$f":"IF(AND(ING!$D$21=J1506,ING!$V$21=K1506),I1505+1,0)","v":0},"MADRE DE DIOS","MANU","FITZCARRALD","170202"]
[null,null,null,null,null,null,null,"MADRE DE DIOS MANU HUEPETUHE",{"$f":"IF(AND(ING!$D$21=J1507,ING!$V$21=K1507),I1506+1,0)","v":0},"MADRE DE DIOS","MANU","HUEPETUHE","170204"]
[null,null,null,null,null,null,null,"MADRE DE DIOS MANU MADRE DE DIOS",{"$f":"IF(AND(ING!$D$21=J1508,ING!$V$21=K1508),I1507+1,0)","v":0},"MADRE DE DIOS","MANU","MADRE DE DIOS","170203"]
[null,null,null,null,null,null,null,"MADRE DE DIOS MANU MANU",{"$f":"IF(AND(ING!$D$21=J1509,ING!$V$21=K1509),I1508+1,0)","v":0},"MADRE DE DIOS","MANU","MANU","170201"]
[null,null,null,null,null,null,null,"MADRE DE DIOS TAHUAMANU IBERIA",{"$f":"IF(AND(ING!$D$21=J1510,ING!$V$21=K1510),I1509+1,0)","v":0},"MADRE DE DIOS","TAHUAMANU","IBERIA","170302"]
[null,null,null,null,null,null,null,"MADRE DE DIOS TAHUAMANU IÑAPARI",{"$f":"IF(AND(ING!$D$21=J1511,ING!$V$21=K1511),I1510+1,0)","v":0},"MADRE DE DIOS","TAHUAMANU","IÑAPARI","170301"]
[null,null,null,null,null,null,null,"MADRE DE DIOS TAHUAMANU TAHUAMANU",{"$f":"IF(AND(ING!$D$21=J1512,ING!$V$21=K1512),I1511+1,0)","v":0},"MADRE DE DIOS","TAHUAMANU","TAHUAMANU","170303"]
[null,null,null,null,null,null,null,"MADRE DE DIOS TAMBOPATA INAMBARI",{"$f":"IF(AND(ING!$D$21=J1513,ING!$V$21=K1513),I1512+1,0)","v":0},"MADRE DE DIOS","TAMBOPATA","INAMBARI","170102"]
[null,null,null,null,null,null,null,"MADRE DE DIOS TAMBOPATA LABERINTO",{"$f":"IF(AND(ING!$D$21=J1514,ING!$V$21=K1514),I1513+1,0)","v":0},"MADRE DE DIOS","TAMBOPATA","LABERINTO","170104"]
[null,null,null,null,null,null,null,"MADRE DE DIOS TAMBOPATA LAS PIEDRAS",{"$f":"IF(AND(ING!$D$21=J1515,ING!$V$21=K1515),I1514+1,0)","v":0},"MADRE DE DIOS","TAMBOPATA","LAS PIEDRAS","170103"]
[null,null,null,null,null,null,null,"MADRE DE DIOS TAMBOPATA TAMBOPATA",{"$f":"IF(AND(ING!$D$21=J1516,ING!$V$21=K1516),I1515+1,0)","v":0},"MADRE DE DIOS","TAMBOPATA","TAMBOPATA","170101"]
[null,null,null,null,null,null,null,"MOQUEGUA GENERAL SANCHEZ CERRO CHOJATA",{"$f":"IF(AND(ING!$D$21=J1517,ING!$V$21=K1517),I1516+1,0)","v":0},"MOQUEGUA","GENERAL SANCHEZ CERRO","CHOJATA","180202"]
[null,null,null,null,null,null,null,"MOQUEGUA GENERAL SANCHEZ CERRO COALAQUE",{"$f":"IF(AND(ING!$D$21=J1518,ING!$V$21=K1518),I1517+1,0)","v":0},"MOQUEGUA","GENERAL SANCHEZ CERRO","COALAQUE","180203"]
[null,null,null,null,null,null,null,"MOQUEGUA GENERAL SANCHEZ CERRO ICHUÑA",{"$f":"IF(AND(ING!$D$21=J1519,ING!$V$21=K1519),I1518+1,0)","v":0},"MOQUEGUA","GENERAL SANCHEZ CERRO","ICHUÑA","180204"]
[null,null,null,null,null,null,null,"MOQUEGUA GENERAL SANCHEZ CERRO LA CAPILLA",{"$f":"IF(AND(ING!$D$21=J1520,ING!$V$21=K1520),I1519+1,0)","v":0},"MOQUEGUA","GENERAL SANCHEZ CERRO","LA CAPILLA","180205"]
[null,null,null,null,null,null,null,"MOQUEGUA GENERAL SANCHEZ CERRO LLOQUE",{"$f":"IF(AND(ING!$D$21=J1521,ING!$V$21=K1521),I1520+1,0)","v":0},"MOQUEGUA","GENERAL SANCHEZ CERRO","LLOQUE","180206"]
[null,null,null,null,null,null,null,"MOQUEGUA GENERAL SANCHEZ CERRO MATALAQUE",{"$f":"IF(AND(ING!$D$21=J1522,ING!$V$21=K1522),I1521+1,0)","v":0},"MOQUEGUA","GENERAL SANCHEZ CERRO","MATALAQUE","180207"]
[null,null,null,null,null,null,null,"MOQUEGUA GENERAL SANCHEZ CERRO OMATE",{"$f":"IF(AND(ING!$D$21=J1523,ING!$V$21=K1523),I1522+1,0)","v":0},"MOQUEGUA","GENERAL SANCHEZ CERRO","OMATE","180201"]
[null,null,null,null,null,null,null,"MOQUEGUA GENERAL SANCHEZ CERRO PUQUINA",{"$f":"IF(AND(ING!$D$21=J1524,ING!$V$21=K1524),I1523+1,0)","v":0},"MOQUEGUA","GENERAL SANCHEZ CERRO","PUQUINA","180208"]
[null,null,null,null,null,null,null,"MOQUEGUA GENERAL SANCHEZ CERRO QUINISTAQUILLAS",{"$f":"IF(AND(ING!$D$21=J1525,ING!$V$21=K1525),I1524+1,0)","v":0},"MOQUEGUA","GENERAL SANCHEZ CERRO","QUINISTAQUILLAS","180209"]
[null,null,null,null,null,null,null,"MOQUEGUA GENERAL SANCHEZ CERRO UBINAS",{"$f":"IF(AND(ING!$D$21=J1526,ING!$V$21=K1526),I1525+1,0)","v":0},"MOQUEGUA","GENERAL SANCHEZ CERRO","UBINAS","180210"]
[null,null,null,null,null,null,null,"MOQUEGUA GENERAL SANCHEZ CERRO YUNGA",{"$f":"IF(AND(ING!$D$21=J1527,ING!$V$21=K1527),I1526+1,0)","v":0},"MOQUEGUA","GENERAL SANCHEZ CERRO","YUNGA","180211"]
[null,null,null,null,null,null,null,"MOQUEGUA ILO EL ALGARROBAL",{"$f":"IF(AND(ING!$D$21=J1528,ING!$V$21=K1528),I1527+1,0)","v":0},"MOQUEGUA","ILO","EL ALGARROBAL","180302"]
[null,null,null,null,null,null,null,"MOQUEGUA ILO ILO",{"$f":"IF(AND(ING!$D$21=J1529,ING!$V$21=K1529),I1528+1,0)","v":0},"MOQUEGUA","ILO","ILO","180301"]
[null,null,null,null,null,null,null,"MOQUEGUA ILO PACOCHA",{"$f":"IF(AND(ING!$D$21=J1530,ING!$V$21=K1530),I1529+1,0)","v":0},"MOQUEGUA","ILO","PACOCHA","180303"]
[null,null,null,null,null,null,null,"MOQUEGUA MARISCAL NIETO CARUMAS",{"$f":"IF(AND(ING!$D$21=J1531,ING!$V$21=K1531),I1530+1,0)","v":0},"MOQUEGUA","MARISCAL NIETO","CARUMAS","180102"]
[null,null,null,null,null,null,null,"MOQUEGUA MARISCAL NIETO CUCHUMBAYA",{"$f":"IF(AND(ING!$D$21=J1532,ING!$V$21=K1532),I1531+1,0)","v":0},"MOQUEGUA","MARISCAL NIETO","CUCHUMBAYA","180103"]
[null,null,null,null,null,null,null,"MOQUEGUA MARISCAL NIETO MOQUEGUA",{"$f":"IF(AND(ING!$D$21=J1533,ING!$V$21=K1533),I1532+1,0)","v":0},"MOQUEGUA","MARISCAL NIETO","MOQUEGUA","180101"]
[null,null,null,null,null,null,null,"MOQUEGUA MARISCAL NIETO SAMEGUA",{"$f":"IF(AND(ING!$D$21=J1534,ING!$V$21=K1534),I1533+1,0)","v":0},"MOQUEGUA","MARISCAL NIETO","SAMEGUA","180104"]
[null,null,null,null,null,null,null,"MOQUEGUA MARISCAL NIETO SAN CRISTOBAL",{"$f":"IF(AND(ING!$D$21=J1535,ING!$V$21=K1535),I1534+1,0)","v":0},"MOQUEGUA","MARISCAL NIETO","SAN CRISTOBAL","180105"]
[null,null,null,null,null,null,null,"MOQUEGUA MARISCAL NIETO TORATA",{"$f":"IF(AND(ING!$D$21=J1536,ING!$V$21=K1536),I1535+1,0)","v":0},"MOQUEGUA","MARISCAL NIETO","TORATA","180106"]
[null,null,null,null,null,null,null,"PASCO DANIEL ALCIDES CARRION CHACAYAN",{"$f":"IF(AND(ING!$D$21=J1537,ING!$V$21=K1537),I1536+1,0)","v":0},"PASCO","DANIEL ALCIDES CARRION","CHACAYAN","190202"]
[null,null,null,null,null,null,null,"PASCO DANIEL ALCIDES CARRION GOYLLARISQUIZGA",{"$f":"IF(AND(ING!$D$21=J1538,ING!$V$21=K1538),I1537+1,0)","v":0},"PASCO","DANIEL ALCIDES CARRION","GOYLLARISQUIZGA","190203"]
[null,null,null,null,null,null,null,{"$f":"J1539&\" \"&K1539&\" \"&L1539","v":"PASCO DANIEL ALCIDES CARRION PAUCAR"},{"$f":"IF(AND(ING!$D$21=J1539,ING!$V$21=K1539),I1538+1,0)","v":0},"PASCO","DANIEL ALCIDES CARRION","PAUCAR","190204"]
[null,null,null,null,null,null,null,"PASCO DANIEL ALCIDES CARRION SAN PEDRO DE PILLAO",{"$f":"IF(AND(ING!$D$21=J1540,ING!$V$21=K1540),I1539+1,0)","v":0},"PASCO","DANIEL ALCIDES CARRION","SAN PEDRO DE PILLAO","190205"]
[null,null,null,null,null,null,null,"PASCO DANIEL ALCIDES CARRION SANTA ANA DE TUSI",{"$f":"IF(AND(ING!$D$21=J1541,ING!$V$21=K1541),I1540+1,0)","v":0},"PASCO","DANIEL ALCIDES CARRION","SANTA ANA DE TUSI","190206"]
[null,null,null,null,null,null,null,"PASCO DANIEL ALCIDES CARRION TAPUC",{"$f":"IF(AND(ING!$D$21=J1542,ING!$V$21=K1542),I1541+1,0)","v":0},"PASCO","DANIEL ALCIDES CARRION","TAPUC","190207"]
[null,null,null,null,null,null,null,"PASCO DANIEL ALCIDES CARRION VILCABAMBA",{"$f":"IF(AND(ING!$D$21=J1543,ING!$V$21=K1543),I1542+1,0)","v":0},"PASCO","DANIEL ALCIDES CARRION","VILCABAMBA","190208"]
[null,null,null,null,null,null,null,"PASCO DANIEL ALCIDES CARRION YANAHUANCA",{"$f":"IF(AND(ING!$D$21=J1544,ING!$V$21=K1544),I1543+1,0)","v":0},"PASCO","DANIEL ALCIDES CARRION","YANAHUANCA","190201"]
[null,null,null,null,null,null,null,"PASCO OXAPAMPA CHONTABAMBA",{"$f":"IF(AND(ING!$D$21=J1545,ING!$V$21=K1545),I1544+1,0)","v":0},"PASCO","OXAPAMPA","CHONTABAMBA","190302"]
[null,null,null,null,null,null,null,"PASCO OXAPAMPA CONSTITUCIÓN",{"$f":"IF(AND(ING!$D$21=J1546,ING!$V$21=K1546),I1545+1,0)","v":0},"PASCO","OXAPAMPA","CONSTITUCIÓN","190308"]
[null,null,null,null,null,null,null,"PASCO OXAPAMPA HUANCABAMBA",{"$f":"IF(AND(ING!$D$21=J1547,ING!$V$21=K1547),I1546+1,0)","v":0},"PASCO","OXAPAMPA","HUANCABAMBA","190303"]
[null,null,null,null,null,null,null,"PASCO OXAPAMPA OXAPAMPA",{"$f":"IF(AND(ING!$D$21=J1548,ING!$V$21=K1548),I1547+1,0)","v":0},"PASCO","OXAPAMPA","OXAPAMPA","190301"]
[null,null,null,null,null,null,null,"PASCO OXAPAMPA PALCAZU",{"$f":"IF(AND(ING!$D$21=J1549,ING!$V$21=K1549),I1548+1,0)","v":0},"PASCO","OXAPAMPA","PALCAZU","190304"]
[null,null,null,null,null,null,null,"PASCO OXAPAMPA POZUZO",{"$f":"IF(AND(ING!$D$21=J1550,ING!$V$21=K1550),I1549+1,0)","v":0},"PASCO","OXAPAMPA","POZUZO","190305"]
[null,null,null,null,null,null,null,"PASCO OXAPAMPA PUERTO BERMUDEZ",{"$f":"IF(AND(ING!$D$21=J1551,ING!$V$21=K1551),I1550+1,0)","v":0},"PASCO","OXAPAMPA","PUERTO BERMUDEZ","190306"]
[null,null,null,null,null,null,null,"PASCO OXAPAMPA VILLA RICA",{"$f":"IF(AND(ING!$D$21=J1552,ING!$V$21=K1552),I1551+1,0)","v":0},"PASCO","OXAPAMPA","VILLA RICA","190307"]
[null,null,null,null,null,null,null,"PASCO PASCO CHAUPIMARCA",{"$f":"IF(AND(ING!$D$21=J1553,ING!$V$21=K1553),I1552+1,0)","v":0},"PASCO","PASCO","CHAUPIMARCA","190101"]
[null,null,null,null,null,null,null,"PASCO PASCO HUACHON",{"$f":"IF(AND(ING!$D$21=J1554,ING!$V$21=K1554),I1553+1,0)","v":0},"PASCO","PASCO","HUACHON","190102"]
[null,null,null,null,null,null,null,"PASCO PASCO HUARIACA",{"$f":"IF(AND(ING!$D$21=J1555,ING!$V$21=K1555),I1554+1,0)","v":0},"PASCO","PASCO","HUARIACA","190103"]
[null,null,null,null,null,null,null,"PASCO PASCO HUAYLLAY",{"$f":"IF(AND(ING!$D$21=J1556,ING!$V$21=K1556),I1555+1,0)","v":0},"PASCO","PASCO","HUAYLLAY","190104"]
[null,null,null,null,null,null,null,"PASCO PASCO NINACACA",{"$f":"IF(AND(ING!$D$21=J1557,ING!$V$21=K1557),I1556+1,0)","v":0},"PASCO","PASCO","NINACACA","190105"]
[null,null,null,null,null,null,null,"PASCO PASCO PALLANCHACRA",{"$f":"IF(AND(ING!$D$21=J1558,ING!$V$21=K1558),I1557+1,0)","v":0},"PASCO","PASCO","PALLANCHACRA","190106"]
[null,null,null,null,null,null,null,"PASCO PASCO PAUCARTAMBO",{"$f":"IF(AND(ING!$D$21=J1559,ING!$V$21=K1559),I1558+1,0)","v":0},"PASCO","PASCO","PAUCARTAMBO","190107"]
[null,null,null,null,null,null,null,"PASCO PASCO SAN FRANCISCO DE ASIS DE YARUSYACAN",{"$f":"IF(AND(ING!$D$21=J1560,ING!$V$21=K1560),I1559+1,0)","v":0},"PASCO","PASCO","SAN FRANCISCO DE ASIS DE YARUSYACAN","190108"]
[null,null,null,null,null,null,null,"PASCO PASCO SIMON BOLIVAR",{"$f":"IF(AND(ING!$D$21=J1561,ING!$V$21=K1561),I1560+1,0)","v":0},"PASCO","PASCO","SIMON BOLIVAR","190109"]
[null,null,null,null,null,null,null,"PASCO PASCO TICLACAYAN",{"$f":"IF(AND(ING!$D$21=J1562,ING!$V$21=K1562),I1561+1,0)","v":0},"PASCO","PASCO","TICLACAYAN","190110"]
[null,null,null,null,null,null,null,"PASCO PASCO TINYAHUARCO",{"$f":"IF(AND(ING!$D$21=J1563,ING!$V$21=K1563),I1562+1,0)","v":0},"PASCO","PASCO","TINYAHUARCO","190111"]
[null,null,null,null,null,null,null,"PASCO PASCO VICCO",{"$f":"IF(AND(ING!$D$21=J1564,ING!$V$21=K1564),I1563+1,0)","v":0},"PASCO","PASCO","VICCO","190112"]
[null,null,null,null,null,null,null,"PASCO PASCO YANACANCHA",{"$f":"IF(AND(ING!$D$21=J1565,ING!$V$21=K1565),I1564+1,0)","v":0},"PASCO","PASCO","YANACANCHA","190113"]
[null,null,null,null,null,null,null,"PIURA AYABACA AYABACA",{"$f":"IF(AND(ING!$D$21=J1566,ING!$V$21=K1566),I1565+1,0)","v":0},"PIURA","AYABACA","AYABACA","200201"]
[null,null,null,null,null,null,null,"PIURA AYABACA FRIAS",{"$f":"IF(AND(ING!$D$21=J1567,ING!$V$21=K1567),I1566+1,0)","v":0},"PIURA","AYABACA","FRIAS","200202"]
[null,null,null,null,null,null,null,"PIURA AYABACA JILILI",{"$f":"IF(AND(ING!$D$21=J1568,ING!$V$21=K1568),I1567+1,0)","v":0},"PIURA","AYABACA","JILILI","200203"]
[null,null,null,null,null,null,null,"PIURA AYABACA LAGUNAS",{"$f":"IF(AND(ING!$D$21=J1569,ING!$V$21=K1569),I1568+1,0)","v":0},"PIURA","AYABACA","LAGUNAS","200204"]
[null,null,null,null,null,null,null,"PIURA AYABACA MONTERO",{"$f":"IF(AND(ING!$D$21=J1570,ING!$V$21=K1570),I1569+1,0)","v":0},"PIURA","AYABACA","MONTERO","200205"]
[null,null,null,null,null,null,null,"PIURA AYABACA PACAIPAMPA",{"$f":"IF(AND(ING!$D$21=J1571,ING!$V$21=K1571),I1570+1,0)","v":0},"PIURA","AYABACA","PACAIPAMPA","200206"]
[null,null,null,null,null,null,null,"PIURA AYABACA PAIMAS",{"$f":"IF(AND(ING!$D$21=J1572,ING!$V$21=K1572),I1571+1,0)","v":0},"PIURA","AYABACA","PAIMAS","200207"]
[null,null,null,null,null,null,null,"PIURA AYABACA SAPILLICA",{"$f":"IF(AND(ING!$D$21=J1573,ING!$V$21=K1573),I1572+1,0)","v":0},"PIURA","AYABACA","SAPILLICA","200208"]
[null,null,null,null,null,null,null,"PIURA AYABACA SICCHEZ",{"$f":"IF(AND(ING!$D$21=J1574,ING!$V$21=K1574),I1573+1,0)","v":0},"PIURA","AYABACA","SICCHEZ","200209"]
[null,null,null,null,null,null,null,"PIURA AYABACA SUYO",{"$f":"IF(AND(ING!$D$21=J1575,ING!$V$21=K1575),I1574+1,0)","v":0},"PIURA","AYABACA","SUYO","200210"]
[null,null,null,null,null,null,null,"PIURA HUANCABAMBA CANCHAQUE",{"$f":"IF(AND(ING!$D$21=J1576,ING!$V$21=K1576),I1575+1,0)","v":0},"PIURA","HUANCABAMBA","CANCHAQUE","200302"]
[null,null,null,null,null,null,null,"PIURA HUANCABAMBA EL CARMEN DE LA FRONTERA",{"$f":"IF(AND(ING!$D$21=J1577,ING!$V$21=K1577),I1576+1,0)","v":0},"PIURA","HUANCABAMBA","EL CARMEN DE LA FRONTERA","200303"]
[null,null,null,null,null,null,null,"PIURA HUANCABAMBA HUANCABAMBA",{"$f":"IF(AND(ING!$D$21=J1578,ING!$V$21=K1578),I1577+1,0)","v":0},"PIURA","HUANCABAMBA","HUANCABAMBA","200301"]
[null,null,null,null,null,null,null,"PIURA HUANCABAMBA HUARMACA",{"$f":"IF(AND(ING!$D$21=J1579,ING!$V$21=K1579),I1578+1,0)","v":0},"PIURA","HUANCABAMBA","HUARMACA","200304"]
[null,null,null,null,null,null,null,"PIURA HUANCABAMBA LALAQUIZ",{"$f":"IF(AND(ING!$D$21=J1580,ING!$V$21=K1580),I1579+1,0)","v":0},"PIURA","HUANCABAMBA","LALAQUIZ","200305"]
[null,null,null,null,null,null,null,"PIURA HUANCABAMBA SAN MIGUEL DE EL FAIQUE",{"$f":"IF(AND(ING!$D$21=J1581,ING!$V$21=K1581),I1580+1,0)","v":0},"PIURA","HUANCABAMBA","SAN MIGUEL DE EL FAIQUE","200306"]
[null,null,null,null,null,null,null,"PIURA HUANCABAMBA SONDOR",{"$f":"IF(AND(ING!$D$21=J1582,ING!$V$21=K1582),I1581+1,0)","v":0},"PIURA","HUANCABAMBA","SONDOR","200307"]
[null,null,null,null,null,null,null,"PIURA HUANCABAMBA SONDORILLO",{"$f":"IF(AND(ING!$D$21=J1583,ING!$V$21=K1583),I1582+1,0)","v":0},"PIURA","HUANCABAMBA","SONDORILLO","200308"]
[null,null,null,null,null,null,null,"PIURA MORROPON BUENOS AIRES",{"$f":"IF(AND(ING!$D$21=J1584,ING!$V$21=K1584),I1583+1,0)","v":0},"PIURA","MORROPON","BUENOS AIRES","200402"]
[null,null,null,null,null,null,null,"PIURA MORROPON CHALACO",{"$f":"IF(AND(ING!$D$21=J1585,ING!$V$21=K1585),I1584+1,0)","v":0},"PIURA","MORROPON","CHALACO","200403"]
[null,null,null,null,null,null,null,"PIURA MORROPON CHULUCANAS",{"$f":"IF(AND(ING!$D$21=J1586,ING!$V$21=K1586),I1585+1,0)","v":0},"PIURA","MORROPON","CHULUCANAS","200401"]
[null,null,null,null,null,null,null,"PIURA MORROPON LA MATANZA",{"$f":"IF(AND(ING!$D$21=J1587,ING!$V$21=K1587),I1586+1,0)","v":0},"PIURA","MORROPON","LA MATANZA","200404"]
[null,null,null,null,null,null,null,"PIURA MORROPON MORROPON",{"$f":"IF(AND(ING!$D$21=J1588,ING!$V$21=K1588),I1587+1,0)","v":0},"PIURA","MORROPON","MORROPON","200405"]
[null,null,null,null,null,null,null,"PIURA MORROPON SALITRAL",{"$f":"IF(AND(ING!$D$21=J1589,ING!$V$21=K1589),I1588+1,0)","v":0},"PIURA","MORROPON","SALITRAL","200406"]
[null,null,null,null,null,null,null,"PIURA MORROPON SAN JUAN DE BIGOTE",{"$f":"IF(AND(ING!$D$21=J1590,ING!$V$21=K1590),I1589+1,0)","v":0},"PIURA","MORROPON","SAN JUAN DE BIGOTE","200407"]
[null,null,null,null,null,null,null,"PIURA MORROPON SANTA CATALINA DE MOSSA",{"$f":"IF(AND(ING!$D$21=J1591,ING!$V$21=K1591),I1590+1,0)","v":0},"PIURA","MORROPON","SANTA CATALINA DE MOSSA","200408"]
[null,null,null,null,null,null,null,"PIURA MORROPON SANTO DOMINGO",{"$f":"IF(AND(ING!$D$21=J1592,ING!$V$21=K1592),I1591+1,0)","v":0},"PIURA","MORROPON","SANTO DOMINGO","200409"]
[null,null,null,null,null,null,null,"PIURA MORROPON YAMANGO",{"$f":"IF(AND(ING!$D$21=J1593,ING!$V$21=K1593),I1592+1,0)","v":0},"PIURA","MORROPON","YAMANGO","200410"]
[null,null,null,null,null,null,null,"PIURA PAITA AMOTAPE",{"$f":"IF(AND(ING!$D$21=J1594,ING!$V$21=K1594),I1593+1,0)","v":0},"PIURA","PAITA","AMOTAPE","200502"]
[null,null,null,null,null,null,null,"PIURA PAITA ARENAL",{"$f":"IF(AND(ING!$D$21=J1595,ING!$V$21=K1595),I1594+1,0)","v":0},"PIURA","PAITA","ARENAL","200503"]
[null,null,null,null,null,null,null,"PIURA PAITA COLAN",{"$f":"IF(AND(ING!$D$21=J1596,ING!$V$21=K1596),I1595+1,0)","v":0},"PIURA","PAITA","COLAN","200504"]
[null,null,null,null,null,null,null,"PIURA PAITA LA HUACA",{"$f":"IF(AND(ING!$D$21=J1597,ING!$V$21=K1597),I1596+1,0)","v":0},"PIURA","PAITA","LA HUACA","200505"]
[null,null,null,null,null,null,null,"PIURA PAITA PAITA",{"$f":"IF(AND(ING!$D$21=J1598,ING!$V$21=K1598),I1597+1,0)","v":0},"PIURA","PAITA","PAITA","200501"]
[null,null,null,null,null,null,null,"PIURA PAITA TAMARINDO",{"$f":"IF(AND(ING!$D$21=J1599,ING!$V$21=K1599),I1598+1,0)","v":0},"PIURA","PAITA","TAMARINDO","200506"]
[null,null,null,null,null,null,null,"PIURA PAITA VICHAYAL",{"$f":"IF(AND(ING!$D$21=J1600,ING!$V$21=K1600),I1599+1,0)","v":0},"PIURA","PAITA","VICHAYAL","200507"]
[null,null,null,null,null,null,null,"PIURA PIURA CASTILLA",{"$f":"IF(AND(ING!$D$21=J1601,ING!$V$21=K1601),I1600+1,0)","v":0},"PIURA","PIURA","CASTILLA","200104"]
[null,null,null,null,null,null,null,"PIURA PIURA CATACAOS",{"$f":"IF(AND(ING!$D$21=J1602,ING!$V$21=K1602),I1601+1,0)","v":0},"PIURA","PIURA","CATACAOS","200105"]
[null,null,null,null,null,null,null,{"$f":"J1603&\" \"&K1603&\" \"&L1603","v":"PIURA PIURA CURA MORI"},{"$f":"IF(AND(ING!$D$21=J1603,ING!$V$21=K1603),I1602+1,0)","v":0},"PIURA","PIURA","CURA MORI","200107"]
[null,null,null,null,null,null,null,"PIURA PIURA EL TALLÁN",{"$f":"IF(AND(ING!$D$21=J1604,ING!$V$21=K1604),I1603+1,0)","v":0},"PIURA","PIURA","EL TALLÁN","200108"]
[null,null,null,null,null,null,null,"PIURA PIURA LA ARENA",{"$f":"IF(AND(ING!$D$21=J1605,ING!$V$21=K1605),I1604+1,0)","v":0},"PIURA","PIURA","LA ARENA","200109"]
[null,null,null,null,null,null,null,"PIURA PIURA LA UNION",{"$f":"IF(AND(ING!$D$21=J1606,ING!$V$21=K1606),I1605+1,0)","v":0},"PIURA","PIURA","LA UNION","200110"]
[null,null,null,null,null,null,null,"PIURA PIURA LAS LOMAS",{"$f":"IF(AND(ING!$D$21=J1607,ING!$V$21=K1607),I1606+1,0)","v":0},"PIURA","PIURA","LAS LOMAS","200111"]
[null,null,null,null,null,null,null,"PIURA PIURA PIURA",{"$f":"IF(AND(ING!$D$21=J1608,ING!$V$21=K1608),I1607+1,0)","v":0},"PIURA","PIURA","PIURA","200101"]
[null,null,null,null,null,null,null,"PIURA PIURA TAMBO GRANDE",{"$f":"IF(AND(ING!$D$21=J1609,ING!$V$21=K1609),I1608+1,0)","v":0},"PIURA","PIURA","TAMBO GRANDE","200114"]
[null,null,null,null,null,null,null,"PIURA PIURA VEINTISÉIS DE OCTUBRE",{"$f":"IF(AND(ING!$D$21=J1610,ING!$V$21=K1610),I1609+1,0)","v":0},"PIURA","PIURA","VEINTISÉIS DE OCTUBRE","200115"]
[null,null,null,null,null,null,null,"PIURA SECHURA BELLAVISTA DE LA UNION",{"$f":"IF(AND(ING!$D$21=J1611,ING!$V$21=K1611),I1610+1,0)","v":0},"PIURA","SECHURA","BELLAVISTA DE LA UNION","200802"]
[null,null,null,null,null,null,null,"PIURA SECHURA BERNAL",{"$f":"IF(AND(ING!$D$21=J1612,ING!$V$21=K1612),I1611+1,0)","v":0},"PIURA","SECHURA","BERNAL","200803"]
[null,null,null,null,null,null,null,"PIURA SECHURA CRISTO NOS VALGA",{"$f":"IF(AND(ING!$D$21=J1613,ING!$V$21=K1613),I1612+1,0)","v":0},"PIURA","SECHURA","CRISTO NOS VALGA","200804"]
[null,null,null,null,null,null,null,"PIURA SECHURA RINCONADA LLICUAR",{"$f":"IF(AND(ING!$D$21=J1614,ING!$V$21=K1614),I1613+1,0)","v":0},"PIURA","SECHURA","RINCONADA LLICUAR","200806"]
[null,null,null,null,null,null,null,"PIURA SECHURA SECHURA",{"$f":"IF(AND(ING!$D$21=J1615,ING!$V$21=K1615),I1614+1,0)","v":0},"PIURA","SECHURA","SECHURA","200801"]
[null,null,null,null,null,null,null,"PIURA SECHURA VICE",{"$f":"IF(AND(ING!$D$21=J1616,ING!$V$21=K1616),I1615+1,0)","v":0},"PIURA","SECHURA","VICE","200805"]
[null,null,null,null,null,null,null,"PIURA SULLANA BELLAVISTA",{"$f":"IF(AND(ING!$D$21=J1617,ING!$V$21=K1617),I1616+1,0)","v":0},"PIURA","SULLANA","BELLAVISTA","200602"]
[null,null,null,null,null,null,null,"PIURA SULLANA IGNACIO ESCUDERO",{"$f":"IF(AND(ING!$D$21=J1618,ING!$V$21=K1618),I1617+1,0)","v":0},"PIURA","SULLANA","IGNACIO ESCUDERO","200603"]
[null,null,null,null,null,null,null,"PIURA SULLANA LANCONES",{"$f":"IF(AND(ING!$D$21=J1619,ING!$V$21=K1619),I1618+1,0)","v":0},"PIURA","SULLANA","LANCONES","200604"]
[null,null,null,null,null,null,null,"PIURA SULLANA MARCAVELICA",{"$f":"IF(AND(ING!$D$21=J1620,ING!$V$21=K1620),I1619+1,0)","v":0},"PIURA","SULLANA","MARCAVELICA","200605"]
[null,null,null,null,null,null,null,"PIURA SULLANA MIGUEL CHECA",{"$f":"IF(AND(ING!$D$21=J1621,ING!$V$21=K1621),I1620+1,0)","v":0},"PIURA","SULLANA","MIGUEL CHECA","200606"]
[null,null,null,null,null,null,null,"PIURA SULLANA QUERECOTILLO",{"$f":"IF(AND(ING!$D$21=J1622,ING!$V$21=K1622),I1621+1,0)","v":0},"PIURA","SULLANA","QUERECOTILLO","200607"]
[null,null,null,null,null,null,null,"PIURA SULLANA SALITRAL",{"$f":"IF(AND(ING!$D$21=J1623,ING!$V$21=K1623),I1622+1,0)","v":0},"PIURA","SULLANA","SALITRAL","200608"]
[null,null,null,null,null,null,null,"PIURA SULLANA SULLANA",{"$f":"IF(AND(ING!$D$21=J1624,ING!$V$21=K1624),I1623+1,0)","v":0},"PIURA","SULLANA","SULLANA","200601"]
[null,null,null,null,null,null,null,"PIURA TALARA EL ALTO",{"$f":"IF(AND(ING!$D$21=J1625,ING!$V$21=K1625),I1624+1,0)","v":0},"PIURA","TALARA","EL ALTO","200702"]
[null,null,null,null,null,null,null,"PIURA TALARA LA BREA",{"$f":"IF(AND(ING!$D$21=J1626,ING!$V$21=K1626),I1625+1,0)","v":0},"PIURA","TALARA","LA BREA","200703"]
[null,null,null,null,null,null,null,"PIURA TALARA LOBITOS",{"$f":"IF(AND(ING!$D$21=J1627,ING!$V$21=K1627),I1626+1,0)","v":0},"PIURA","TALARA","LOBITOS","200704"]
[null,null,null,null,null,null,null,"PIURA TALARA LOS ORGANOS",{"$f":"IF(AND(ING!$D$21=J1628,ING!$V$21=K1628),I1627+1,0)","v":0},"PIURA","TALARA","LOS ORGANOS","200705"]
[null,null,null,null,null,null,null,"PIURA TALARA MANCORA",{"$f":"IF(AND(ING!$D$21=J1629,ING!$V$21=K1629),I1628+1,0)","v":0},"PIURA","TALARA","MANCORA","200706"]
[null,null,null,null,null,null,null,"PIURA TALARA PARIÑAS",{"$f":"IF(AND(ING!$D$21=J1630,ING!$V$21=K1630),I1629+1,0)","v":0},"PIURA","TALARA","PARIÑAS","200701"]
[null,null,null,null,null,null,null,"PUNO AZANGARO ACHAYA",{"$f":"IF(AND(ING!$D$21=J1631,ING!$V$21=K1631),I1630+1,0)","v":0},"PUNO","AZANGARO","ACHAYA","210202"]
[null,null,null,null,null,null,null,"PUNO AZANGARO ARAPA",{"$f":"IF(AND(ING!$D$21=J1632,ING!$V$21=K1632),I1631+1,0)","v":0},"PUNO","AZANGARO","ARAPA","210203"]
[null,null,null,null,null,null,null,"PUNO AZANGARO ASILLO",{"$f":"IF(AND(ING!$D$21=J1633,ING!$V$21=K1633),I1632+1,0)","v":0},"PUNO","AZANGARO","ASILLO","210204"]
[null,null,null,null,null,null,null,"PUNO AZANGARO AZANGARO",{"$f":"IF(AND(ING!$D$21=J1634,ING!$V$21=K1634),I1633+1,0)","v":0},"PUNO","AZANGARO","AZANGARO","210201"]
[null,null,null,null,null,null,null,"PUNO AZANGARO CAMINACA",{"$f":"IF(AND(ING!$D$21=J1635,ING!$V$21=K1635),I1634+1,0)","v":0},"PUNO","AZANGARO","CAMINACA","210205"]
[null,null,null,null,null,null,null,"PUNO AZANGARO CHUPA",{"$f":"IF(AND(ING!$D$21=J1636,ING!$V$21=K1636),I1635+1,0)","v":0},"PUNO","AZANGARO","CHUPA","210206"]
[null,null,null,null,null,null,null,"PUNO AZANGARO JOSE DOMINGO CHOQUEHUANCA",{"$f":"IF(AND(ING!$D$21=J1637,ING!$V$21=K1637),I1636+1,0)","v":0},"PUNO","AZANGARO","JOSE DOMINGO CHOQUEHUANCA","210207"]
[null,null,null,null,null,null,null,"PUNO AZANGARO MUÑANI",{"$f":"IF(AND(ING!$D$21=J1638,ING!$V$21=K1638),I1637+1,0)","v":0},"PUNO","AZANGARO","MUÑANI","210208"]
[null,null,null,null,null,null,null,"PUNO AZANGARO POTONI",{"$f":"IF(AND(ING!$D$21=J1639,ING!$V$21=K1639),I1638+1,0)","v":0},"PUNO","AZANGARO","POTONI","210209"]
[null,null,null,null,null,null,null,"PUNO AZANGARO SAMAN",{"$f":"IF(AND(ING!$D$21=J1640,ING!$V$21=K1640),I1639+1,0)","v":0},"PUNO","AZANGARO","SAMAN","210210"]
[null,null,null,null,null,null,null,"PUNO AZANGARO SAN ANTON",{"$f":"IF(AND(ING!$D$21=J1641,ING!$V$21=K1641),I1640+1,0)","v":0},"PUNO","AZANGARO","SAN ANTON","210211"]
[null,null,null,null,null,null,null,"PUNO AZANGARO SAN JOSE",{"$f":"IF(AND(ING!$D$21=J1642,ING!$V$21=K1642),I1641+1,0)","v":0},"PUNO","AZANGARO","SAN JOSE","210212"]
[null,null,null,null,null,null,null,"PUNO AZANGARO SAN JUAN DE SALINAS",{"$f":"IF(AND(ING!$D$21=J1643,ING!$V$21=K1643),I1642+1,0)","v":0},"PUNO","AZANGARO","SAN JUAN DE SALINAS","210213"]
[null,null,null,null,null,null,null,"PUNO AZANGARO SANTIAGO DE PUPUJA",{"$f":"IF(AND(ING!$D$21=J1644,ING!$V$21=K1644),I1643+1,0)","v":0},"PUNO","AZANGARO","SANTIAGO DE PUPUJA","210214"]
[null,null,null,null,null,null,null,"PUNO AZANGARO TIRAPATA",{"$f":"IF(AND(ING!$D$21=J1645,ING!$V$21=K1645),I1644+1,0)","v":0},"PUNO","AZANGARO","TIRAPATA","210215"]
[null,null,null,null,null,null,null,"PUNO CARABAYA AJOYANI",{"$f":"IF(AND(ING!$D$21=J1646,ING!$V$21=K1646),I1645+1,0)","v":0},"PUNO","CARABAYA","AJOYANI","210302"]
[null,null,null,null,null,null,null,"PUNO CARABAYA AYAPATA",{"$f":"IF(AND(ING!$D$21=J1647,ING!$V$21=K1647),I1646+1,0)","v":0},"PUNO","CARABAYA","AYAPATA","210303"]
[null,null,null,null,null,null,null,"PUNO CARABAYA COASA",{"$f":"IF(AND(ING!$D$21=J1648,ING!$V$21=K1648),I1647+1,0)","v":0},"PUNO","CARABAYA","COASA","210304"]
[null,null,null,null,null,null,null,"PUNO CARABAYA CORANI",{"$f":"IF(AND(ING!$D$21=J1649,ING!$V$21=K1649),I1648+1,0)","v":0},"PUNO","CARABAYA","CORANI","210305"]
[null,null,null,null,null,null,null,"PUNO CARABAYA CRUCERO",{"$f":"IF(AND(ING!$D$21=J1650,ING!$V$21=K1650),I1649+1,0)","v":0},"PUNO","CARABAYA","CRUCERO","210306"]
[null,null,null,null,null,null,null,"PUNO CARABAYA ITUATA",{"$f":"IF(AND(ING!$D$21=J1651,ING!$V$21=K1651),I1650+1,0)","v":0},"PUNO","CARABAYA","ITUATA","210307"]
[null,null,null,null,null,null,null,"PUNO CARABAYA MACUSANI",{"$f":"IF(AND(ING!$D$21=J1652,ING!$V$21=K1652),I1651+1,0)","v":0},"PUNO","CARABAYA","MACUSANI","210301"]
[null,null,null,null,null,null,null,"PUNO CARABAYA OLLACHEA",{"$f":"IF(AND(ING!$D$21=J1653,ING!$V$21=K1653),I1652+1,0)","v":0},"PUNO","CARABAYA","OLLACHEA","210308"]
[null,null,null,null,null,null,null,"PUNO CARABAYA SAN GABAN",{"$f":"IF(AND(ING!$D$21=J1654,ING!$V$21=K1654),I1653+1,0)","v":0},"PUNO","CARABAYA","SAN GABAN","210309"]
[null,null,null,null,null,null,null,"PUNO CARABAYA USICAYOS",{"$f":"IF(AND(ING!$D$21=J1655,ING!$V$21=K1655),I1654+1,0)","v":0},"PUNO","CARABAYA","USICAYOS","210310"]
[null,null,null,null,null,null,null,"PUNO CHUCUITO DESAGUADERO",{"$f":"IF(AND(ING!$D$21=J1656,ING!$V$21=K1656),I1655+1,0)","v":0},"PUNO","CHUCUITO","DESAGUADERO","210402"]
[null,null,null,null,null,null,null,"PUNO CHUCUITO HUACULLANI",{"$f":"IF(AND(ING!$D$21=J1657,ING!$V$21=K1657),I1656+1,0)","v":0},"PUNO","CHUCUITO","HUACULLANI","210403"]
[null,null,null,null,null,null,null,"PUNO CHUCUITO JULI",{"$f":"IF(AND(ING!$D$21=J1658,ING!$V$21=K1658),I1657+1,0)","v":0},"PUNO","CHUCUITO","JULI","210401"]
[null,null,null,null,null,null,null,"PUNO CHUCUITO KELLUYO",{"$f":"IF(AND(ING!$D$21=J1659,ING!$V$21=K1659),I1658+1,0)","v":0},"PUNO","CHUCUITO","KELLUYO","210404"]
[null,null,null,null,null,null,null,"PUNO CHUCUITO PISACOMA",{"$f":"IF(AND(ING!$D$21=J1660,ING!$V$21=K1660),I1659+1,0)","v":0},"PUNO","CHUCUITO","PISACOMA","210405"]
[null,null,null,null,null,null,null,"PUNO CHUCUITO POMATA",{"$f":"IF(AND(ING!$D$21=J1661,ING!$V$21=K1661),I1660+1,0)","v":0},"PUNO","CHUCUITO","POMATA","210406"]
[null,null,null,null,null,null,null,"PUNO CHUCUITO ZEPITA",{"$f":"IF(AND(ING!$D$21=J1662,ING!$V$21=K1662),I1661+1,0)","v":0},"PUNO","CHUCUITO","ZEPITA","210407"]
[null,null,null,null,null,null,null,"PUNO EL COLLAO CAPAZO",{"$f":"IF(AND(ING!$D$21=J1663,ING!$V$21=K1663),I1662+1,0)","v":0},"PUNO","EL COLLAO","CAPAZO","210502"]
[null,null,null,null,null,null,null,"PUNO EL COLLAO CONDURIRI",{"$f":"IF(AND(ING!$D$21=J1664,ING!$V$21=K1664),I1663+1,0)","v":0},"PUNO","EL COLLAO","CONDURIRI","210505"]
[null,null,null,null,null,null,null,"PUNO EL COLLAO ILAVE",{"$f":"IF(AND(ING!$D$21=J1665,ING!$V$21=K1665),I1664+1,0)","v":0},"PUNO","EL COLLAO","ILAVE","210501"]
[null,null,null,null,null,null,null,"PUNO EL COLLAO PILCUYO",{"$f":"IF(AND(ING!$D$21=J1666,ING!$V$21=K1666),I1665+1,0)","v":0},"PUNO","EL COLLAO","PILCUYO","210503"]
[null,null,null,null,null,null,null,{"$f":"J1667&\" \"&K1667&\" \"&L1667","v":"PUNO EL COLLAO SANTA ROSA"},{"$f":"IF(AND(ING!$D$21=J1667,ING!$V$21=K1667),I1666+1,0)","v":0},"PUNO","EL COLLAO","SANTA ROSA","210504"]
[null,null,null,null,null,null,null,"PUNO HUANCANE COJATA",{"$f":"IF(AND(ING!$D$21=J1668,ING!$V$21=K1668),I1667+1,0)","v":0},"PUNO","HUANCANE","COJATA","210602"]
[null,null,null,null,null,null,null,"PUNO HUANCANE HUANCANE",{"$f":"IF(AND(ING!$D$21=J1669,ING!$V$21=K1669),I1668+1,0)","v":0},"PUNO","HUANCANE","HUANCANE","210601"]
[null,null,null,null,null,null,null,"PUNO HUANCANE HUATASANI",{"$f":"IF(AND(ING!$D$21=J1670,ING!$V$21=K1670),I1669+1,0)","v":0},"PUNO","HUANCANE","HUATASANI","210603"]
[null,null,null,null,null,null,null,"PUNO HUANCANE INCHUPALLA",{"$f":"IF(AND(ING!$D$21=J1671,ING!$V$21=K1671),I1670+1,0)","v":0},"PUNO","HUANCANE","INCHUPALLA","210604"]
[null,null,null,null,null,null,null,"PUNO HUANCANE PUSI",{"$f":"IF(AND(ING!$D$21=J1672,ING!$V$21=K1672),I1671+1,0)","v":0},"PUNO","HUANCANE","PUSI","210605"]
[null,null,null,null,null,null,null,"PUNO HUANCANE ROSASPATA",{"$f":"IF(AND(ING!$D$21=J1673,ING!$V$21=K1673),I1672+1,0)","v":0},"PUNO","HUANCANE","ROSASPATA","210606"]
[null,null,null,null,null,null,null,"PUNO HUANCANE TARACO",{"$f":"IF(AND(ING!$D$21=J1674,ING!$V$21=K1674),I1673+1,0)","v":0},"PUNO","HUANCANE","TARACO","210607"]
[null,null,null,null,null,null,null,"PUNO HUANCANE VILQUE CHICO",{"$f":"IF(AND(ING!$D$21=J1675,ING!$V$21=K1675),I1674+1,0)","v":0},"PUNO","HUANCANE","VILQUE CHICO","210608"]
[null,null,null,null,null,null,null,"PUNO LAMPA CABANILLA",{"$f":"IF(AND(ING!$D$21=J1676,ING!$V$21=K1676),I1675+1,0)","v":0},"PUNO","LAMPA","CABANILLA","210702"]
[null,null,null,null,null,null,null,"PUNO LAMPA CALAPUJA",{"$f":"IF(AND(ING!$D$21=J1677,ING!$V$21=K1677),I1676+1,0)","v":0},"PUNO","LAMPA","CALAPUJA","210703"]
[null,null,null,null,null,null,null,"PUNO LAMPA LAMPA",{"$f":"IF(AND(ING!$D$21=J1678,ING!$V$21=K1678),I1677+1,0)","v":0},"PUNO","LAMPA","LAMPA","210701"]
[null,null,null,null,null,null,null,"PUNO LAMPA NICASIO",{"$f":"IF(AND(ING!$D$21=J1679,ING!$V$21=K1679),I1678+1,0)","v":0},"PUNO","LAMPA","NICASIO","210704"]
[null,null,null,null,null,null,null,"PUNO LAMPA OCUVIRI",{"$f":"IF(AND(ING!$D$21=J1680,ING!$V$21=K1680),I1679+1,0)","v":0},"PUNO","LAMPA","OCUVIRI","210705"]
[null,null,null,null,null,null,null,"PUNO LAMPA PALCA",{"$f":"IF(AND(ING!$D$21=J1681,ING!$V$21=K1681),I1680+1,0)","v":0},"PUNO","LAMPA","PALCA","210706"]
[null,null,null,null,null,null,null,"PUNO LAMPA PARATIA",{"$f":"IF(AND(ING!$D$21=J1682,ING!$V$21=K1682),I1681+1,0)","v":0},"PUNO","LAMPA","PARATIA","210707"]
[null,null,null,null,null,null,null,"PUNO LAMPA PUCARA",{"$f":"IF(AND(ING!$D$21=J1683,ING!$V$21=K1683),I1682+1,0)","v":0},"PUNO","LAMPA","PUCARA","210708"]
[null,null,null,null,null,null,null,"PUNO LAMPA SANTA LUCIA",{"$f":"IF(AND(ING!$D$21=J1684,ING!$V$21=K1684),I1683+1,0)","v":0},"PUNO","LAMPA","SANTA LUCIA","210709"]
[null,null,null,null,null,null,null,"PUNO LAMPA VILAVILA",{"$f":"IF(AND(ING!$D$21=J1685,ING!$V$21=K1685),I1684+1,0)","v":0},"PUNO","LAMPA","VILAVILA","210710"]
[null,null,null,null,null,null,null,"PUNO MELGAR ANTAUTA",{"$f":"IF(AND(ING!$D$21=J1686,ING!$V$21=K1686),I1685+1,0)","v":0},"PUNO","MELGAR","ANTAUTA","210802"]
[null,null,null,null,null,null,null,"PUNO MELGAR AYAVIRI",{"$f":"IF(AND(ING!$D$21=J1687,ING!$V$21=K1687),I1686+1,0)","v":0},"PUNO","MELGAR","AYAVIRI","210801"]
[null,null,null,null,null,null,null,"PUNO MELGAR CUPI",{"$f":"IF(AND(ING!$D$21=J1688,ING!$V$21=K1688),I1687+1,0)","v":0},"PUNO","MELGAR","CUPI","210803"]
[null,null,null,null,null,null,null,"PUNO MELGAR LLALLI",{"$f":"IF(AND(ING!$D$21=J1689,ING!$V$21=K1689),I1688+1,0)","v":0},"PUNO","MELGAR","LLALLI","210804"]
[null,null,null,null,null,null,null,"PUNO MELGAR MACARI",{"$f":"IF(AND(ING!$D$21=J1690,ING!$V$21=K1690),I1689+1,0)","v":0},"PUNO","MELGAR","MACARI","210805"]
[null,null,null,null,null,null,null,"PUNO MELGAR NUÑOA",{"$f":"IF(AND(ING!$D$21=J1691,ING!$V$21=K1691),I1690+1,0)","v":0},"PUNO","MELGAR","NUÑOA","210806"]
[null,null,null,null,null,null,null,"PUNO MELGAR ORURILLO",{"$f":"IF(AND(ING!$D$21=J1692,ING!$V$21=K1692),I1691+1,0)","v":0},"PUNO","MELGAR","ORURILLO","210807"]
[null,null,null,null,null,null,null,"PUNO MELGAR SANTA ROSA",{"$f":"IF(AND(ING!$D$21=J1693,ING!$V$21=K1693),I1692+1,0)","v":0},"PUNO","MELGAR","SANTA ROSA","210808"]
[null,null,null,null,null,null,null,"PUNO MELGAR UMACHIRI",{"$f":"IF(AND(ING!$D$21=J1694,ING!$V$21=K1694),I1693+1,0)","v":0},"PUNO","MELGAR","UMACHIRI","210809"]
[null,null,null,null,null,null,null,"PUNO MOHO CONIMA",{"$f":"IF(AND(ING!$D$21=J1695,ING!$V$21=K1695),I1694+1,0)","v":0},"PUNO","MOHO","CONIMA","210902"]
[null,null,null,null,null,null,null,"PUNO MOHO HUAYRAPATA",{"$f":"IF(AND(ING!$D$21=J1696,ING!$V$21=K1696),I1695+1,0)","v":0},"PUNO","MOHO","HUAYRAPATA","210903"]
[null,null,null,null,null,null,null,"PUNO MOHO MOHO",{"$f":"IF(AND(ING!$D$21=J1697,ING!$V$21=K1697),I1696+1,0)","v":0},"PUNO","MOHO","MOHO","210901"]
[null,null,null,null,null,null,null,"PUNO MOHO TILALI",{"$f":"IF(AND(ING!$D$21=J1698,ING!$V$21=K1698),I1697+1,0)","v":0},"PUNO","MOHO","TILALI","210904"]
[null,null,null,null,null,null,null,"PUNO PUNO ACORA",{"$f":"IF(AND(ING!$D$21=J1699,ING!$V$21=K1699),I1698+1,0)","v":0},"PUNO","PUNO","ACORA","210102"]
[null,null,null,null,null,null,null,"PUNO PUNO AMANTANI",{"$f":"IF(AND(ING!$D$21=J1700,ING!$V$21=K1700),I1699+1,0)","v":0},"PUNO","PUNO","AMANTANI","210103"]
[null,null,null,null,null,null,null,"PUNO PUNO ATUNCOLLA",{"$f":"IF(AND(ING!$D$21=J1701,ING!$V$21=K1701),I1700+1,0)","v":0},"PUNO","PUNO","ATUNCOLLA","210104"]
[null,null,null,null,null,null,null,"PUNO PUNO CAPACHICA",{"$f":"IF(AND(ING!$D$21=J1702,ING!$V$21=K1702),I1701+1,0)","v":0},"PUNO","PUNO","CAPACHICA","210105"]
[null,null,null,null,null,null,null,"PUNO PUNO CHUCUITO",{"$f":"IF(AND(ING!$D$21=J1703,ING!$V$21=K1703),I1702+1,0)","v":0},"PUNO","PUNO","CHUCUITO","210106"]
[null,null,null,null,null,null,null,"PUNO PUNO COATA",{"$f":"IF(AND(ING!$D$21=J1704,ING!$V$21=K1704),I1703+1,0)","v":0},"PUNO","PUNO","COATA","210107"]
[null,null,null,null,null,null,null,"PUNO PUNO HUATA",{"$f":"IF(AND(ING!$D$21=J1705,ING!$V$21=K1705),I1704+1,0)","v":0},"PUNO","PUNO","HUATA","210108"]
[null,null,null,null,null,null,null,"PUNO PUNO MAÑAZO",{"$f":"IF(AND(ING!$D$21=J1706,ING!$V$21=K1706),I1705+1,0)","v":0},"PUNO","PUNO","MAÑAZO","210109"]
[null,null,null,null,null,null,null,"PUNO PUNO PAUCARCOLLA",{"$f":"IF(AND(ING!$D$21=J1707,ING!$V$21=K1707),I1706+1,0)","v":0},"PUNO","PUNO","PAUCARCOLLA","210110"]
[null,null,null,null,null,null,null,"PUNO PUNO PICHACANI",{"$f":"IF(AND(ING!$D$21=J1708,ING!$V$21=K1708),I1707+1,0)","v":0},"PUNO","PUNO","PICHACANI","210111"]
[null,null,null,null,null,null,null,"PUNO PUNO PLATERIA",{"$f":"IF(AND(ING!$D$21=J1709,ING!$V$21=K1709),I1708+1,0)","v":0},"PUNO","PUNO","PLATERIA","210112"]
[null,null,null,null,null,null,null,"PUNO PUNO PUNO",{"$f":"IF(AND(ING!$D$21=J1710,ING!$V$21=K1710),I1709+1,0)","v":0},"PUNO","PUNO","PUNO","210101"]
[null,null,null,null,null,null,null,"PUNO PUNO SAN ANTONIO",{"$f":"IF(AND(ING!$D$21=J1711,ING!$V$21=K1711),I1710+1,0)","v":0},"PUNO","PUNO","SAN ANTONIO","210113"]
[null,null,null,null,null,null,null,"PUNO PUNO TIQUILLACA",{"$f":"IF(AND(ING!$D$21=J1712,ING!$V$21=K1712),I1711+1,0)","v":0},"PUNO","PUNO","TIQUILLACA","210114"]
[null,null,null,null,null,null,null,"PUNO PUNO VILQUE",{"$f":"IF(AND(ING!$D$21=J1713,ING!$V$21=K1713),I1712+1,0)","v":0},"PUNO","PUNO","VILQUE","210115"]
[null,null,null,null,null,null,null,"PUNO SAN ANTONIO DE PUTINA ANANEA",{"$f":"IF(AND(ING!$D$21=J1714,ING!$V$21=K1714),I1713+1,0)","v":0},"PUNO","SAN ANTONIO DE PUTINA","ANANEA","211002"]
[null,null,null,null,null,null,null,"PUNO SAN ANTONIO DE PUTINA PEDRO VILCA APAZA",{"$f":"IF(AND(ING!$D$21=J1715,ING!$V$21=K1715),I1714+1,0)","v":0},"PUNO","SAN ANTONIO DE PUTINA","PEDRO VILCA APAZA","211003"]
[null,null,null,null,null,null,null,"PUNO SAN ANTONIO DE PUTINA PUTINA",{"$f":"IF(AND(ING!$D$21=J1716,ING!$V$21=K1716),I1715+1,0)","v":0},"PUNO","SAN ANTONIO DE PUTINA","PUTINA","211001"]
[null,null,null,null,null,null,null,"PUNO SAN ANTONIO DE PUTINA QUILCAPUNCU",{"$f":"IF(AND(ING!$D$21=J1717,ING!$V$21=K1717),I1716+1,0)","v":0},"PUNO","SAN ANTONIO DE PUTINA","QUILCAPUNCU","211004"]
[null,null,null,null,null,null,null,"PUNO SAN ANTONIO DE PUTINA SINA",{"$f":"IF(AND(ING!$D$21=J1718,ING!$V$21=K1718),I1717+1,0)","v":0},"PUNO","SAN ANTONIO DE PUTINA","SINA","211005"]
[null,null,null,null,null,null,null,"PUNO SAN ROMAN CABANA",{"$f":"IF(AND(ING!$D$21=J1719,ING!$V$21=K1719),I1718+1,0)","v":0},"PUNO","SAN ROMAN","CABANA","211102"]
[null,null,null,null,null,null,null,"PUNO SAN ROMAN CABANILLAS",{"$f":"IF(AND(ING!$D$21=J1720,ING!$V$21=K1720),I1719+1,0)","v":0},"PUNO","SAN ROMAN","CABANILLAS","211103"]
[null,null,null,null,null,null,null,"PUNO SAN ROMAN CARACOTO",{"$f":"IF(AND(ING!$D$21=J1721,ING!$V$21=K1721),I1720+1,0)","v":0},"PUNO","SAN ROMAN","CARACOTO","211104"]
[null,null,null,null,null,null,null,"PUNO SAN ROMAN JULIACA",{"$f":"IF(AND(ING!$D$21=J1722,ING!$V$21=K1722),I1721+1,0)","v":0},"PUNO","SAN ROMAN","JULIACA","211101"]
[null,null,null,null,null,null,null,"PUNO SAN ROMAN SAN MIGUEL",{"$f":"IF(AND(ING!$D$21=J1723,ING!$V$21=K1723),I1722+1,0)","v":0},"PUNO","SAN ROMAN","SAN MIGUEL","211105"]
[null,null,null,null,null,null,null,"PUNO SANDIA ALTO INAMBARI",{"$f":"IF(AND(ING!$D$21=J1724,ING!$V$21=K1724),I1723+1,0)","v":0},"PUNO","SANDIA","ALTO INAMBARI","211209"]
[null,null,null,null,null,null,null,"PUNO SANDIA CUYOCUYO",{"$f":"IF(AND(ING!$D$21=J1725,ING!$V$21=K1725),I1724+1,0)","v":0},"PUNO","SANDIA","CUYOCUYO","211202"]
[null,null,null,null,null,null,null,"PUNO SANDIA LIMBANI",{"$f":"IF(AND(ING!$D$21=J1726,ING!$V$21=K1726),I1725+1,0)","v":0},"PUNO","SANDIA","LIMBANI","211203"]
[null,null,null,null,null,null,null,"PUNO SANDIA PATAMBUCO",{"$f":"IF(AND(ING!$D$21=J1727,ING!$V$21=K1727),I1726+1,0)","v":0},"PUNO","SANDIA","PATAMBUCO","211204"]
[null,null,null,null,null,null,null,"PUNO SANDIA PHARA",{"$f":"IF(AND(ING!$D$21=J1728,ING!$V$21=K1728),I1727+1,0)","v":0},"PUNO","SANDIA","PHARA","211205"]
[null,null,null,null,null,null,null,"PUNO SANDIA QUIACA",{"$f":"IF(AND(ING!$D$21=J1729,ING!$V$21=K1729),I1728+1,0)","v":0},"PUNO","SANDIA","QUIACA","211206"]
[null,null,null,null,null,null,null,"PUNO SANDIA SAN JUAN DEL ORO",{"$f":"IF(AND(ING!$D$21=J1730,ING!$V$21=K1730),I1729+1,0)","v":0},"PUNO","SANDIA","SAN JUAN DEL ORO","211207"]
[null,null,null,null,null,null,null,{"$f":"J1731&\" \"&K1731&\" \"&L1731","v":"PUNO SANDIA SAN PEDRO DE PUTINA PUNCO"},{"$f":"IF(AND(ING!$D$21=J1731,ING!$V$21=K1731),I1730+1,0)","v":0},"PUNO","SANDIA","SAN PEDRO DE PUTINA PUNCO","211210"]
[null,null,null,null,null,null,null,"PUNO SANDIA SANDIA",{"$f":"IF(AND(ING!$D$21=J1732,ING!$V$21=K1732),I1731+1,0)","v":0},"PUNO","SANDIA","SANDIA","211201"]
[null,null,null,null,null,null,null,"PUNO SANDIA YANAHUAYA",{"$f":"IF(AND(ING!$D$21=J1733,ING!$V$21=K1733),I1732+1,0)","v":0},"PUNO","SANDIA","YANAHUAYA","211208"]
[null,null,null,null,null,null,null,"PUNO YUNGUYO ANAPIA",{"$f":"IF(AND(ING!$D$21=J1734,ING!$V$21=K1734),I1733+1,0)","v":0},"PUNO","YUNGUYO","ANAPIA","211302"]
[null,null,null,null,null,null,null,"PUNO YUNGUYO COPANI",{"$f":"IF(AND(ING!$D$21=J1735,ING!$V$21=K1735),I1734+1,0)","v":0},"PUNO","YUNGUYO","COPANI","211303"]
[null,null,null,null,null,null,null,"PUNO YUNGUYO CUTURAPI",{"$f":"IF(AND(ING!$D$21=J1736,ING!$V$21=K1736),I1735+1,0)","v":0},"PUNO","YUNGUYO","CUTURAPI","211304"]
[null,null,null,null,null,null,null,"PUNO YUNGUYO OLLARAYA",{"$f":"IF(AND(ING!$D$21=J1737,ING!$V$21=K1737),I1736+1,0)","v":0},"PUNO","YUNGUYO","OLLARAYA","211305"]
[null,null,null,null,null,null,null,"PUNO YUNGUYO TINICACHI",{"$f":"IF(AND(ING!$D$21=J1738,ING!$V$21=K1738),I1737+1,0)","v":0},"PUNO","YUNGUYO","TINICACHI","211306"]
[null,null,null,null,null,null,null,"PUNO YUNGUYO UNICACHI",{"$f":"IF(AND(ING!$D$21=J1739,ING!$V$21=K1739),I1738+1,0)","v":0},"PUNO","YUNGUYO","UNICACHI","211307"]
[null,null,null,null,null,null,null,"PUNO YUNGUYO YUNGUYO",{"$f":"IF(AND(ING!$D$21=J1740,ING!$V$21=K1740),I1739+1,0)","v":0},"PUNO","YUNGUYO","YUNGUYO","211301"]
[null,null,null,null,null,null,null,"SAN MARTÍN BELLAVISTA ALTO BIAVO",{"$f":"IF(AND(ING!$D$21=J1741,ING!$V$21=K1741),I1740+1,0)","v":0},"SAN MARTÍN","BELLAVISTA","ALTO BIAVO","220202"]
[null,null,null,null,null,null,null,"SAN MARTÍN BELLAVISTA BAJO BIAVO",{"$f":"IF(AND(ING!$D$21=J1742,ING!$V$21=K1742),I1741+1,0)","v":0},"SAN MARTÍN","BELLAVISTA","BAJO BIAVO","220203"]
[null,null,null,null,null,null,null,"SAN MARTÍN BELLAVISTA BELLAVISTA",{"$f":"IF(AND(ING!$D$21=J1743,ING!$V$21=K1743),I1742+1,0)","v":0},"SAN MARTÍN","BELLAVISTA","BELLAVISTA","220201"]
[null,null,null,null,null,null,null,"SAN MARTÍN BELLAVISTA HUALLAGA",{"$f":"IF(AND(ING!$D$21=J1744,ING!$V$21=K1744),I1743+1,0)","v":0},"SAN MARTÍN","BELLAVISTA","HUALLAGA","220204"]
[null,null,null,null,null,null,null,"SAN MARTÍN BELLAVISTA SAN PABLO",{"$f":"IF(AND(ING!$D$21=J1745,ING!$V$21=K1745),I1744+1,0)","v":0},"SAN MARTÍN","BELLAVISTA","SAN PABLO","220205"]
[null,null,null,null,null,null,null,"SAN MARTÍN BELLAVISTA SAN RAFAEL",{"$f":"IF(AND(ING!$D$21=J1746,ING!$V$21=K1746),I1745+1,0)","v":0},"SAN MARTÍN","BELLAVISTA","SAN RAFAEL","220206"]
[null,null,null,null,null,null,null,"SAN MARTÍN EL DORADO AGUA BLANCA",{"$f":"IF(AND(ING!$D$21=J1747,ING!$V$21=K1747),I1746+1,0)","v":0},"SAN MARTÍN","EL DORADO","AGUA BLANCA","220302"]
[null,null,null,null,null,null,null,"SAN MARTÍN EL DORADO SAN JOSE DE SISA",{"$f":"IF(AND(ING!$D$21=J1748,ING!$V$21=K1748),I1747+1,0)","v":0},"SAN MARTÍN","EL DORADO","SAN JOSE DE SISA","220301"]
[null,null,null,null,null,null,null,"SAN MARTÍN EL DORADO SAN MARTIN",{"$f":"IF(AND(ING!$D$21=J1749,ING!$V$21=K1749),I1748+1,0)","v":0},"SAN MARTÍN","EL DORADO","SAN MARTIN","220303"]
[null,null,null,null,null,null,null,"SAN MARTÍN EL DORADO SANTA ROSA",{"$f":"IF(AND(ING!$D$21=J1750,ING!$V$21=K1750),I1749+1,0)","v":0},"SAN MARTÍN","EL DORADO","SANTA ROSA","220304"]
[null,null,null,null,null,null,null,"SAN MARTÍN EL DORADO SHATOJA",{"$f":"IF(AND(ING!$D$21=J1751,ING!$V$21=K1751),I1750+1,0)","v":0},"SAN MARTÍN","EL DORADO","SHATOJA","220305"]
[null,null,null,null,null,null,null,"SAN MARTÍN HUALLAGA ALTO SAPOSOA",{"$f":"IF(AND(ING!$D$21=J1752,ING!$V$21=K1752),I1751+1,0)","v":0},"SAN MARTÍN","HUALLAGA","ALTO SAPOSOA","220402"]
[null,null,null,null,null,null,null,"SAN MARTÍN HUALLAGA EL ESLABON",{"$f":"IF(AND(ING!$D$21=J1753,ING!$V$21=K1753),I1752+1,0)","v":0},"SAN MARTÍN","HUALLAGA","EL ESLABON","220403"]
[null,null,null,null,null,null,null,"SAN MARTÍN HUALLAGA PISCOYACU",{"$f":"IF(AND(ING!$D$21=J1754,ING!$V$21=K1754),I1753+1,0)","v":0},"SAN MARTÍN","HUALLAGA","PISCOYACU","220404"]
[null,null,null,null,null,null,null,"SAN MARTÍN HUALLAGA SACANCHE",{"$f":"IF(AND(ING!$D$21=J1755,ING!$V$21=K1755),I1754+1,0)","v":0},"SAN MARTÍN","HUALLAGA","SACANCHE","220405"]
[null,null,null,null,null,null,null,"SAN MARTÍN HUALLAGA SAPOSOA",{"$f":"IF(AND(ING!$D$21=J1756,ING!$V$21=K1756),I1755+1,0)","v":0},"SAN MARTÍN","HUALLAGA","SAPOSOA","220401"]
[null,null,null,null,null,null,null,"SAN MARTÍN HUALLAGA TINGO DE SAPOSOA",{"$f":"IF(AND(ING!$D$21=J1757,ING!$V$21=K1757),I1756+1,0)","v":0},"SAN MARTÍN","HUALLAGA","TINGO DE SAPOSOA","220406"]
[null,null,null,null,null,null,null,"SAN MARTÍN LAMAS ALONSO DE ALVARADO",{"$f":"IF(AND(ING!$D$21=J1758,ING!$V$21=K1758),I1757+1,0)","v":0},"SAN MARTÍN","LAMAS","ALONSO DE ALVARADO","220502"]
[null,null,null,null,null,null,null,"SAN MARTÍN LAMAS BARRANQUITA",{"$f":"IF(AND(ING!$D$21=J1759,ING!$V$21=K1759),I1758+1,0)","v":0},"SAN MARTÍN","LAMAS","BARRANQUITA","220503"]
[null,null,null,null,null,null,null,"SAN MARTÍN LAMAS CAYNARACHI",{"$f":"IF(AND(ING!$D$21=J1760,ING!$V$21=K1760),I1759+1,0)","v":0},"SAN MARTÍN","LAMAS","CAYNARACHI","220504"]
[null,null,null,null,null,null,null,"SAN MARTÍN LAMAS CUÑUMBUQUI",{"$f":"IF(AND(ING!$D$21=J1761,ING!$V$21=K1761),I1760+1,0)","v":0},"SAN MARTÍN","LAMAS","CUÑUMBUQUI","220505"]
[null,null,null,null,null,null,null,"SAN MARTÍN LAMAS LAMAS",{"$f":"IF(AND(ING!$D$21=J1762,ING!$V$21=K1762),I1761+1,0)","v":0},"SAN MARTÍN","LAMAS","LAMAS","220501"]
[null,null,null,null,null,null,null,"SAN MARTÍN LAMAS PINTO RECODO",{"$f":"IF(AND(ING!$D$21=J1763,ING!$V$21=K1763),I1762+1,0)","v":0},"SAN MARTÍN","LAMAS","PINTO RECODO","220506"]
[null,null,null,null,null,null,null,"SAN MARTÍN LAMAS RUMISAPA",{"$f":"IF(AND(ING!$D$21=J1764,ING!$V$21=K1764),I1763+1,0)","v":0},"SAN MARTÍN","LAMAS","RUMISAPA","220507"]
[null,null,null,null,null,null,null,"SAN MARTÍN LAMAS SAN ROQUE DE CUMBAZA",{"$f":"IF(AND(ING!$D$21=J1765,ING!$V$21=K1765),I1764+1,0)","v":0},"SAN MARTÍN","LAMAS","SAN ROQUE DE CUMBAZA","220508"]
[null,null,null,null,null,null,null,"SAN MARTÍN LAMAS SHANAO",{"$f":"IF(AND(ING!$D$21=J1766,ING!$V$21=K1766),I1765+1,0)","v":0},"SAN MARTÍN","LAMAS","SHANAO","220509"]
[null,null,null,null,null,null,null,"SAN MARTÍN LAMAS TABALOSOS",{"$f":"IF(AND(ING!$D$21=J1767,ING!$V$21=K1767),I1766+1,0)","v":0},"SAN MARTÍN","LAMAS","TABALOSOS","220510"]
[null,null,null,null,null,null,null,"SAN MARTÍN LAMAS ZAPATERO",{"$f":"IF(AND(ING!$D$21=J1768,ING!$V$21=K1768),I1767+1,0)","v":0},"SAN MARTÍN","LAMAS","ZAPATERO","220511"]
[null,null,null,null,null,null,null,"SAN MARTÍN MARISCAL CACERES CAMPANILLA",{"$f":"IF(AND(ING!$D$21=J1769,ING!$V$21=K1769),I1768+1,0)","v":0},"SAN MARTÍN","MARISCAL CACERES","CAMPANILLA","220602"]
[null,null,null,null,null,null,null,"SAN MARTÍN MARISCAL CACERES HUICUNGO",{"$f":"IF(AND(ING!$D$21=J1770,ING!$V$21=K1770),I1769+1,0)","v":0},"SAN MARTÍN","MARISCAL CACERES","HUICUNGO","220603"]
[null,null,null,null,null,null,null,"SAN MARTÍN MARISCAL CACERES JUANJUI",{"$f":"IF(AND(ING!$D$21=J1771,ING!$V$21=K1771),I1770+1,0)","v":0},"SAN MARTÍN","MARISCAL CACERES","JUANJUI","220601"]
[null,null,null,null,null,null,null,"SAN MARTÍN MARISCAL CACERES PACHIZA",{"$f":"IF(AND(ING!$D$21=J1772,ING!$V$21=K1772),I1771+1,0)","v":0},"SAN MARTÍN","MARISCAL CACERES","PACHIZA","220604"]
[null,null,null,null,null,null,null,"SAN MARTÍN MARISCAL CACERES PAJARILLO",{"$f":"IF(AND(ING!$D$21=J1773,ING!$V$21=K1773),I1772+1,0)","v":0},"SAN MARTÍN","MARISCAL CACERES","PAJARILLO","220605"]
[null,null,null,null,null,null,null,"SAN MARTÍN MOYOBAMBA CALZADA",{"$f":"IF(AND(ING!$D$21=J1774,ING!$V$21=K1774),I1773+1,0)","v":0},"SAN MARTÍN","MOYOBAMBA","CALZADA","220102"]
[null,null,null,null,null,null,null,"SAN MARTÍN MOYOBAMBA HABANA",{"$f":"IF(AND(ING!$D$21=J1775,ING!$V$21=K1775),I1774+1,0)","v":0},"SAN MARTÍN","MOYOBAMBA","HABANA","220103"]
[null,null,null,null,null,null,null,"SAN MARTÍN MOYOBAMBA JEPELACIO",{"$f":"IF(AND(ING!$D$21=J1776,ING!$V$21=K1776),I1775+1,0)","v":0},"SAN MARTÍN","MOYOBAMBA","JEPELACIO","220104"]
[null,null,null,null,null,null,null,"SAN MARTÍN MOYOBAMBA MOYOBAMBA",{"$f":"IF(AND(ING!$D$21=J1777,ING!$V$21=K1777),I1776+1,0)","v":0},"SAN MARTÍN","MOYOBAMBA","MOYOBAMBA","220101"]
[null,null,null,null,null,null,null,"SAN MARTÍN MOYOBAMBA SORITOR",{"$f":"IF(AND(ING!$D$21=J1778,ING!$V$21=K1778),I1777+1,0)","v":0},"SAN MARTÍN","MOYOBAMBA","SORITOR","220105"]
[null,null,null,null,null,null,null,"SAN MARTÍN MOYOBAMBA YANTALO",{"$f":"IF(AND(ING!$D$21=J1779,ING!$V$21=K1779),I1778+1,0)","v":0},"SAN MARTÍN","MOYOBAMBA","YANTALO","220106"]
[null,null,null,null,null,null,null,"SAN MARTÍN PICOTA BUENOS AIRES",{"$f":"IF(AND(ING!$D$21=J1780,ING!$V$21=K1780),I1779+1,0)","v":0},"SAN MARTÍN","PICOTA","BUENOS AIRES","220702"]
[null,null,null,null,null,null,null,"SAN MARTÍN PICOTA CASPISAPA",{"$f":"IF(AND(ING!$D$21=J1781,ING!$V$21=K1781),I1780+1,0)","v":0},"SAN MARTÍN","PICOTA","CASPISAPA","220703"]
[null,null,null,null,null,null,null,"SAN MARTÍN PICOTA PICOTA",{"$f":"IF(AND(ING!$D$21=J1782,ING!$V$21=K1782),I1781+1,0)","v":0},"SAN MARTÍN","PICOTA","PICOTA","220701"]
[null,null,null,null,null,null,null,"SAN MARTÍN PICOTA PILLUANA",{"$f":"IF(AND(ING!$D$21=J1783,ING!$V$21=K1783),I1782+1,0)","v":0},"SAN MARTÍN","PICOTA","PILLUANA","220704"]
[null,null,null,null,null,null,null,"SAN MARTÍN PICOTA PUCACACA",{"$f":"IF(AND(ING!$D$21=J1784,ING!$V$21=K1784),I1783+1,0)","v":0},"SAN MARTÍN","PICOTA","PUCACACA","220705"]
[null,null,null,null,null,null,null,"SAN MARTÍN PICOTA SAN CRISTOBAL",{"$f":"IF(AND(ING!$D$21=J1785,ING!$V$21=K1785),I1784+1,0)","v":0},"SAN MARTÍN","PICOTA","SAN CRISTOBAL","220706"]
[null,null,null,null,null,null,null,"SAN MARTÍN PICOTA SAN HILARION",{"$f":"IF(AND(ING!$D$21=J1786,ING!$V$21=K1786),I1785+1,0)","v":0},"SAN MARTÍN","PICOTA","SAN HILARION","220707"]
[null,null,null,null,null,null,null,"SAN MARTÍN PICOTA SHAMBOYACU",{"$f":"IF(AND(ING!$D$21=J1787,ING!$V$21=K1787),I1786+1,0)","v":0},"SAN MARTÍN","PICOTA","SHAMBOYACU","220708"]
[null,null,null,null,null,null,null,"SAN MARTÍN PICOTA TINGO DE PONASA",{"$f":"IF(AND(ING!$D$21=J1788,ING!$V$21=K1788),I1787+1,0)","v":0},"SAN MARTÍN","PICOTA","TINGO DE PONASA","220709"]
[null,null,null,null,null,null,null,"SAN MARTÍN PICOTA TRES UNIDOS",{"$f":"IF(AND(ING!$D$21=J1789,ING!$V$21=K1789),I1788+1,0)","v":0},"SAN MARTÍN","PICOTA","TRES UNIDOS","220710"]
[null,null,null,null,null,null,null,"SAN MARTÍN RIOJA AWAJUN",{"$f":"IF(AND(ING!$D$21=J1790,ING!$V$21=K1790),I1789+1,0)","v":0},"SAN MARTÍN","RIOJA","AWAJUN","220802"]
[null,null,null,null,null,null,null,"SAN MARTÍN RIOJA ELIAS SOPLIN VARGAS",{"$f":"IF(AND(ING!$D$21=J1791,ING!$V$21=K1791),I1790+1,0)","v":0},"SAN MARTÍN","RIOJA","ELIAS SOPLIN VARGAS","220803"]
[null,null,null,null,null,null,null,"SAN MARTÍN RIOJA NUEVA CAJAMARCA",{"$f":"IF(AND(ING!$D$21=J1792,ING!$V$21=K1792),I1791+1,0)","v":0},"SAN MARTÍN","RIOJA","NUEVA CAJAMARCA","220804"]
[null,null,null,null,null,null,null,"SAN MARTÍN RIOJA PARDO MIGUEL",{"$f":"IF(AND(ING!$D$21=J1793,ING!$V$21=K1793),I1792+1,0)","v":0},"SAN MARTÍN","RIOJA","PARDO MIGUEL","220805"]
[null,null,null,null,null,null,null,"SAN MARTÍN RIOJA POSIC",{"$f":"IF(AND(ING!$D$21=J1794,ING!$V$21=K1794),I1793+1,0)","v":0},"SAN MARTÍN","RIOJA","POSIC","220806"]
[null,null,null,null,null,null,null,{"$f":"J1795&\" \"&K1795&\" \"&L1795","v":"SAN MARTÍN RIOJA RIOJA"},{"$f":"IF(AND(ING!$D$21=J1795,ING!$V$21=K1795),I1794+1,0)","v":0},"SAN MARTÍN","RIOJA","RIOJA","220801"]
[null,null,null,null,null,null,null,"SAN MARTÍN RIOJA SAN FERNANDO",{"$f":"IF(AND(ING!$D$21=J1796,ING!$V$21=K1796),I1795+1,0)","v":0},"SAN MARTÍN","RIOJA","SAN FERNANDO","220807"]
[null,null,null,null,null,null,null,"SAN MARTÍN RIOJA YORONGOS",{"$f":"IF(AND(ING!$D$21=J1797,ING!$V$21=K1797),I1796+1,0)","v":0},"SAN MARTÍN","RIOJA","YORONGOS","220808"]
[null,null,null,null,null,null,null,"SAN MARTÍN RIOJA YURACYACU",{"$f":"IF(AND(ING!$D$21=J1798,ING!$V$21=K1798),I1797+1,0)","v":0},"SAN MARTÍN","RIOJA","YURACYACU","220809"]
[null,null,null,null,null,null,null,"SAN MARTÍN SAN MARTIN ALBERTO LEVEAU",{"$f":"IF(AND(ING!$D$21=J1799,ING!$V$21=K1799),I1798+1,0)","v":0},"SAN MARTÍN","SAN MARTIN","ALBERTO LEVEAU","220902"]
[null,null,null,null,null,null,null,"SAN MARTÍN SAN MARTIN CACATACHI",{"$f":"IF(AND(ING!$D$21=J1800,ING!$V$21=K1800),I1799+1,0)","v":0},"SAN MARTÍN","SAN MARTIN","CACATACHI","220903"]
[null,null,null,null,null,null,null,"SAN MARTÍN SAN MARTIN CHAZUTA",{"$f":"IF(AND(ING!$D$21=J1801,ING!$V$21=K1801),I1800+1,0)","v":0},"SAN MARTÍN","SAN MARTIN","CHAZUTA","220904"]
[null,null,null,null,null,null,null,"SAN MARTÍN SAN MARTIN CHIPURANA",{"$f":"IF(AND(ING!$D$21=J1802,ING!$V$21=K1802),I1801+1,0)","v":0},"SAN MARTÍN","SAN MARTIN","CHIPURANA","220905"]
[null,null,null,null,null,null,null,"SAN MARTÍN SAN MARTIN EL PORVENIR",{"$f":"IF(AND(ING!$D$21=J1803,ING!$V$21=K1803),I1802+1,0)","v":0},"SAN MARTÍN","SAN MARTIN","EL PORVENIR","220906"]
[null,null,null,null,null,null,null,"SAN MARTÍN SAN MARTIN HUIMBAYOC",{"$f":"IF(AND(ING!$D$21=J1804,ING!$V$21=K1804),I1803+1,0)","v":0},"SAN MARTÍN","SAN MARTIN","HUIMBAYOC","220907"]
[null,null,null,null,null,null,null,"SAN MARTÍN SAN MARTIN JUAN GUERRA",{"$f":"IF(AND(ING!$D$21=J1805,ING!$V$21=K1805),I1804+1,0)","v":0},"SAN MARTÍN","SAN MARTIN","JUAN GUERRA","220908"]
[null,null,null,null,null,null,null,"SAN MARTÍN SAN MARTIN LA BANDA DE SHILCAYO",{"$f":"IF(AND(ING!$D$21=J1806,ING!$V$21=K1806),I1805+1,0)","v":0},"SAN MARTÍN","SAN MARTIN","LA BANDA DE SHILCAYO","220909"]
[null,null,null,null,null,null,null,"SAN MARTÍN SAN MARTIN MORALES",{"$f":"IF(AND(ING!$D$21=J1807,ING!$V$21=K1807),I1806+1,0)","v":0},"SAN MARTÍN","SAN MARTIN","MORALES","220910"]
[null,null,null,null,null,null,null,"SAN MARTÍN SAN MARTIN PAPAPLAYA",{"$f":"IF(AND(ING!$D$21=J1808,ING!$V$21=K1808),I1807+1,0)","v":0},"SAN MARTÍN","SAN MARTIN","PAPAPLAYA","220911"]
[null,null,null,null,null,null,null,"SAN MARTÍN SAN MARTIN SAN ANTONIO",{"$f":"IF(AND(ING!$D$21=J1809,ING!$V$21=K1809),I1808+1,0)","v":0},"SAN MARTÍN","SAN MARTIN","SAN ANTONIO","220912"]
[null,null,null,null,null,null,null,"SAN MARTÍN SAN MARTIN SAUCE",{"$f":"IF(AND(ING!$D$21=J1810,ING!$V$21=K1810),I1809+1,0)","v":0},"SAN MARTÍN","SAN MARTIN","SAUCE","220913"]
[null,null,null,null,null,null,null,"SAN MARTÍN SAN MARTIN SHAPAJA",{"$f":"IF(AND(ING!$D$21=J1811,ING!$V$21=K1811),I1810+1,0)","v":0},"SAN MARTÍN","SAN MARTIN","SHAPAJA","220914"]
[null,null,null,null,null,null,null,"SAN MARTÍN SAN MARTIN TARAPOTO",{"$f":"IF(AND(ING!$D$21=J1812,ING!$V$21=K1812),I1811+1,0)","v":0},"SAN MARTÍN","SAN MARTIN","TARAPOTO","220901"]
[null,null,null,null,null,null,null,"SAN MARTÍN TOCACHE NUEVO PROGRESO",{"$f":"IF(AND(ING!$D$21=J1813,ING!$V$21=K1813),I1812+1,0)","v":0},"SAN MARTÍN","TOCACHE","NUEVO PROGRESO","221002"]
[null,null,null,null,null,null,null,"SAN MARTÍN TOCACHE POLVORA",{"$f":"IF(AND(ING!$D$21=J1814,ING!$V$21=K1814),I1813+1,0)","v":0},"SAN MARTÍN","TOCACHE","POLVORA","221003"]
[null,null,null,null,null,null,null,"SAN MARTÍN TOCACHE SHUNTE",{"$f":"IF(AND(ING!$D$21=J1815,ING!$V$21=K1815),I1814+1,0)","v":0},"SAN MARTÍN","TOCACHE","SHUNTE","221004"]
[null,null,null,null,null,null,null,"SAN MARTÍN TOCACHE TOCACHE",{"$f":"IF(AND(ING!$D$21=J1816,ING!$V$21=K1816),I1815+1,0)","v":0},"SAN MARTÍN","TOCACHE","TOCACHE","221001"]
[null,null,null,null,null,null,null,"SAN MARTÍN TOCACHE UCHIZA",{"$f":"IF(AND(ING!$D$21=J1817,ING!$V$21=K1817),I1816+1,0)","v":0},"SAN MARTÍN","TOCACHE","UCHIZA","221005"]
[null,null,null,null,null,null,null,"TACNA CANDARAVE CAIRANI",{"$f":"IF(AND(ING!$D$21=J1818,ING!$V$21=K1818),I1817+1,0)","v":0},"TACNA","CANDARAVE","CAIRANI","230202"]
[null,null,null,null,null,null,null,"TACNA CANDARAVE CAMILACA",{"$f":"IF(AND(ING!$D$21=J1819,ING!$V$21=K1819),I1818+1,0)","v":0},"TACNA","CANDARAVE","CAMILACA","230203"]
[null,null,null,null,null,null,null,"TACNA CANDARAVE CANDARAVE",{"$f":"IF(AND(ING!$D$21=J1820,ING!$V$21=K1820),I1819+1,0)","v":0},"TACNA","CANDARAVE","CANDARAVE","230201"]
[null,null,null,null,null,null,null,"TACNA CANDARAVE CURIBAYA",{"$f":"IF(AND(ING!$D$21=J1821,ING!$V$21=K1821),I1820+1,0)","v":0},"TACNA","CANDARAVE","CURIBAYA","230204"]
[null,null,null,null,null,null,null,"TACNA CANDARAVE HUANUARA",{"$f":"IF(AND(ING!$D$21=J1822,ING!$V$21=K1822),I1821+1,0)","v":0},"TACNA","CANDARAVE","HUANUARA","230205"]
[null,null,null,null,null,null,null,"TACNA CANDARAVE QUILAHUANI",{"$f":"IF(AND(ING!$D$21=J1823,ING!$V$21=K1823),I1822+1,0)","v":0},"TACNA","CANDARAVE","QUILAHUANI","230206"]
[null,null,null,null,null,null,null,"TACNA JORGE BASADRE ILABAYA",{"$f":"IF(AND(ING!$D$21=J1824,ING!$V$21=K1824),I1823+1,0)","v":0},"TACNA","JORGE BASADRE","ILABAYA","230302"]
[null,null,null,null,null,null,null,"TACNA JORGE BASADRE ITE",{"$f":"IF(AND(ING!$D$21=J1825,ING!$V$21=K1825),I1824+1,0)","v":0},"TACNA","JORGE BASADRE","ITE","230303"]
[null,null,null,null,null,null,null,"TACNA JORGE BASADRE LOCUMBA",{"$f":"IF(AND(ING!$D$21=J1826,ING!$V$21=K1826),I1825+1,0)","v":0},"TACNA","JORGE BASADRE","LOCUMBA","230301"]
[null,null,null,null,null,null,null,"TACNA TACNA ALTO DE LA ALIANZA",{"$f":"IF(AND(ING!$D$21=J1827,ING!$V$21=K1827),I1826+1,0)","v":0},"TACNA","TACNA","ALTO DE LA ALIANZA","230102"]
[null,null,null,null,null,null,null,"TACNA TACNA CALANA",{"$f":"IF(AND(ING!$D$21=J1828,ING!$V$21=K1828),I1827+1,0)","v":0},"TACNA","TACNA","CALANA","230103"]
[null,null,null,null,null,null,null,"TACNA TACNA CIUDAD NUEVA",{"$f":"IF(AND(ING!$D$21=J1829,ING!$V$21=K1829),I1828+1,0)","v":0},"TACNA","TACNA","CIUDAD NUEVA","230104"]
[null,null,null,null,null,null,null,"TACNA TACNA CORONEL GREGORIO ALBARRACIN LANCHIPA",{"$f":"IF(AND(ING!$D$21=J1830,ING!$V$21=K1830),I1829+1,0)","v":0},"TACNA","TACNA","CORONEL GREGORIO ALBARRACIN LANCHIPA","230110"]
[null,null,null,null,null,null,null,"TACNA TACNA INCLAN",{"$f":"IF(AND(ING!$D$21=J1831,ING!$V$21=K1831),I1830+1,0)","v":0},"TACNA","TACNA","INCLAN","230105"]
[null,null,null,null,null,null,null,"TACNA TACNA LA YARADA LOS PALOS",{"$f":"IF(AND(ING!$D$21=J1832,ING!$V$21=K1832),I1831+1,0)","v":0},"TACNA","TACNA","LA YARADA LOS PALOS","230111"]
[null,null,null,null,null,null,null,"TACNA TACNA PACHIA",{"$f":"IF(AND(ING!$D$21=J1833,ING!$V$21=K1833),I1832+1,0)","v":0},"TACNA","TACNA","PACHIA","230106"]
[null,null,null,null,null,null,null,"TACNA TACNA PALCA",{"$f":"IF(AND(ING!$D$21=J1834,ING!$V$21=K1834),I1833+1,0)","v":0},"TACNA","TACNA","PALCA","230107"]
[null,null,null,null,null,null,null,"TACNA TACNA POCOLLAY",{"$f":"IF(AND(ING!$D$21=J1835,ING!$V$21=K1835),I1834+1,0)","v":0},"TACNA","TACNA","POCOLLAY","230108"]
[null,null,null,null,null,null,null,"TACNA TACNA SAMA",{"$f":"IF(AND(ING!$D$21=J1836,ING!$V$21=K1836),I1835+1,0)","v":0},"TACNA","TACNA","SAMA","230109"]
[null,null,null,null,null,null,null,"TACNA TACNA TACNA",{"$f":"IF(AND(ING!$D$21=J1837,ING!$V$21=K1837),I1836+1,0)","v":0},"TACNA","TACNA","TACNA","230101"]
[null,null,null,null,null,null,null,"TACNA TARATA ESTIQUE",{"$f":"IF(AND(ING!$D$21=J1838,ING!$V$21=K1838),I1837+1,0)","v":0},"TACNA","TARATA","ESTIQUE","230403"]
[null,null,null,null,null,null,null,"TACNA TARATA ESTIQUE-PAMPA",{"$f":"IF(AND(ING!$D$21=J1839,ING!$V$21=K1839),I1838+1,0)","v":0},"TACNA","TARATA","ESTIQUE-PAMPA","230404"]
[null,null,null,null,null,null,null,"TACNA TARATA HEROES ALBARRACIN",{"$f":"IF(AND(ING!$D$21=J1840,ING!$V$21=K1840),I1839+1,0)","v":0},"TACNA","TARATA","HEROES ALBARRACIN","230402"]
[null,null,null,null,null,null,null,"TACNA TARATA SITAJARA",{"$f":"IF(AND(ING!$D$21=J1841,ING!$V$21=K1841),I1840+1,0)","v":0},"TACNA","TARATA","SITAJARA","230405"]
[null,null,null,null,null,null,null,"TACNA TARATA SUSAPAYA",{"$f":"IF(AND(ING!$D$21=J1842,ING!$V$21=K1842),I1841+1,0)","v":0},"TACNA","TARATA","SUSAPAYA","230406"]
[null,null,null,null,null,null,null,"TACNA TARATA TARATA",{"$f":"IF(AND(ING!$D$21=J1843,ING!$V$21=K1843),I1842+1,0)","v":0},"TACNA","TARATA","TARATA","230401"]
[null,null,null,null,null,null,null,"TACNA TARATA TARUCACHI",{"$f":"IF(AND(ING!$D$21=J1844,ING!$V$21=K1844),I1843+1,0)","v":0},"TACNA","TARATA","TARUCACHI","230407"]
[null,null,null,null,null,null,null,"TACNA TARATA TICACO",{"$f":"IF(AND(ING!$D$21=J1845,ING!$V$21=K1845),I1844+1,0)","v":0},"TACNA","TARATA","TICACO","230408"]
[null,null,null,null,null,null,null,"TUMBES CONTRALMIRANTE VILLAR CANOAS DE PUNTA SAL",{"$f":"IF(AND(ING!$D$21=J1846,ING!$V$21=K1846),I1845+1,0)","v":0},"TUMBES","CONTRALMIRANTE VILLAR","CANOAS DE PUNTA SAL","240203"]
[null,null,null,null,null,null,null,"TUMBES CONTRALMIRANTE VILLAR CASITAS",{"$f":"IF(AND(ING!$D$21=J1847,ING!$V$21=K1847),I1846+1,0)","v":0},"TUMBES","CONTRALMIRANTE VILLAR","CASITAS","240202"]
[null,null,null,null,null,null,null,"TUMBES CONTRALMIRANTE VILLAR ZORRITOS",{"$f":"IF(AND(ING!$D$21=J1848,ING!$V$21=K1848),I1847+1,0)","v":0},"TUMBES","CONTRALMIRANTE VILLAR","ZORRITOS","240201"]
[null,null,null,null,null,null,null,"TUMBES TUMBES CORRALES",{"$f":"IF(AND(ING!$D$21=J1849,ING!$V$21=K1849),I1848+1,0)","v":0},"TUMBES","TUMBES","CORRALES","240102"]
[null,null,null,null,null,null,null,"TUMBES TUMBES LA CRUZ",{"$f":"IF(AND(ING!$D$21=J1850,ING!$V$21=K1850),I1849+1,0)","v":0},"TUMBES","TUMBES","LA CRUZ","240103"]
[null,null,null,null,null,null,null,"TUMBES TUMBES PAMPAS DE HOSPITAL",{"$f":"IF(AND(ING!$D$21=J1851,ING!$V$21=K1851),I1850+1,0)","v":0},"TUMBES","TUMBES","PAMPAS DE HOSPITAL","240104"]
[null,null,null,null,null,null,null,"TUMBES TUMBES SAN JACINTO",{"$f":"IF(AND(ING!$D$21=J1852,ING!$V$21=K1852),I1851+1,0)","v":0},"TUMBES","TUMBES","SAN JACINTO","240105"]
[null,null,null,null,null,null,null,"TUMBES TUMBES SAN JUAN DE LA VIRGEN",{"$f":"IF(AND(ING!$D$21=J1853,ING!$V$21=K1853),I1852+1,0)","v":0},"TUMBES","TUMBES","SAN JUAN DE LA VIRGEN","240106"]
[null,null,null,null,null,null,null,"TUMBES TUMBES TUMBES",{"$f":"IF(AND(ING!$D$21=J1854,ING!$V$21=K1854),I1853+1,0)","v":0},"TUMBES","TUMBES","TUMBES","240101"]
[null,null,null,null,null,null,null,"TUMBES ZARUMILLA AGUAS VERDES",{"$f":"IF(AND(ING!$D$21=J1855,ING!$V$21=K1855),I1854+1,0)","v":0},"TUMBES","ZARUMILLA","AGUAS VERDES","240302"]
[null,null,null,null,null,null,null,"TUMBES ZARUMILLA MATAPALO",{"$f":"IF(AND(ING!$D$21=J1856,ING!$V$21=K1856),I1855+1,0)","v":0},"TUMBES","ZARUMILLA","MATAPALO","240303"]
[null,null,null,null,null,null,null,"TUMBES ZARUMILLA PAPAYAL",{"$f":"IF(AND(ING!$D$21=J1857,ING!$V$21=K1857),I1856+1,0)","v":0},"TUMBES","ZARUMILLA","PAPAYAL","240304"]
[null,null,null,null,null,null,null,"TUMBES ZARUMILLA ZARUMILLA",{"$f":"IF(AND(ING!$D$21=J1858,ING!$V$21=K1858),I1857+1,0)","v":0},"TUMBES","ZARUMILLA","ZARUMILLA","240301"]
[null,null,null,null,null,null,null,{"$f":"J1859&\" \"&K1859&\" \"&L1859","v":"UCAYALI ATALAYA RAYMONDI"},{"$f":"IF(AND(ING!$D$21=J1859,ING!$V$21=K1859),I1858+1,0)","v":0},"UCAYALI","ATALAYA","RAYMONDI","250201"]
[null,null,null,null,null,null,null,"UCAYALI ATALAYA SEPAHUA",{"$f":"IF(AND(ING!$D$21=J1860,ING!$V$21=K1860),I1859+1,0)","v":0},"UCAYALI","ATALAYA","SEPAHUA","250202"]
[null,null,null,null,null,null,null,"UCAYALI ATALAYA TAHUANIA",{"$f":"IF(AND(ING!$D$21=J1861,ING!$V$21=K1861),I1860+1,0)","v":0},"UCAYALI","ATALAYA","TAHUANIA","250203"]
[null,null,null,null,null,null,null,"UCAYALI ATALAYA YURUA",{"$f":"IF(AND(ING!$D$21=J1862,ING!$V$21=K1862),I1861+1,0)","v":0},"UCAYALI","ATALAYA","YURUA","250204"]
[null,null,null,null,null,null,null,"UCAYALI CORONEL PORTILLO CALLERIA",{"$f":"IF(AND(ING!$D$21=J1863,ING!$V$21=K1863),I1862+1,0)","v":0},"UCAYALI","CORONEL PORTILLO","CALLERIA","250101"]
[null,null,null,null,null,null,null,"UCAYALI CORONEL PORTILLO CAMPOVERDE",{"$f":"IF(AND(ING!$D$21=J1864,ING!$V$21=K1864),I1863+1,0)","v":0},"UCAYALI","CORONEL PORTILLO","CAMPOVERDE","250102"]
[null,null,null,null,null,null,null,{"$f":"J1865&\" \"&K1865&\" \"&L1865","v":"UCAYALI CORONEL PORTILLO IPARIA"},{"$f":"IF(AND(ING!$D$21=J1865,ING!$V$21=K1865),I1864+1,0)","v":0},"UCAYALI","CORONEL PORTILLO","IPARIA","250103"]
[null,null,null,null,null,null,null,"UCAYALI CORONEL PORTILLO MANANTAY",{"$f":"IF(AND(ING!$D$21=J1866,ING!$V$21=K1866),I1865+1,0)","v":0},"UCAYALI","CORONEL PORTILLO","MANANTAY","250107"]
[null,null,null,null,null,null,null,"UCAYALI CORONEL PORTILLO MASISEA",{"$f":"IF(AND(ING!$D$21=J1867,ING!$V$21=K1867),I1866+1,0)","v":0},"UCAYALI","CORONEL PORTILLO","MASISEA","250104"]
[null,null,null,null,null,null,null,"UCAYALI CORONEL PORTILLO NUEVA REQUENA",{"$f":"IF(AND(ING!$D$21=J1868,ING!$V$21=K1868),I1867+1,0)","v":0},"UCAYALI","CORONEL PORTILLO","NUEVA REQUENA","250106"]
[null,null,null,null,null,null,null,"UCAYALI CORONEL PORTILLO YARINACOCHA",{"$f":"IF(AND(ING!$D$21=J1869,ING!$V$21=K1869),I1868+1,0)","v":0},"UCAYALI","CORONEL PORTILLO","YARINACOCHA","250105"]
[null,null,null,null,null,null,null,"UCAYALI PADRE ABAD ALEXANDER VON HUMBOLDT",{"$f":"IF(AND(ING!$D$21=J1870,ING!$V$21=K1870),I1869+1,0)","v":0},"UCAYALI","PADRE ABAD","ALEXANDER VON HUMBOLDT","250305"]
[null,null,null,null,null,null,null,"UCAYALI PADRE ABAD CURIMANA",{"$f":"IF(AND(ING!$D$21=J1871,ING!$V$21=K1871),I1870+1,0)","v":0},"UCAYALI","PADRE ABAD","CURIMANA","250303"]
[null,null,null,null,null,null,null,"UCAYALI PADRE ABAD IRAZOLA",{"$f":"IF(AND(ING!$D$21=J1872,ING!$V$21=K1872),I1871+1,0)","v":0},"UCAYALI","PADRE ABAD","IRAZOLA","250302"]
[null,null,null,null,null,null,null,"UCAYALI PADRE ABAD NESHUYA",{"$f":"IF(AND(ING!$D$21=J1873,ING!$V$21=K1873),I1872+1,0)","v":0},"UCAYALI","PADRE ABAD","NESHUYA","250304"]
[null,null,null,null,null,null,null,"UCAYALI PADRE ABAD PADRE ABAD",{"$f":"IF(AND(ING!$D$21=J1874,ING!$V$21=K1874),I1873+1,0)","v":0},"UCAYALI","PADRE ABAD","PADRE ABAD","250301"]
[null,null,null,null,null,null,null,"UCAYALI PURUS PURUS",{"$f":"IF(AND(ING!$D$21=J1875,ING!$V$21=K1875),I1874+1,0)","v":0},"UCAYALI","PURUS","PURUS","250401"]

{"sheet":"ENVIO","index":12,"n_rows":13,"n_cols":150,"rows_kept":13,"cut":false,"hidden":true,"merged":[]}
[null,"Servidor","198.37.116.16",null,null,135]
[null,"Usuario","ADMINGI",null,null,"AHORA"]
[null,"Contraseña","2016MineduGI",null,null,"2017-11-08T15:39:14.317"]
[null,"Base de datos","GIMINEDU2017"]
[]
[]
[null,"QUERY_TRAE"]
["select CONCAT(IIEE,' (',CODA,')') AS COLE,CODA, COD_MODULAR, ANEXO, COD_LOCAL, IIEE, ESTADO_IIEE, DESC_SEXO, DESC_CAR, COD_UGEL, ESTADO_IIEE, UGEL, DRE, ID_DISTRITO, DISTRITO, PROVINCIA, DEPARTAMENTO, ID_AREA, AREA, ID_NIVEL, NIVEL, ID_GESTION, GESTION, DIRECCION_IIEE, LATITUD, LONGITUD, TALUM_HOM, TALUM_MUJ, TDOCENTE, DESC_TURNO, EIB from IIEE where ID_DISTRITO='",{"$f":"A8&VLOOKUP(IIEE_D&\" \"&IIEE_P&\" \"&IIEE_T,LISTAS!H:M,6,FALSE)&\"' and ID_NIVEL like '\"&VLOOKUP(IIEE_N,LISTAS!B37:C41,2,FALSE)&\"_' and ID_GESTION\"&VLOOKUP(IIEE_G,LISTAS!B31:C32,2,FALSE)&\"3\"","v":"select CONCAT(IIEE,' (',CODA,')') AS COLE,CODA, COD_MODULAR, ANEXO, COD_LOCAL, IIEE, ESTADO_IIEE, DESC_SEXO, DESC_CAR, COD_UGEL, ESTADO_IIEE, UGEL, DRE, ID_DISTRITO, DISTRITO, PROVINCIA, DEPARTAMENTO, ID_AREA, AREA, ID_NIVEL, NIVEL, ID_GESTION, GESTION, DIRECCION_IIEE, LATITUD, LONGITUD, TALUM_HOM, TALUM_MUJ, TDOCENTE, DESC_TURNO, EIB from IIEE where ID_DISTRITO='060901' and ID_NIVEL like 'B_' and ID_GESTION<>3"}]
[]
[]
[null,"ENVIAR INFORMACIÓN",null,200,200,200,200,200,3,3,3,3,11,11,11,11,200,200,200,11,11,11,11,11,11,11,11,11,11,11,11,11,11,11,11,11,11,11,11,11,11,11,11,11,11,11,11,11,11,11,11,11,11,11,11,11,11,11,11,11,11,11,11,11,11,11,11,11,11,11,11,11,11,11,11,11,11,11,11,11,11,11,11,11,11,11,11,11,11,11,11,11,11,11,11,11,11,11,11,11,11,11,11,11,11,11,11,11,11,200,11,11,11,11,11,200,11,11,11,11,11,200,200,200,200,200,200,200,200,200,200,200,200,200,200,200,200,200,200,200,200,200,200,5,200]
[null,null,null,"CODA","NOMBRES","APELLIDOS","TELEFONO","CORREO","EST_H","EST_M","DOC_H","DOC_M","NIV","NIVI","NIVP","NIVS","NIVI_CM","NIVP_CM","NIVS_CM","PE","PEA","PEB","PEC","PED","QW","QWA","QWB","QWC","QWD","P01A","P01B","P01C","P01D","P02A","P02B","P02C","P03A","P03B","P03C","P03D","P04A","P04B","P04C","P04D","P05A","P05B","P05C","P05D","P06A","P06B","P06C","P06D","P07A","P07B","P07C","P08A","P08B","P08C","P08D","P09A","P09B","P09C","P09D","P10A","P10B","P10C","P10D","P11A","P11B","P11C","P11D","P12A","P12B","P12C","P12D","P13A","P13B","P13C","P13D","PAI1","PAI1A","PAI1B","PAI1C","PAI1D","PAI2","PAI2A","PAI2B","PAI2C","PAI2D","PAI3","PAI3A","PAI3B","PAI3C","PAI3D","PAI4","PAI4A","PAI4B","PAI4C","PAI4D","PAI5","PAI5A","PAI5B","PAI5C","PAI5D","PAI6","PAI6A","PAI6B","PAI6C","PAI6D","PAI6N","PAI7","PAI7A","PAI7B","PAI7C","PAI7D","PAI7N","PAI8","PAI8A","PAI8B","PAI8C","PAI8D","PAI8N","ACT01","ACT02","ACT03","ACT04","ACT05","ACT06","ACT07","ACT08","ACT09","ACT10","ACT11","ACT12","ACT13","APEAI01","APEAI02","APEAI03","APEAI04","APEAI05","APEAI06","APEAI07","APEAI08","RESP","LOGRO",null,null,null,"INSERT INTO AMBIENTAL (CODA, NOMBRES, APELLIDOS, TELEFONO, CORREO, EST_H, EST_M, DOC_H, DOC_M, PE, PEA, PEB, PEC, PED, QW, QWA, QWB, QWC, QWD, P01A, P01B, P01C, P01D, P02A, P02B, P02C, P03A, P03B, P03C, P03D, P04A, P04B, P04C, P04D, P05A, P05B, P05C, P05D, P06A, P06B, P06C, P06D, P07A, P07B, P07C, P08A, P08B, P08C, P08D, P09A, P09B, P09C, P09D, P10A, P10B, P10C, P10D, P11A, P11B, P11C, P11D, P12A, P12B, P12C, P12D, P13A, P13B, P13C, P13D, PAI1, PAI1A, PAI1B, PAI1C, PAI1D, PAI2, PAI2A, PAI2B, PAI2C, PAI2D, PAI3, PAI3A, PAI3B, PAI3C, PAI3D, PAI4, PAI4A, PAI4B, PAI4C, PAI4D, PAI5, PAI5A, PAI5B, PAI5C, PAI5D, PAI6, PAI6A, PAI6B, PAI6C, PAI6D, PAI6N, ACT01, ACT02, ACT03, ACT04, ACT05, ACT06, ACT07, ACT08, ACT09, ACT10, ACT11, ACT12, ACT13, APEAI01, APEAI02, APEAI03, APEAI04, APEAI05, APEAI06, RESP, LOGRO, FECHA) VALUES ","UPDATE AMBIENTAL SET "]
[null,{"$f":"NOT(OR(D13=\"\",E13=\"\",F13=\"\"))","v":false},null,{"$f":"IF(ING!D29=\"\",\"\",ING!D29&0)","v":""},{"$f":"IF(DIR_N=\"\",\"\",DIR_N)","v":"IVETH"},{"$f":"IF(DIR_A=\"\",\"\",DIR_A)","v":"LUDEÑA QUINDE"},{"$f":"IF(DIR_T=\"\",\"\",DIR_T)","v":970031089},{"$f":"IF(DIR_E=\"\",\"\",DIR_E)","v":"ivecita_869@hotmail.com"},{"$f":"IF(ING!AL29=\"\",\"\",ING!AL29)","v":9},{"$f":"IF(ING!AO29=\"\",\"\",ING!AO29)","v":8},{"$f":"IF(ING!AR29=\"\",\"\",ING!AR29)","v":0},{"$f":"IF(ING!AU29=\"\",\"\",ING!AU29)","v":1},{"$f":"ING!AQ33=1","v":false},{"$f":"ING!R37","v":false},{"$f":"ING!Z37","v":false},{"$f":"ING!AH37","v":false},{"$f":"IF(ING!L37=\"\",\"\",ING!L37)","v":""},{"$f":"IF(ING!T37=\"\",\"\",ING!T37)","v":""},{"$f":"IF(ING!AB37=\"\",\"\",ING!AB37)","v":""},{"$f":"ADI!AM10=1","v":false},{"$f":"IF($T$13=TRUE,ADI!$I19=\"SI\")","v":false},{"$f":"IF(T13=TRUE,ADI!$O19=\"SI\")","v":false},{"$f":"IF(T13=TRUE,ADI!$U19=\"SI\")","v":false},{"$f":"IF(T13=TRUE,ADI!$AA19=\"SI\")","v":false},{"$f":"ADI!AM25=1","v":false},{"$f":"IF(Y13=TRUE,ADI!$I34=\"SI\")","v":false},{"$f":"IF(Y13=TRUE,ADI!$O34=\"SI\")","v":false},{"$f":"IF(Y13=TRUE,ADI!$U34=\"SI\")","v":false},{"$f":"IF(Y13=TRUE,ADI!$AA34=\"SI\")","v":false},{"$f":"'MOD1'!I20=\"SI\"","v":false},{"$f":"'MOD1'!O20=\"SI\"","v":false},{"$f":"'MOD1'!U20=\"SI\"","v":false},{"$f":"'MOD1'!AA20=\"SI\"","v":false},{"$f":"'MOD1'!I36=\"SI\"","v":false},{"$f":"'MOD1'!Q36=\"SI\"","v":false},{"$f":"'MOD1'!Y36=\"SI\"","v":false},{"$f":"'MOD1'!I52=\"SI\"","v":false},{"$f":"'MOD1'!O52=\"SI\"","v":false},{"$f":"'MOD1'!U52=\"SI\"","v":false},{"$f":"'MOD1'!AA52=\"SI\"","v":false},{"$f":"'MOD2'!I20=\"SI\"","v":false},{"$f":"'MOD2'!O20=\"SI\"","v":false},{"$f":"'MOD2'!U20=\"SI\"","v":false},{"$f":"'MOD2'!AA20=\"SI\"","v":false},{"$f":"'MOD3'!I20=\"SI\"","v":false},{"$f":"'MOD3'!O20=\"SI\"","v":false},{"$f":"'MOD3'!U20=\"SI\"","v":false},{"$f":"'MOD3'!AA20=\"SI\"","v":false},{"$f":"'MOD3'!I36=\"SI\"","v":false},{"$f":"'MOD3'!O36=\"SI\"","v":false},{"$f":"'MOD3'!U36=\"SI\"","v":false},{"$f":"'MOD3'!AA36=\"SI\"","v":false},{"$f":"'MOD3'!I52=\"SI\"","v":false},{"$f":"'MOD3'!Q52=\"SI\"","v":false},{"$f":"'MOD3'!Y52=\"SI\"","v":false},{"$f":"'MOD3'!I68=\"SI\"","v":false},{"$f":"'MOD3'!O68=\"SI\"","v":false},{"$f":"'MOD3'!U68=\"SI\"","v":false},{"$f":"'MOD3'!AA68=\"SI\"","v":false},{"$f":"'MOD4'!I20=\"SI\"","v":false},{"$f":"'MOD4'!O20=\"SI\"","v":false},{"$f":"'MOD4'!U20=\"SI\"","v":false},{"$f":"'MOD4'!AA20=\"SI\"","v":false},{"$f":"'MOD4'!I36=\"SI\"","v":false},{"$f":"'MOD4'!O36=\"SI\"","v":false},{"$f":"'MOD4'!U36=\"SI\"","v":false},{"$f":"'MOD4'!AA36=\"SI\"","v":false},{"$f":"'MOD4'!I52=\"SI\"","v":false},{"$f":"'MOD4'!O52=\"SI\"","v":false},{"$f":"'MOD4'!U52=\"SI\"","v":false},{"$f":"'MOD4'!AA52=\"SI\"","v":false},{"$f":"'MOD4'!I68=\"SI\"","v":false},{"$f":"'MOD4'!O68=\"SI\"","v":false},{"$f":"'MOD4'!U68=\"SI\"","v":false},{"$f":"'MOD4'!AA68=\"SI\"","v":false},{"$f":"'MOD5'!I20=\"SI\"","v":false},{"$f":"'MOD5'!O20=\"SI\"","v":false},{"$f":"'MOD5'!U20=\"SI\"","v":false},{"$f":"'MOD5'!AA20=\"SI\"","v":false},{"$f":"'MOD6'!$W20=\"SI\"","v":false},{"$f":"'MOD6'!$AA20=\"SI\"","v":false},{"$f":"'MOD6'!$AE20=\"SI\"","v":false},{"$f":"'MOD6'!$AI20=\"SI\"","v":false},{"$f":"'MOD6'!$AM20=\"SI\"","v":false},{"$f":"'MOD6'!W23=\"SI\"","v":false},{"$f":"'MOD6'!$AA23=\"SI\"","v":false},{"$f":"'MOD6'!$AE23=\"SI\"","v":false},{"$f":"'MOD6'!$AI23=\"SI\"","v":false},{"$f":"'MOD6'!$AM23=\"SI\"","v":false},{"$f":"'MOD6'!W26=\"SI\"","v":false},{"$f":"'MOD6'!$AA26=\"SI\"","v":false},{"$f":"'MOD6'!$AE26=\"SI\"","v":false},{"$f":"'MOD6'!$AI26=\"SI\"","v":false},{"$f":"'MOD6'!$AM26=\"SI\"","v":false},{"$f":"'MOD6'!W29=\"SI\"","v":false},{"$f":"'MOD6'!$AA29=\"SI\"","v":false},{"$f":"'MOD6'!$AE29=\"SI\"","v":false},{"$f":"'MOD6'!$AI29=\"SI\"","v":false},{"$f":"'MOD6'!$AM29=\"SI\"","v":false},{"$f":"'MOD6'!W32=\"SI\"","v":false},{"$f":"'MOD6'!$AA32=\"SI\"","v":false},{"$f":"'MOD6'!$AE32=\"SI\"","v":false},{"$f":"'MOD6'!$AI32=\"SI\"","v":false},{"$f":"'MOD6'!$AM32=\"SI\"","v":false},{"$f":"'MOD6'!W35=\"SI\"","v":false},{"$f":"'MOD6'!$AA35=\"SI\"","v":false},{"$f":"'MOD6'!$AE35=\"SI\"","v":false},{"$f":"'MOD6'!$AI35=\"SI\"","v":false},{"$f":"'MOD6'!$AM35=\"SI\"","v":false},{"$f":"IF('MOD6'!K35=\"\",\"\",'MOD6'!K35)","v":""},{"$f":"'MOD6'!W38=\"SI\"","v":false},{"$f":"'MOD6'!$AA38=\"SI\"","v":false},{"$f":"'MOD6'!$AE38=\"SI\"","v":false},{"$f":"'MOD6'!$AI38=\"SI\"","v":false},{"$f":"'MOD6'!$AM38=\"SI\"","v":false},{"$f":"IF('MOD6'!K38=\"\",\"\",'MOD6'!K38)","v":""},{"$f":"'MOD6'!W41=\"SI\"","v":false},{"$f":"'MOD6'!$AA41=\"SI\"","v":false},{"$f":"'MOD6'!$AE41=\"SI\"","v":false},{"$f":"'MOD6'!$AI41=\"SI\"","v":false},{"$f":"'MOD6'!$AM41=\"SI\"","v":false},{"$f":"IF('MOD6'!K41=\"\",\"\",'MOD6'!K41)","v":""},{"$f":"IF('MOD1'!$AM12=\"\",\"\",'MOD1'!$AM12)","v":""},{"$f":"IF('MOD1'!$AM28=\"\",\"\",'MOD1'!$AM28)","v":""},{"$f":"IF('MOD1'!$AM44=\"\",\"\",'MOD1'!$AM44)","v":""},{"$f":"IF('MOD2'!$AM12=\"\",\"\",'MOD2'!$AM12)","v":""},{"$f":"IF('MOD3'!$AM12=\"\",\"\",'MOD3'!$AM12)","v":""},{"$f":"IF('MOD3'!$AM28=\"\",\"\",'MOD3'!$AM28)","v":""},{"$f":"IF('MOD3'!$AM44=\"\",\"\",'MOD3'!$AM44)","v":""},{"$f":"IF('MOD3'!$AM60=\"\",\"\",'MOD3'!$AM60)","v":""},{"$f":"IF('MOD4'!$AM12=\"\",\"\",'MOD4'!$AM12)","v":""},{"$f":"IF('MOD4'!$AM28=\"\",\"\",'MOD4'!$AM28)","v":""},{"$f":"IF('MOD4'!$AM44=\"\",\"\",'MOD4'!$AM44)","v":""},{"$f":"IF('MOD4'!$AM60=\"\",\"\",'MOD4'!$AM60)","v":""},{"$f":"IF('MOD5'!$AM12=\"\",\"\",'MOD5'!$AM12)","v":""},{"$f":"IF('MOD6'!$AQ20=\"\",\"\",'MOD6'!$AQ20)","v":""},{"$f":"IF('MOD6'!$AQ23=\"\",\"\",'MOD6'!$AQ23)","v":""},{"$f":"IF('MOD6'!$AQ26=\"\",\"\",'MOD6'!$AQ26)","v":""},{"$f":"IF('MOD6'!$AQ29=\"\",\"\",'MOD6'!$AQ29)","v":""},{"$f":"IF('MOD6'!$AQ32=\"\",\"\",'MOD6'!$AQ32)","v":""},{"$f":"IF('MOD6'!$AQ35=\"\",\"\",'MOD6'!$AQ35)","v":""},{"$f":"IF('MOD6'!$AQ38=\"\",\"\",'MOD6'!$AQ38)","v":""},{"$f":"IF('MOD6'!$AQ41=\"\",\"\",'MOD6'!$AQ41)","v":""},{"$f":"IF(CONFIRM!P44=\"\",\"\",CONFIRM!P44)","v":0},{"$f":"IF(CONFIRM!AD44=\"\",\"\",CONFIRM!AD44)","v":"Por iniciar"},null,null,null,"('02380550', 'WERTWERT', 'DRSERGWER', 'RTWEQRTWER', 'ERTGWERT', Null, Null, Null, Null, 0, 0, 0, 0, 0, 0, 1, 0, 1, 1, 0, 0, 0, 0, 0, 0, 0, 0, 0, 0, 0, 0, 0, 0, 0, 0, 0, 0, 0, 0, 0, 0, 0, 0, 0, 0, 0, 0, 0, 0, 0, 0, 0, 0, 0, 0, 0, 0, 0, 0, 0, 0, 0, 0, 0, 0, 0, 0, 0, 0, 0, 0, 0, 0, 0, 0, 0, 0, 0, 0, 0, 0, 0, 0, 0, 0, 0, 0, 0, 0, 0, 0, 0, 0, 0, 0, 0, 0, 0, 0, Null, Null, Null, Null, Null, Null, Null, Null, Null, Null, Null, Null, Null, Null, Null, Null, Null, Null, Null, Null, '0', 'Por iniciar',GETDATE())","NOMBRES = 'WERTWERT', APELLIDOS = 'DRSERGWER', TELEFONO = 'RTWEQRTWER', CORREO = 'ERTGWERT', EST_H = Null, EST_M = Null, DOC_H = Null, DOC_M = Null, PE = 0, PEA = 0, PEB = 0, PEC = 0, PED = 0, QW = 0, QWA = 1, QWB = 0, QWC = 1, QWD = 1, P01A = 0, P01B = 0, P01C = 0, P01D = 0, P02A = 0, P02B = 0, P02C = 0, P03A = 0, P03B = 0, P03C = 0, P03D = 0, P04A = 0, P04B = 0, P04C = 0, P04D = 0, P05A = 0, P05B = 0, P05C = 0, P05D = 0, P06A = 0, P06B = 0, P06C = 0, P06D = 0, P07A = 0, P07B = 0, P07C = 0, P08A = 0, P08B = 0, P08C = 0, P08D = 0, P09A = 0, P09B = 0, P09C = 0, P09D = 0, P10A = 0, P10B = 0, P10C = 0, P10D = 0, P11A = 0, P11B = 0, P11C = 0, P11D = 0, P12A = 0, P12B = 0, P12C = 0, P12D = 0, P13A = 0, P13B = 0, P13C = 0, P13D = 0, PAI1 = 0, PAI1A = 0, PAI1B = 0, PAI1C = 0, PAI1D = 0, PAI2 = 0, PAI2A = 0, PAI2B = 0, PAI2C = 0, PAI2D = 0, PAI3 = 0, PAI3A = 0, PAI3B = 0, PAI3C = 0, PAI3D = 0, PAI4 = 0, PAI4A = 0, PAI4B = 0, PAI4C = 0, PAI4D = 0, PAI5 = 0, PAI5A = 0, PAI5B = 0, PAI5C = 0, PAI5D = 0, PAI6 = 0, PAI6A = 0, PAI6B = 0, PAI6C = 0, PAI6D = 0, PAI6N = Null, ACT01 = Null, ACT02 = Null, ACT03 = Null, ACT04 = Null, ACT05 = Null, ACT06 = Null, ACT07 = Null, ACT08 = Null, ACT09 = Null, ACT10 = Null, ACT11 = Null, ACT12 = Null, ACT13 = Null, APEAI01 = Null, APEAI02 = Null, APEAI03 = Null, APEAI04 = Null, APEAI05 = Null, APEAI06 = Null, RESP = '0', LOGRO = 'Por iniciar', FECHA=GETDATE() where CODA = '02380550'"]